streams-commits mailing list archives

Site index · List index
Message view « Date » · « Thread »
Top « Date » · « Thread »
From Apache Jenkins Server <jenk...@builds.apache.org>
Subject Build failed in Jenkins: streams-examples-site #89
Date Mon, 20 Mar 2017 19:02:50 GMT
See <https://builds.apache.org/job/streams-examples-site/89/display/redirect?page=changes>

Changes:

[smarthi] STREAMS-497: Add streams prefix to project and examples artifactIds,

------------------------------------------
Started by an SCM change
[EnvInject] - Loading node environment variables.
Building remotely on H18 (ubuntu) in workspace <https://builds.apache.org/job/streams-examples-site/ws/>
Wiping out workspace first.
Cloning the remote Git repository
Cloning repository https://git-wip-us.apache.org/repos/asf/incubator-streams-examples.git
 > git init <https://builds.apache.org/job/streams-examples-site/ws/> # timeout=10
Fetching upstream changes from https://git-wip-us.apache.org/repos/asf/incubator-streams-examples.git
 > git --version # timeout=10
 > git fetch --tags --progress https://git-wip-us.apache.org/repos/asf/incubator-streams-examples.git
+refs/heads/*:refs/remotes/origin/*
 > git config remote.origin.url https://git-wip-us.apache.org/repos/asf/incubator-streams-examples.git
# timeout=10
 > git config --add remote.origin.fetch +refs/heads/*:refs/remotes/origin/* # timeout=10
 > git config remote.origin.url https://git-wip-us.apache.org/repos/asf/incubator-streams-examples.git
# timeout=10
Cleaning workspace
 > git rev-parse --verify HEAD # timeout=10
No valid HEAD. Skipping the resetting
 > git clean -fdx # timeout=10
Fetching upstream changes from https://git-wip-us.apache.org/repos/asf/incubator-streams-examples.git
 > git fetch --tags --progress https://git-wip-us.apache.org/repos/asf/incubator-streams-examples.git
+refs/heads/*:refs/remotes/origin/*
 > git rev-parse origin/master^{commit} # timeout=10
Checking out Revision eec2bcd9277c834bdd540df5a6cb98c49ff08856 (origin/master)
 > git config core.sparsecheckout # timeout=10
 > git checkout -f eec2bcd9277c834bdd540df5a6cb98c49ff08856
 > git rev-list 57b6784f7f8f53f2857d06f854c20f2dd456e48f # timeout=10
Parsing POMs
using settings config with name simple-deploy-settings-no-mirror
Replacing all maven server entries not found in credentials list is true
Downloaded artifact https://repository.apache.org/content/repositories/snapshots/org/apache/streams/streams-project/0.5.1-incubating-SNAPSHOT/maven-metadata.xml
Downloaded artifact https://repository.apache.org/content/repositories/snapshots/org/apache/streams/streams-project/0.5.1-incubating-SNAPSHOT/streams-project-0.5.1-incubating-20170226.230032-3.pom
Downloaded artifact https://repository.apache.org/snapshots/org/apache/streams/streams-project/0.5.1-incubating-SNAPSHOT/maven-metadata.xml
Discovered a new module org.apache.streams:streams-flink-twitter-collection flink-twitter-collection
Discovered a new module org.apache.streams:streams-elasticsearch-hdfs elasticsearch-hdfs
Discovered a new module org.apache.streams:streams-elasticsearch-reindex elasticsearch-reindex
Discovered a new module org.apache.streams:streams-mongo-elasticsearch-sync mongo-elasticsearch-sync
Discovered a new module org.apache.streams:streams-twitter-follow-neo4j twitter-follow-neo4j
Discovered a new module org.apache.streams:streams-twitter-history-elasticsearch twitter-history-elasticsearch
Modules changed, recalculating dependency graph
Established TCP socket on 46369
maven33-agent.jar already up to date
maven33-interceptor.jar already up to date
maven3-interceptor-commons.jar already up to date
[streams-examples-site] $ /home/jenkins/tools/java/latest1.8/bin/java -Xmx2g -Xms256m -XX:MaxPermSize=512m
-Dfile.encoding=UTF-8 -cp /home/jenkins/jenkins-slave/maven33-agent.jar:/home/jenkins/tools/maven/apache-maven-3.3.9/boot/plexus-classworlds-2.5.2.jar:/home/jenkins/tools/maven/apache-maven-3.3.9/conf/logging
jenkins.maven3.agent.Maven33Main /home/jenkins/tools/maven/apache-maven-3.3.9 /home/jenkins/jenkins-slave/slave.jar
/home/jenkins/jenkins-slave/maven33-interceptor.jar /home/jenkins/jenkins-slave/maven3-interceptor-commons.jar
46369
Java HotSpot(TM) 64-Bit Server VM warning: ignoring option MaxPermSize=512m; support was removed
in 8.0
<===[JENKINS REMOTING CAPACITY]===>   channel started
using settings config with name simple-deploy-settings-no-mirror
Replacing all maven server entries not found in credentials list is true
Executing Maven:  -B -f <https://builds.apache.org/job/streams-examples-site/ws/pom.xml>
-Dmaven.repo.local=/home/jenkins/jenkins-slave/maven-repositories/0 -s /tmp/settings3803390697913736274.xml
-q -U generate-sources site:site site:stage
Waiting for Jenkins to finish collecting data
[ERROR] Failed to execute goal org.apache.maven.plugins:maven-checkstyle-plugin:2.17:check
(validate) on project streams-examples: Failed during checkstyle execution: Unable to find
configuration file at location: http://streams.incubator.apache.org/site/latest/streams-master/streams-java-checkstyle.xml:
Could not find resource 'http://streams.incubator.apache.org/site/latest/streams-master/streams-java-checkstyle.xml'.
-> [Help 1]
[ERROR] 
[ERROR] To see the full stack trace of the errors, re-run Maven with the -e switch.
[ERROR] Re-run Maven using the -X switch to enable full debug logging.
[ERROR] 
[ERROR] For more information about the errors and possible solutions, please read the following
articles:
[ERROR] [Help 1] http://cwiki.apache.org/confluence/display/MAVEN/MojoExecutionException
[JENKINS] Archiving <https://builds.apache.org/job/streams-examples-site/ws/local/pom.xml>
to org.apache.streams/streams-examples-local/0.5.1-incubating-SNAPSHOT/streams-examples-local-0.5.1-incubating-SNAPSHOT.pom
[JENKINS] Archiving <https://builds.apache.org/job/streams-examples-site/ws/local/mongo-elasticsearch-sync/pom.xml>
to org.apache.streams/streams-mongo-elasticsearch-sync/0.5.1-incubating-SNAPSHOT/streams-mongo-elasticsearch-sync-0.5.1-incubating-SNAPSHOT.pom
No prior successful build to compare, so performing full copy of artifacts
[JENKINS] Archiving <https://builds.apache.org/job/streams-examples-site/ws/local/elasticsearch-hdfs/pom.xml>
to org.apache.streams/streams-elasticsearch-hdfs/0.5.1-incubating-SNAPSHOT/streams-elasticsearch-hdfs-0.5.1-incubating-SNAPSHOT.pom
No prior successful build to compare, so performing full copy of artifacts
[JENKINS] Archiving <https://builds.apache.org/job/streams-examples-site/ws/local/twitter-userstream-elasticsearch/pom.xml>
to org.apache.streams/twitter-userstream-elasticsearch/0.5.1-incubating-SNAPSHOT/twitter-userstream-elasticsearch-0.5.1-incubating-SNAPSHOT.pom
[JENKINS] Archiving <https://builds.apache.org/job/streams-examples-site/ws/pom.xml>
to org.apache.streams/streams-examples/0.5.1-incubating-SNAPSHOT/streams-examples-0.5.1-incubating-SNAPSHOT.pom
[JENKINS] Archiving <https://builds.apache.org/job/streams-examples-site/ws/flink/pom.xml>
to org.apache.streams/streams-examples-flink/0.5.1-incubating-SNAPSHOT/streams-examples-flink-0.5.1-incubating-SNAPSHOT.pom
[JENKINS] Archiving <https://builds.apache.org/job/streams-examples-site/ws/local/twitter-history-elasticsearch/pom.xml>
to org.apache.streams/streams-twitter-history-elasticsearch/0.5.1-incubating-SNAPSHOT/streams-twitter-history-elasticsearch-0.5.1-incubating-SNAPSHOT.pom
No prior successful build to compare, so performing full copy of artifacts
[JENKINS] Archiving <https://builds.apache.org/job/streams-examples-site/ws/flink/flink-twitter-collection/pom.xml>
to org.apache.streams/streams-flink-twitter-collection/0.5.1-incubating-SNAPSHOT/streams-flink-twitter-collection-0.5.1-incubating-SNAPSHOT.pom
No prior successful build to compare, so performing full copy of artifacts
[JENKINS] Archiving <https://builds.apache.org/job/streams-examples-site/ws/local/twitter-follow-neo4j/pom.xml>
to org.apache.streams/streams-twitter-follow-neo4j/0.5.1-incubating-SNAPSHOT/streams-twitter-follow-neo4j-0.5.1-incubating-SNAPSHOT.pom
No prior successful build to compare, so performing full copy of artifacts
[JENKINS] Archiving <https://builds.apache.org/job/streams-examples-site/ws/local/elasticsearch-reindex/pom.xml>
to org.apache.streams/streams-elasticsearch-reindex/0.5.1-incubating-SNAPSHOT/streams-elasticsearch-reindex-0.5.1-incubating-SNAPSHOT.pom
No prior successful build to compare, so performing full copy of artifacts
channel stopped

Mime
View raw message