streams-commits mailing list archives

Site index · List index
Message view « Date » · « Thread »
Top « Date » · « Thread »
From Apache Jenkins Server <jenk...@builds.apache.org>
Subject Build failed in Jenkins: streams-examples-site #74
Date Tue, 07 Feb 2017 05:01:34 GMT
See <https://builds.apache.org/job/streams-examples-site/74/changes>

Changes:

[smarthi] STREAMS-490: Upgrade Flink to 1.2.0 and remove the remaining guava

------------------------------------------
Started by an SCM change
[EnvInject] - Loading node environment variables.
Building remotely on H12 (ubuntu) in workspace <https://builds.apache.org/job/streams-examples-site/ws/>
Wiping out workspace first.
Cloning the remote Git repository
Cloning repository https://git-wip-us.apache.org/repos/asf/incubator-streams-examples.git
 > git init <https://builds.apache.org/job/streams-examples-site/ws/> # timeout=10
Fetching upstream changes from https://git-wip-us.apache.org/repos/asf/incubator-streams-examples.git
 > git --version # timeout=10
 > git -c core.askpass=true fetch --tags --progress https://git-wip-us.apache.org/repos/asf/incubator-streams-examples.git
+refs/heads/*:refs/remotes/origin/*
 > git config remote.origin.url https://git-wip-us.apache.org/repos/asf/incubator-streams-examples.git
# timeout=10
 > git config --add remote.origin.fetch +refs/heads/*:refs/remotes/origin/* # timeout=10
 > git config remote.origin.url https://git-wip-us.apache.org/repos/asf/incubator-streams-examples.git
# timeout=10
Cleaning workspace
 > git rev-parse --verify HEAD # timeout=10
No valid HEAD. Skipping the resetting
 > git clean -fdx # timeout=10
Fetching upstream changes from https://git-wip-us.apache.org/repos/asf/incubator-streams-examples.git
 > git -c core.askpass=true fetch --tags --progress https://git-wip-us.apache.org/repos/asf/incubator-streams-examples.git
+refs/heads/*:refs/remotes/origin/*
 > git rev-parse origin/master^{commit} # timeout=10
Checking out Revision 8f05fcc4ae9941b9e255b336ba291fb81e1ea369 (origin/master)
 > git config core.sparsecheckout # timeout=10
 > git checkout -f 8f05fcc4ae9941b9e255b336ba291fb81e1ea369
 > git rev-list e834a239875569295e73f0b6da7c5ec97cee870e # timeout=10
Parsing POMs
using settings config with name simple-deploy-settings-no-mirror
Replacing all maven server entries not found in credentials list is true
Downloaded artifact https://repository.apache.org/content/repositories/snapshots/org/apache/streams/streams-project/0.5-incubating-SNAPSHOT/maven-metadata.xml
Downloaded artifact https://repository.apache.org/content/repositories/snapshots/org/apache/streams/streams-project/0.5-incubating-SNAPSHOT/streams-project-0.5-incubating-20170205.043157-45.pom
Downloaded artifact https://repository.apache.org/snapshots/org/apache/streams/streams-project/0.5-incubating-SNAPSHOT/maven-metadata.xml
Modules changed, recalculating dependency graph
Established TCP socket on 41591
maven32-agent.jar already up to date
maven32-interceptor.jar already up to date
maven3-interceptor-commons.jar already up to date
[streams-examples-site] $ /home/jenkins/tools/java/latest1.8/bin/java -Xmx2g -Xms256m -XX:MaxPermSize=512m
-Dfile.encoding=UTF-8 -cp /home/jenkins/jenkins-slave/maven32-agent.jar:/home/jenkins/tools/maven/apache-maven-3.3.9/boot/plexus-classworlds-2.5.2.jar:/home/jenkins/tools/maven/apache-maven-3.3.9/conf/logging
jenkins.maven3.agent.Maven32Main /home/jenkins/tools/maven/apache-maven-3.3.9 /home/jenkins/jenkins-slave/slave.jar
/home/jenkins/jenkins-slave/maven32-interceptor.jar /home/jenkins/jenkins-slave/maven3-interceptor-commons.jar
41591
Java HotSpot(TM) 64-Bit Server VM warning: ignoring option MaxPermSize=512m; support was removed
in 8.0
<===[JENKINS REMOTING CAPACITY]===>   channel started
using settings config with name simple-deploy-settings-no-mirror
Replacing all maven server entries not found in credentials list is true
Executing Maven:  -B -f <https://builds.apache.org/job/streams-examples-site/ws/pom.xml>
-Dmaven.repo.local=/home/jenkins/jenkins-slave/maven-repositories/1 -s /tmp/settings1128743360625575119.xml
-q -U generate-sources site:site site:stage
Saving to outputFile=<https://builds.apache.org/job/streams-examples-site/ws/target/scalastyle-output.xml>
Processed 0 file(s)
Found 0 errors
Found 0 warnings
Found 0 infos
Finished in 142 ms
[JENKINS] Archiving site from <https://builds.apache.org/job/streams-examples-site/ws/target/site>
to /x1/jenkins/jenkins-home/jobs/streams-examples-site/site
file://<https://builds.apache.org/job/streams-examples-site/ws/target/staging/> - Session:
Opened  
file://<https://builds.apache.org/job/streams-examples-site/ws/target/staging/> - Session:
Disconnecting  
file://<https://builds.apache.org/job/streams-examples-site/ws/target/staging/> - Session:
Disconnected
Saving to outputFile=<https://builds.apache.org/job/streams-examples-site/ws/flink/target/scalastyle-output.xml>
Processed 0 file(s)
Found 0 errors
Found 0 warnings
Found 0 infos
Finished in 2 ms
[JENKINS] Archiving site from <https://builds.apache.org/job/streams-examples-site/ws/flink/target/site>
to /x1/jenkins/jenkins-home/jobs/streams-examples-site/site/streams-examples-flink
file://<https://builds.apache.org/job/streams-examples-site/ws/target/staging/> - Session:
Opened  
file://<https://builds.apache.org/job/streams-examples-site/ws/target/staging/> - Session:
Disconnecting  
file://<https://builds.apache.org/job/streams-examples-site/ws/target/staging/> - Session:
Disconnected
[WARNING] The POM for org.apache.streams.plugins:streams-plugin-pojo:jar:0.5-incubating-SNAPSHOT
is missing, no dependency information available
Waiting for Jenkins to finish collecting data
[ERROR] Plugin org.apache.streams.plugins:streams-plugin-pojo:0.5-incubating-SNAPSHOT or one
of its dependencies could not be resolved: Could not find artifact org.apache.streams.plugins:streams-plugin-pojo:jar:0.5-incubating-SNAPSHOT
-> [Help 1]
[ERROR] 
[ERROR] To see the full stack trace of the errors, re-run Maven with the -e switch.
[ERROR] Re-run Maven using the -X switch to enable full debug logging.
[ERROR] 
[ERROR] For more information about the errors and possible solutions, please read the following
articles:
[ERROR] [Help 1] http://cwiki.apache.org/confluence/display/MAVEN/PluginResolutionException
[JENKINS] Archiving <https://builds.apache.org/job/streams-examples-site/ws/local/pom.xml>
to org.apache.streams/streams-examples-local/0.5-incubating-SNAPSHOT/streams-examples-local-0.5-incubating-SNAPSHOT.pom
[JENKINS] Archiving <https://builds.apache.org/job/streams-examples-site/ws/local/elasticsearch-reindex/pom.xml>
to org.apache.streams/elasticsearch-reindex/0.5-incubating-SNAPSHOT/elasticsearch-reindex-0.5-incubating-SNAPSHOT.pom
[JENKINS] Archiving <https://builds.apache.org/job/streams-examples-site/ws/local/twitter-follow-neo4j/pom.xml>
to org.apache.streams/twitter-follow-neo4j/0.5-incubating-SNAPSHOT/twitter-follow-neo4j-0.5-incubating-SNAPSHOT.pom
[JENKINS] Archiving <https://builds.apache.org/job/streams-examples-site/ws/local/elasticsearch-hdfs/pom.xml>
to org.apache.streams/elasticsearch-hdfs/0.5-incubating-SNAPSHOT/elasticsearch-hdfs-0.5-incubating-SNAPSHOT.pom
[JENKINS] Archiving <https://builds.apache.org/job/streams-examples-site/ws/local/twitter-userstream-elasticsearch/pom.xml>
to org.apache.streams/twitter-userstream-elasticsearch/0.5-incubating-SNAPSHOT/twitter-userstream-elasticsearch-0.5-incubating-SNAPSHOT.pom
[JENKINS] Archiving <https://builds.apache.org/job/streams-examples-site/ws/pom.xml>
to org.apache.streams/streams-examples/0.5-incubating-SNAPSHOT/streams-examples-0.5-incubating-SNAPSHOT.pom
[JENKINS] Archiving <https://builds.apache.org/job/streams-examples-site/ws/flink/pom.xml>
to org.apache.streams/streams-examples-flink/0.5-incubating-SNAPSHOT/streams-examples-flink-0.5-incubating-SNAPSHOT.pom
[JENKINS] Archiving <https://builds.apache.org/job/streams-examples-site/ws/local/twitter-history-elasticsearch/pom.xml>
to org.apache.streams/twitter-history-elasticsearch/0.5-incubating-SNAPSHOT/twitter-history-elasticsearch-0.5-incubating-SNAPSHOT.pom
[JENKINS] Archiving <https://builds.apache.org/job/streams-examples-site/ws/flink/flink-twitter-collection/pom.xml>
to org.apache.streams/flink-twitter-collection/0.5-incubating-SNAPSHOT/flink-twitter-collection-0.5-incubating-SNAPSHOT.pom
[JENKINS] Archiving <https://builds.apache.org/job/streams-examples-site/ws/local/mongo-elasticsearch-sync/pom.xml>
to org.apache.streams/mongo-elasticsearch-sync/0.5-incubating-SNAPSHOT/mongo-elasticsearch-sync-0.5-incubating-SNAPSHOT.pom
channel stopped

Mime
View raw message