streams-commits mailing list archives

Site index · List index
Message view « Date » · « Thread »
Top « Date » · « Thread »
From Apache Jenkins Server <jenk...@builds.apache.org>
Subject Build failed in Jenkins: streams-project-site #125
Date Wed, 04 Jan 2017 04:54:55 GMT
See <https://builds.apache.org/job/streams-project-site/125/changes>

Changes:

[smarthi] Replace Guava APIs with Java 8, this closes apache/incubator-streams#347

------------------------------------------
[...truncated 49 lines...]
	at org.jenkinsci.plugins.gitclient.RemoteGitImpl$CommandInvocationHandler$1.call(RemoteGitImpl.java:145)
	at hudson.remoting.UserRequest.perform(UserRequest.java:153)
	at hudson.remoting.UserRequest.perform(UserRequest.java:50)
	at hudson.remoting.Request$2.run(Request.java:332)
	at hudson.remoting.InterceptingExecutorService$1.call(InterceptingExecutorService.java:68)
	at java.util.concurrent.FutureTask.run(FutureTask.java:262)
	at java.util.concurrent.ThreadPoolExecutor.runWorker(ThreadPoolExecutor.java:1145)
	at java.util.concurrent.ThreadPoolExecutor$Worker.run(ThreadPoolExecutor.java:615)
	at java.lang.Thread.run(Thread.java:745)
	at ......remote call to H11(Native Method)
	at hudson.remoting.Channel.attachCallSiteStackTrace(Channel.java:1416)
	at hudson.remoting.UserResponse.retrieve(UserRequest.java:253)
	at hudson.remoting.Channel.call(Channel.java:781)
	at org.jenkinsci.plugins.gitclient.RemoteGitImpl$CommandInvocationHandler.execute(RemoteGitImpl.java:145)
	at sun.reflect.GeneratedMethodAccessor761.invoke(Unknown Source)
	at sun.reflect.DelegatingMethodAccessorImpl.invoke(DelegatingMethodAccessorImpl.java:43)
	at java.lang.reflect.Method.invoke(Method.java:498)
	at org.jenkinsci.plugins.gitclient.RemoteGitImpl$CommandInvocationHandler.invoke(RemoteGitImpl.java:131)
	at com.sun.proxy.$Proxy175.execute(Unknown Source)
	at hudson.plugins.git.GitSCM.retrieveChanges(GitSCM.java:1046)
	at hudson.plugins.git.GitSCM.checkout(GitSCM.java:1086)
	at hudson.scm.SCM.checkout(SCM.java:485)
	at hudson.model.AbstractProject.checkout(AbstractProject.java:1269)
	at hudson.model.AbstractBuild$AbstractBuildExecution.defaultCheckout(AbstractBuild.java:604)
	at jenkins.scm.SCMCheckoutStrategy.checkout(SCMCheckoutStrategy.java:86)
	at hudson.model.AbstractBuild$AbstractBuildExecution.run(AbstractBuild.java:529)
	at hudson.model.Run.execute(Run.java:1741)
	at hudson.maven.MavenModuleSetBuild.run(MavenModuleSetBuild.java:531)
	at hudson.model.ResourceController.execute(ResourceController.java:98)
	at hudson.model.Executor.run(Executor.java:410)
ERROR: null
Retrying after 10 seconds
Wiping out workspace first.
Cloning the remote Git repository
Cloning repository https://git-wip-us.apache.org/repos/asf/incubator-streams.git
 > git init <https://builds.apache.org/job/streams-project-site/ws/> # timeout=10
Fetching upstream changes from https://git-wip-us.apache.org/repos/asf/incubator-streams.git
 > git --version # timeout=10
 > git -c core.askpass=true fetch --tags --progress https://git-wip-us.apache.org/repos/asf/incubator-streams.git
+refs/heads/*:refs/remotes/origin/*
ERROR: Error cloning remote repo 'origin'
hudson.plugins.git.GitException: Command "git -c core.askpass=true fetch --tags --progress
https://git-wip-us.apache.org/repos/asf/incubator-streams.git +refs/heads/*:refs/remotes/origin/*"
returned status code 128:
stdout: 
stderr: fatal: unable to access 'https://git-wip-us.apache.org/repos/asf/incubator-streams.git/':
gnutls_handshake() failed: A TLS packet with unexpected length was received.

	at org.jenkinsci.plugins.gitclient.CliGitAPIImpl.launchCommandIn(CliGitAPIImpl.java:1723)
	at org.jenkinsci.plugins.gitclient.CliGitAPIImpl.launchCommandWithCredentials(CliGitAPIImpl.java:1459)
	at org.jenkinsci.plugins.gitclient.CliGitAPIImpl.access$300(CliGitAPIImpl.java:63)
	at org.jenkinsci.plugins.gitclient.CliGitAPIImpl$1.execute(CliGitAPIImpl.java:314)
	at org.jenkinsci.plugins.gitclient.CliGitAPIImpl$2.execute(CliGitAPIImpl.java:506)
	at org.jenkinsci.plugins.gitclient.RemoteGitImpl$CommandInvocationHandler$1.call(RemoteGitImpl.java:152)
	at org.jenkinsci.plugins.gitclient.RemoteGitImpl$CommandInvocationHandler$1.call(RemoteGitImpl.java:145)
	at hudson.remoting.UserRequest.perform(UserRequest.java:153)
	at hudson.remoting.UserRequest.perform(UserRequest.java:50)
	at hudson.remoting.Request$2.run(Request.java:332)
	at hudson.remoting.InterceptingExecutorService$1.call(InterceptingExecutorService.java:68)
	at java.util.concurrent.FutureTask.run(FutureTask.java:262)
	at java.util.concurrent.ThreadPoolExecutor.runWorker(ThreadPoolExecutor.java:1145)
	at java.util.concurrent.ThreadPoolExecutor$Worker.run(ThreadPoolExecutor.java:615)
	at java.lang.Thread.run(Thread.java:745)
	at ......remote call to H11(Native Method)
	at hudson.remoting.Channel.attachCallSiteStackTrace(Channel.java:1416)
	at hudson.remoting.UserResponse.retrieve(UserRequest.java:253)
	at hudson.remoting.Channel.call(Channel.java:781)
	at org.jenkinsci.plugins.gitclient.RemoteGitImpl$CommandInvocationHandler.execute(RemoteGitImpl.java:145)
	at sun.reflect.GeneratedMethodAccessor761.invoke(Unknown Source)
	at sun.reflect.DelegatingMethodAccessorImpl.invoke(DelegatingMethodAccessorImpl.java:43)
	at java.lang.reflect.Method.invoke(Method.java:498)
	at org.jenkinsci.plugins.gitclient.RemoteGitImpl$CommandInvocationHandler.invoke(RemoteGitImpl.java:131)
	at com.sun.proxy.$Proxy175.execute(Unknown Source)
	at hudson.plugins.git.GitSCM.retrieveChanges(GitSCM.java:1046)
	at hudson.plugins.git.GitSCM.checkout(GitSCM.java:1086)
	at hudson.scm.SCM.checkout(SCM.java:485)
	at hudson.model.AbstractProject.checkout(AbstractProject.java:1269)
	at hudson.model.AbstractBuild$AbstractBuildExecution.defaultCheckout(AbstractBuild.java:604)
	at jenkins.scm.SCMCheckoutStrategy.checkout(SCMCheckoutStrategy.java:86)
	at hudson.model.AbstractBuild$AbstractBuildExecution.run(AbstractBuild.java:529)
	at hudson.model.Run.execute(Run.java:1741)
	at hudson.maven.MavenModuleSetBuild.run(MavenModuleSetBuild.java:531)
	at hudson.model.ResourceController.execute(ResourceController.java:98)
	at hudson.model.Executor.run(Executor.java:410)
ERROR: null
Retrying after 10 seconds
Wiping out workspace first.
Cloning the remote Git repository
Cloning repository https://git-wip-us.apache.org/repos/asf/incubator-streams.git
 > git init <https://builds.apache.org/job/streams-project-site/ws/> # timeout=10
Fetching upstream changes from https://git-wip-us.apache.org/repos/asf/incubator-streams.git
 > git --version # timeout=10
 > git -c core.askpass=true fetch --tags --progress https://git-wip-us.apache.org/repos/asf/incubator-streams.git
+refs/heads/*:refs/remotes/origin/*
 > git config remote.origin.url https://git-wip-us.apache.org/repos/asf/incubator-streams.git
# timeout=10
 > git config --add remote.origin.fetch +refs/heads/*:refs/remotes/origin/* # timeout=10
 > git config remote.origin.url https://git-wip-us.apache.org/repos/asf/incubator-streams.git
# timeout=10
Cleaning workspace
 > git rev-parse --verify HEAD # timeout=10
No valid HEAD. Skipping the resetting
 > git clean -fdx # timeout=10
Fetching upstream changes from https://git-wip-us.apache.org/repos/asf/incubator-streams.git
 > git -c core.askpass=true fetch --tags --progress https://git-wip-us.apache.org/repos/asf/incubator-streams.git
+refs/heads/*:refs/remotes/origin/*
 > git rev-parse origin/master^{commit} # timeout=10
Checking out Revision 7810361d2e5a2f236967b3208053ec80b0e5885a (origin/master)
 > git config core.sparsecheckout # timeout=10
 > git checkout -f 7810361d2e5a2f236967b3208053ec80b0e5885a
 > git rev-list e40e6287e5deeb51af9dcd4af9fb51e91d582373 # timeout=10
Parsing POMs
using settings config with name simple-deploy-settings-no-mirror
Replacing all maven server entries not found in credentials list is true
Downloaded artifact https://repository.apache.org/content/repositories/snapshots/org/apache/streams/streams-master/0.5-incubating-SNAPSHOT/maven-metadata.xml
Failed to transfer Could not find metadata org.apache.streams:streams-master:0.5-incubating-SNAPSHOT/maven-metadata.xml
in sonatype (https://oss.sonatype.org/content/repositories/snapshots)
Failed to transfer Could not find metadata org.apache.streams:streams-master:0.5-incubating-SNAPSHOT/maven-metadata.xml
in typesafe (http://repo.typesafe.com/typesafe/repo)
Failed to transfer Could not find metadata org.apache.streams:streams-master:0.5-incubating-SNAPSHOT/maven-metadata.xml
in google-api-services (http://google-api-client-libraries.appspot.com/mavenrepo)
Downloaded artifact https://repository.apache.org/snapshots/org/apache/streams/streams-master/0.5-incubating-SNAPSHOT/maven-metadata.xml
Modules changed, recalculating dependency graph
Established TCP socket on 45135
maven32-agent.jar already up to date
maven32-interceptor.jar already up to date
maven3-interceptor-commons.jar already up to date
[streams-project-site] $ /home/jenkins/tools/java/latest1.8/bin/java -Xmx2g -Xms256m -XX:MaxPermSize=512m
-Dfile.encoding=UTF-8 -cp /home/jenkins/jenkins-slave/maven32-agent.jar:/home/jenkins/tools/maven/apache-maven-3.3.9/boot/plexus-classworlds-2.5.2.jar:/home/jenkins/tools/maven/apache-maven-3.3.9/conf/logging
jenkins.maven3.agent.Maven32Main /home/jenkins/tools/maven/apache-maven-3.3.9 /home/jenkins/jenkins-slave/slave.jar
/home/jenkins/jenkins-slave/maven32-interceptor.jar /home/jenkins/jenkins-slave/maven3-interceptor-commons.jar
45135
Java HotSpot(TM) 64-Bit Server VM warning: ignoring option MaxPermSize=512m; support was removed
in 8.0
<===[JENKINS REMOTING CAPACITY]===>   channel started
using settings config with name simple-deploy-settings-no-mirror
Replacing all maven server entries not found in credentials list is true
Executing Maven:  -B -f <https://builds.apache.org/job/streams-project-site/ws/pom.xml>
-Dmaven.repo.local=/home/jenkins/jenkins-slave/maven-repositories/1 -s /tmp/settings6524571767360763505.xml
-q -U generate-sources site:site site:stage
Saving to outputFile=<https://builds.apache.org/job/streams-project-site/ws/target/scalastyle-output.xml>
Processed 0 file(s)
Found 0 errors
Found 0 warnings
Found 0 infos
Finished in 603 ms
[JENKINS] Archiving site from <https://builds.apache.org/job/streams-project-site/ws/target/site>
to /x1/jenkins/jenkins-home/jobs/streams-project-site/site
file://<https://builds.apache.org/job/streams-project-site/ws/target/staging/> - Session:
Opened  
file://<https://builds.apache.org/job/streams-project-site/ws/target/staging/> - Session:
Disconnecting  
file://<https://builds.apache.org/job/streams-project-site/ws/target/staging/> - Session:
Disconnected
Saving to outputFile=<https://builds.apache.org/job/streams-project-site/ws/streams-testing/target/scalastyle-output.xml>
Processed 0 file(s)
Found 0 errors
Found 0 warnings
Found 0 infos
Finished in 1 ms
[JENKINS] Archiving site from <https://builds.apache.org/job/streams-project-site/ws/streams-testing/target/site>
to /x1/jenkins/jenkins-home/jobs/streams-project-site/site/streams-testing
file://<https://builds.apache.org/job/streams-project-site/ws/target/staging/> - Session:
Opened  
file://<https://builds.apache.org/job/streams-project-site/ws/target/staging/> - Session:
Disconnecting  
file://<https://builds.apache.org/job/streams-project-site/ws/target/staging/> - Session:
Disconnected
Saving to outputFile=<https://builds.apache.org/job/streams-project-site/ws/streams-schemas/target/scalastyle-output.xml>
Processed 0 file(s)
Found 0 errors
Found 0 warnings
Found 0 infos
Finished in 1 ms
[JENKINS] Archiving site from <https://builds.apache.org/job/streams-project-site/ws/streams-schemas/target/site>
to /x1/jenkins/jenkins-home/jobs/streams-project-site/site/streams-schemas
file://<https://builds.apache.org/job/streams-project-site/ws/target/staging/> - Session:
Opened  
file://<https://builds.apache.org/job/streams-project-site/ws/target/staging/> - Session:
Disconnecting  
file://<https://builds.apache.org/job/streams-project-site/ws/target/staging/> - Session:
Disconnected
Saving to outputFile=<https://builds.apache.org/job/streams-project-site/ws/streams-schemas/streams-schema-activitystreams/target/scalastyle-output.xml>
Processed 0 file(s)
Found 0 errors
Found 0 warnings
Found 0 infos
Finished in 1 ms
[JENKINS] Archiving site from <https://builds.apache.org/job/streams-project-site/ws/streams-schemas/streams-schema-activitystreams/target/site>
to /x1/jenkins/jenkins-home/jobs/streams-project-site/site/streams-schemas/streams-schema-activitystreams
file://<https://builds.apache.org/job/streams-project-site/ws/target/staging/> - Session:
Opened  
file://<https://builds.apache.org/job/streams-project-site/ws/target/staging/> - Session:
Disconnecting  
file://<https://builds.apache.org/job/streams-project-site/ws/target/staging/> - Session:
Disconnected
Saving to outputFile=<https://builds.apache.org/job/streams-project-site/ws/streams-plugins/target/scalastyle-output.xml>
Processed 0 file(s)
Found 0 errors
Found 0 warnings
Found 0 infos
Finished in 1 ms
[JENKINS] Archiving site from <https://builds.apache.org/job/streams-project-site/ws/streams-plugins/target/site>
to /x1/jenkins/jenkins-home/jobs/streams-project-site/site/streams-plugins
file://<https://builds.apache.org/job/streams-project-site/ws/target/staging/> - Session:
Opened  
file://<https://builds.apache.org/job/streams-project-site/ws/target/staging/> - Session:
Disconnecting  
file://<https://builds.apache.org/job/streams-project-site/ws/target/staging/> - Session:
Disconnected
Saving to outputFile=<https://builds.apache.org/job/streams-project-site/ws/streams-plugins/streams-plugin-pojo/target/scalastyle-output.xml>
Processed 0 file(s)
Found 0 errors
Found 0 warnings
Found 0 infos
Finished in 1 ms
Java HotSpot(TM) 64-Bit Server VM warning: ignoring option MaxPermSize=512m; support was removed
in 8.0
[ERROR] Error fetching link: <https://builds.apache.org/job/streams-project-site/ws/streams-schemas/streams-schema-activitystreams/target/site/apidocs/package-list.>
Ignored it.
[JENKINS] Archiving site from <https://builds.apache.org/job/streams-project-site/ws/streams-plugins/streams-plugin-pojo/target/site>
to /x1/jenkins/jenkins-home/jobs/streams-project-site/site/streams-plugins/streams-plugin-pojo
file://<https://builds.apache.org/job/streams-project-site/ws/target/staging/> - Session:
Opened  
file://<https://builds.apache.org/job/streams-project-site/ws/target/staging/> - Session:
Disconnecting  
file://<https://builds.apache.org/job/streams-project-site/ws/target/staging/> - Session:
Disconnected
Waiting for Jenkins to finish collecting data
[ERROR] Plugin org.apache.streams.plugins:streams-plugin-pojo:0.5-incubating-SNAPSHOT or one
of its dependencies could not be resolved: Could not find artifact org.apache.streams.plugins:streams-plugin-pojo:jar:0.5-incubating-SNAPSHOT
-> [Help 1]
[ERROR] 
[ERROR] To see the full stack trace of the errors, re-run Maven with the -e switch.
[ERROR] Re-run Maven using the -X switch to enable full debug logging.
[ERROR] 
[ERROR] For more information about the errors and possible solutions, please read the following
articles:
[ERROR] [Help 1] http://cwiki.apache.org/confluence/display/MAVEN/PluginResolutionException
[JENKINS] Archiving <https://builds.apache.org/job/streams-project-site/ws/streams-components/streams-filters/pom.xml>
to org.apache.streams/streams-filters/0.5-incubating-SNAPSHOT/streams-filters-0.5-incubating-SNAPSHOT.pom
[JENKINS] Archiving <https://builds.apache.org/job/streams-project-site/ws/streams-schemas/streams-schema-activitystreams2/pom.xml>
to org.apache.streams/streams-schema-activitystreams2/0.5-incubating-SNAPSHOT/streams-schema-activitystreams2-0.5-incubating-SNAPSHOT.pom
[JENKINS] Archiving <https://builds.apache.org/job/streams-project-site/ws/streams-core/pom.xml>
to org.apache.streams/streams-core/0.5-incubating-SNAPSHOT/streams-core-0.5-incubating-SNAPSHOT.pom
[JENKINS] Archiving <https://builds.apache.org/job/streams-project-site/ws/streams-contrib/streams-processor-regex/pom.xml>
to org.apache.streams/streams-processor-regex/0.5-incubating-SNAPSHOT/streams-processor-regex-0.5-incubating-SNAPSHOT.pom
[JENKINS] Archiving <https://builds.apache.org/job/streams-project-site/ws/streams-runtimes/pom.xml>
to org.apache.streams/streams-runtimes/0.5-incubating-SNAPSHOT/streams-runtimes-0.5-incubating-SNAPSHOT.pom
[JENKINS] Archiving <https://builds.apache.org/job/streams-project-site/ws/streams-contrib/streams-persist-filebuffer/pom.xml>
to org.apache.streams/streams-persist-filebuffer/0.5-incubating-SNAPSHOT/streams-persist-filebuffer-0.5-incubating-SNAPSHOT.pom
[JENKINS] Archiving <https://builds.apache.org/job/streams-project-site/ws/streams-plugins/streams-plugin-hive/pom.xml>
to org.apache.streams.plugins/streams-plugin-hive/0.5-incubating-SNAPSHOT/streams-plugin-hive-0.5-incubating-SNAPSHOT.pom
[JENKINS] Archiving <https://builds.apache.org/job/streams-project-site/ws/streams-components/streams-converters/pom.xml>
to org.apache.streams/streams-converters/0.5-incubating-SNAPSHOT/streams-converters-0.5-incubating-SNAPSHOT.pom
[JENKINS] Archiving <https://builds.apache.org/job/streams-project-site/ws/streams-contrib/streams-persist-console/pom.xml>
to org.apache.streams/streams-persist-console/0.5-incubating-SNAPSHOT/streams-persist-console-0.5-incubating-SNAPSHOT.pom
[JENKINS] Archiving <https://builds.apache.org/job/streams-project-site/ws/streams-contrib/pom.xml>
to org.apache.streams/streams-contrib/0.5-incubating-SNAPSHOT/streams-contrib-0.5-incubating-SNAPSHOT.pom
[JENKINS] Archiving <https://builds.apache.org/job/streams-project-site/ws/streams-contrib/streams-amazon-aws/pom.xml>
to org.apache.streams/streams-amazon-aws/0.5-incubating-SNAPSHOT/streams-amazon-aws-0.5-incubating-SNAPSHOT.pom
[JENKINS] Archiving <https://builds.apache.org/job/streams-project-site/ws/streams-contrib/streams-processor-json/pom.xml>
to org.apache.streams/streams-processor-json/0.5-incubating-SNAPSHOT/streams-processor-json-0.5-incubating-SNAPSHOT.pom
[JENKINS] Archiving <https://builds.apache.org/job/streams-project-site/ws/streams-plugins/streams-plugin-pig/pom.xml>
to org.apache.streams.plugins/streams-plugin-pig/0.5-incubating-SNAPSHOT/streams-plugin-pig-0.5-incubating-SNAPSHOT.pom
[JENKINS] Archiving <https://builds.apache.org/job/streams-project-site/ws/streams-contrib/streams-processor-peoplepattern/pom.xml>
to org.apache.streams/streams-processor-peoplepattern/0.5-incubating-SNAPSHOT/streams-processor-peoplepattern-0.5-incubating-SNAPSHOT.pom
[JENKINS] Archiving <https://builds.apache.org/job/streams-project-site/ws/streams-contrib/streams-provider-rss/pom.xml>
to org.apache.streams/streams-provider-rss/0.5-incubating-SNAPSHOT/streams-provider-rss-0.5-incubating-SNAPSHOT.pom
[JENKINS] Archiving <https://builds.apache.org/job/streams-project-site/ws/streams-plugins/streams-plugin-hbase/pom.xml>
to org.apache.streams.plugins/streams-plugin-hbase/0.5-incubating-SNAPSHOT/streams-plugin-hbase-0.5-incubating-SNAPSHOT.pom
[JENKINS] Archiving <https://builds.apache.org/job/streams-project-site/ws/streams-components/streams-http/pom.xml>
to org.apache.streams/streams-http/0.5-incubating-SNAPSHOT/streams-http-0.5-incubating-SNAPSHOT.pom
[JENKINS] Archiving <https://builds.apache.org/job/streams-project-site/ws/streams-plugins/streams-plugin-pojo/pom.xml>
to org.apache.streams.plugins/streams-plugin-pojo/0.5-incubating-SNAPSHOT/streams-plugin-pojo-0.5-incubating-SNAPSHOT.pom
[JENKINS] Archiving <https://builds.apache.org/job/streams-project-site/ws/streams-pojo/pom.xml>
to org.apache.streams/streams-pojo/0.5-incubating-SNAPSHOT/streams-pojo-0.5-incubating-SNAPSHOT.pom
[JENKINS] Archiving <https://builds.apache.org/job/streams-project-site/ws/streams-contrib/streams-amazon-aws/streams-persist-kinesis/pom.xml>
to org.apache.streams/streams-persist-kinesis/0.5-incubating-SNAPSHOT/streams-persist-kinesis-0.5-incubating-SNAPSHOT.pom
[JENKINS] Archiving <https://builds.apache.org/job/streams-project-site/ws/streams-plugins/streams-plugin-scala/pom.xml>
to org.apache.streams.plugins/streams-plugin-scala/0.5-incubating-SNAPSHOT/streams-plugin-scala-0.5-incubating-SNAPSHOT.pom
[JENKINS] Archiving <https://builds.apache.org/job/streams-project-site/ws/streams-contrib/streams-processor-urls/pom.xml>
to org.apache.streams/streams-processor-urls/0.5-incubating-SNAPSHOT/streams-processor-urls-0.5-incubating-SNAPSHOT.pom
[JENKINS] Archiving <https://builds.apache.org/job/streams-project-site/ws/streams-plugins/streams-plugin-elasticsearch/pom.xml>
to org.apache.streams.plugins/streams-plugin-elasticsearch/0.5-incubating-SNAPSHOT/streams-plugin-elasticsearch-0.5-incubating-SNAPSHOT.pom
[JENKINS] Archiving <https://builds.apache.org/job/streams-project-site/ws/streams-contrib/streams-provider-google/google-gplus/pom.xml>
to org.apache.streams/google-gplus/0.5-incubating-SNAPSHOT/google-gplus-0.5-incubating-SNAPSHOT.pom
[JENKINS] Archiving <https://builds.apache.org/job/streams-project-site/ws/streams-runtimes/streams-runtime-dropwizard/pom.xml>
to org.apache.streams/streams-runtime-dropwizard/0.5-incubating-SNAPSHOT/streams-runtime-dropwizard-0.5-incubating-SNAPSHOT.pom
[JENKINS] Archiving <https://builds.apache.org/job/streams-project-site/ws/streams-contrib/streams-provider-google/pom.xml>
to org.apache.streams/streams-provider-google/0.5-incubating-SNAPSHOT/streams-provider-google-0.5-incubating-SNAPSHOT.pom
[JENKINS] Archiving <https://builds.apache.org/job/streams-project-site/ws/streams-pojo-extensions/pom.xml>
to org.apache.streams/streams-pojo-extensions/0.5-incubating-SNAPSHOT/streams-pojo-extensions-0.5-incubating-SNAPSHOT.pom
[JENKINS] Archiving <https://builds.apache.org/job/streams-project-site/ws/streams-contrib/streams-processor-jackson/pom.xml>
to org.apache.streams/streams-processor-jackson/0.5-incubating-SNAPSHOT/streams-processor-jackson-0.5-incubating-SNAPSHOT.pom
[JENKINS] Archiving <https://builds.apache.org/job/streams-project-site/ws/streams-components/pom.xml>
to org.apache.streams/streams-components/0.5-incubating-SNAPSHOT/streams-components-0.5-incubating-SNAPSHOT.pom
[JENKINS] Archiving <https://builds.apache.org/job/streams-project-site/ws/streams-schemas/streams-schema-activitystreams/pom.xml>
to org.apache.streams/streams-schema-activitystreams/0.5-incubating-SNAPSHOT/streams-schema-activitystreams-0.5-incubating-SNAPSHOT.pom
[JENKINS] Archiving <https://builds.apache.org/job/streams-project-site/ws/streams-contrib/streams-provider-sysomos/pom.xml>
to org.apache.streams/streams-provider-sysomos/0.5-incubating-SNAPSHOT/streams-provider-sysomos-0.5-incubating-SNAPSHOT.pom
[JENKINS] Archiving <https://builds.apache.org/job/streams-project-site/ws/streams-contrib/streams-provider-youtube/pom.xml>
to org.apache.streams/streams-provider-youtube/0.5-incubating-SNAPSHOT/streams-provider-youtube-0.5-incubating-SNAPSHOT.pom
[JENKINS] Archiving <https://builds.apache.org/job/streams-project-site/ws/streams-schemas/pom.xml>
to org.apache.streams/streams-schemas/0.5-incubating-SNAPSHOT/streams-schemas-0.5-incubating-SNAPSHOT.pom
[JENKINS] Archiving <https://builds.apache.org/job/streams-project-site/ws/streams-contrib/streams-provider-facebook/pom.xml>
to org.apache.streams/streams-provider-facebook/0.5-incubating-SNAPSHOT/streams-provider-facebook-0.5-incubating-SNAPSHOT.pom
[JENKINS] Archiving <https://builds.apache.org/job/streams-project-site/ws/streams-contrib/streams-persist-cassandra/pom.xml>
to org.apache.streams/streams-persist-cassandra/0.5-incubating-SNAPSHOT/streams-persist-cassandra-0.5-incubating-SNAPSHOT.pom
No prior successful build to compare, so performing full copy of artifacts
[JENKINS] Archiving <https://builds.apache.org/job/streams-project-site/ws/streams-contrib/streams-persist-elasticsearch/pom.xml>
to org.apache.streams/streams-persist-elasticsearch/0.5-incubating-SNAPSHOT/streams-persist-elasticsearch-0.5-incubating-SNAPSHOT.pom
[JENKINS] Archiving <https://builds.apache.org/job/streams-project-site/ws/streams-contrib/streams-provider-google/google-gmail/pom.xml>
to org.apache.streams/google-gmail/0.5-incubating-SNAPSHOT/google-gmail-0.5-incubating-SNAPSHOT.pom
[JENKINS] Archiving <https://builds.apache.org/job/streams-project-site/ws/streams-config/pom.xml>
to org.apache.streams/streams-config/0.5-incubating-SNAPSHOT/streams-config-0.5-incubating-SNAPSHOT.pom
[JENKINS] Archiving <https://builds.apache.org/job/streams-project-site/ws/streams-util/pom.xml>
to org.apache.streams/streams-util/0.5-incubating-SNAPSHOT/streams-util-0.5-incubating-SNAPSHOT.pom
[JENKINS] Archiving <https://builds.apache.org/job/streams-project-site/ws/streams-contrib/streams-persist-hdfs/pom.xml>
to org.apache.streams/streams-persist-hdfs/0.5-incubating-SNAPSHOT/streams-persist-hdfs-0.5-incubating-SNAPSHOT.pom
[JENKINS] Archiving <https://builds.apache.org/job/streams-project-site/ws/streams-plugins/pom.xml>
to org.apache.streams.plugins/streams-plugins/0.5-incubating-SNAPSHOT/streams-plugins-0.5-incubating-SNAPSHOT.pom
[JENKINS] Archiving <https://builds.apache.org/job/streams-project-site/ws/pom.xml>
to org.apache.streams/streams-project/0.5-incubating-SNAPSHOT/streams-project-0.5-incubating-SNAPSHOT.pom
[JENKINS] Archiving <https://builds.apache.org/job/streams-project-site/ws/streams-contrib/streams-provider-twitter/pom.xml>
to org.apache.streams/streams-provider-twitter/0.5-incubating-SNAPSHOT/streams-provider-twitter-0.5-incubating-SNAPSHOT.pom
[JENKINS] Archiving <https://builds.apache.org/job/streams-project-site/ws/streams-contrib/streams-amazon-aws/streams-persist-s3/pom.xml>
to org.apache.streams/streams-persist-s3/0.5-incubating-SNAPSHOT/streams-persist-s3-0.5-incubating-SNAPSHOT.pom
[JENKINS] Archiving <https://builds.apache.org/job/streams-project-site/ws/streams-verbs/pom.xml>
to org.apache.streams/streams-verbs/0.5-incubating-SNAPSHOT/streams-verbs-0.5-incubating-SNAPSHOT.pom
[JENKINS] Archiving <https://builds.apache.org/job/streams-project-site/ws/streams-contrib/streams-provider-instagram/pom.xml>
to org.apache.streams/streams-provider-instagram/0.5-incubating-SNAPSHOT/streams-provider-instagram-0.5-incubating-SNAPSHOT.pom
[JENKINS] Archiving <https://builds.apache.org/job/streams-project-site/ws/streams-contrib/streams-persist-kafka/pom.xml>
to org.apache.streams/streams-persist-kafka/0.5-incubating-SNAPSHOT/streams-persist-kafka-0.5-incubating-SNAPSHOT.pom
[JENKINS] Archiving <https://builds.apache.org/job/streams-project-site/ws/streams-contrib/streams-provider-moreover/pom.xml>
to org.apache.streams/streams-provider-moreover/0.5-incubating-SNAPSHOT/streams-provider-moreover-0.5-incubating-SNAPSHOT.pom
[JENKINS] Archiving <https://builds.apache.org/job/streams-project-site/ws/streams-monitoring/pom.xml>
to org.apache.streams/streams-monitoring/0.5-incubating-SNAPSHOT/streams-monitoring-0.5-incubating-SNAPSHOT.pom
[JENKINS] Archiving <https://builds.apache.org/job/streams-project-site/ws/streams-contrib/streams-persist-graph/pom.xml>
to org.apache.streams/streams-persist-graph/0.5-incubating-SNAPSHOT/streams-persist-graph-0.5-incubating-SNAPSHOT.pom
[JENKINS] Archiving <https://builds.apache.org/job/streams-project-site/ws/streams-testing/pom.xml>
to org.apache.streams/streams-testing/0.5-incubating-SNAPSHOT/streams-testing-0.5-incubating-SNAPSHOT.pom
[JENKINS] Archiving <https://builds.apache.org/job/streams-project-site/ws/streams-contrib/streams-persist-hbase/pom.xml>
to org.apache.streams/streams-persist-hbase/0.5-incubating-SNAPSHOT/streams-persist-hbase-0.5-incubating-SNAPSHOT.pom
[JENKINS] Archiving <https://builds.apache.org/job/streams-project-site/ws/streams-contrib/streams-persist-mongo/pom.xml>
to org.apache.streams/streams-persist-mongo/0.5-incubating-SNAPSHOT/streams-persist-mongo-0.5-incubating-SNAPSHOT.pom
[JENKINS] Archiving <https://builds.apache.org/job/streams-project-site/ws/streams-plugins/streams-plugin-cassandra/pom.xml>
to org.apache.streams.plugins/streams-plugin-cassandra/0.5-incubating-SNAPSHOT/streams-plugin-cassandra-0.5-incubating-SNAPSHOT.pom
[JENKINS] Archiving <https://builds.apache.org/job/streams-project-site/ws/streams-runtimes/streams-runtime-local/pom.xml>
to org.apache.streams/streams-runtime-local/0.5-incubating-SNAPSHOT/streams-runtime-local-0.5-incubating-SNAPSHOT.pom
channel stopped

Mime
View raw message