streams-commits mailing list archives

Site index · List index
Message view « Date » · « Thread »
Top « Date » · « Thread »
From Apache Jenkins Server <jenk...@builds.apache.org>
Subject Build failed in Jenkins: streams-examples #170
Date Sun, 18 Dec 2016 09:14:14 GMT
See <https://builds.apache.org/job/streams-examples/170/changes>

Changes:

[smarthi] Fix License Headers in each of the Zeppelin notebooks

[smarthi] Fix License Headers to pass Rat Check

[smarthi] Fix License Headers to pass Rat Check

------------------------------------------
[...truncated 14 lines...]
Parsing POMs
using settings config with name simple-deploy-settings-no-mirror
Replacing all maven server entries not found in credentials list is true
Modules changed, recalculating dependency graph
Established TCP socket on 47311
maven32-agent.jar already up to date
maven32-interceptor.jar already up to date
maven3-interceptor-commons.jar already up to date
[streams-examples] $ /home/jenkins/tools/java/latest1.8/bin/java -Xmx2g -Xms256m -XX:MaxPermSize=512m
-Dfile.encoding=ISO-8859-1 -cp /home/jenkins/jenkins-slave/maven32-agent.jar:/home/jenkins/tools/maven/apache-maven-3.3.9/boot/plexus-classworlds-2.5.2.jar:/home/jenkins/tools/maven/apache-maven-3.3.9/conf/logging
jenkins.maven3.agent.Maven32Main /home/jenkins/tools/maven/apache-maven-3.3.9 /home/jenkins/jenkins-slave/slave.jar
/home/jenkins/jenkins-slave/maven32-interceptor.jar /home/jenkins/jenkins-slave/maven3-interceptor-commons.jar
47311
Java HotSpot(TM) 64-Bit Server VM warning: ignoring option MaxPermSize=512m; support was removed
in 8.0
<===[JENKINS REMOTING CAPACITY]===>   channel started
using settings config with name simple-deploy-settings-no-mirror
Replacing all maven server entries not found in credentials list is true
Executing Maven:  -B -f <https://builds.apache.org/job/streams-examples/ws/pom.xml>
-Dmaven.repo.local=/home/jenkins/jenkins-slave/maven-repositories/1 -s /tmp/settings8939936945461346585.xml
clean install verify
[INFO] Scanning for projects...
[INFO] ------------------------------------------------------------------------
[INFO] Reactor Build Order:
[INFO] 
[INFO] streams-examples
[INFO] streams-examples-flink
[INFO] flink-twitter-collection
[INFO] streams-examples-local
[INFO] elasticsearch-hdfs
[INFO] elasticsearch-reindex
[INFO] mongo-elasticsearch-sync
[INFO] twitter-follow-neo4j
[INFO] twitter-history-elasticsearch
[INFO] twitter-userstream-elasticsearch
[INFO]                                                                         
[INFO] ------------------------------------------------------------------------
[INFO] Building streams-examples 0.5-incubating-SNAPSHOT
[INFO] ------------------------------------------------------------------------
[INFO] 
[INFO] --- maven-clean-plugin:2.6:clean (default-clean) @ streams-examples ---
[INFO] Deleting <https://builds.apache.org/job/streams-examples/ws/target>
[INFO] 
[INFO] --- maven-resources-plugin:2.7:copy-resources (copy-resources) @ streams-examples ---
[INFO] Using 'UTF-8' encoding to copy filtered resources.
[INFO] skip non existing resourceDirectory <https://builds.apache.org/job/streams-examples/ws/src/main/resources>
[INFO] 
[INFO] --- maven-checkstyle-plugin:2.17:check (validate) @ streams-examples ---
[INFO] Starting audit...
Audit done.
[INFO] 
[INFO] --- scalastyle-maven-plugin:0.8.0:check (validate) @ streams-examples ---
[WARNING] sourceDirectory is not specified or does not exist value=<https://builds.apache.org/job/streams-examples/ws/src/main/scala>
[WARNING] testSourceDirectory is not specified or does not exist value=<https://builds.apache.org/job/streams-examples/ws/src/test/scala>
Saving to outputFile=<https://builds.apache.org/job/streams-examples/ws/target/scalastyle-output.xml>
Processed 0 file(s)
Found 0 errors
Found 0 warnings
Found 0 infos
Finished in 172 ms
[INFO] 
[INFO] --- maven-enforcer-plugin:1.4.1:enforce (enforce-java) @ streams-examples ---
[INFO] 
[INFO] --- maven-enforcer-plugin:1.4.1:enforce (enforce-banned-dependencies) @ streams-examples
---
[INFO] 
[INFO] --- maven-enforcer-plugin:1.4.1:enforce (enforce-no-snapshots) @ streams-examples ---
[INFO] 
[INFO] --- maven-remote-resources-plugin:1.4:process (default) @ streams-examples ---
[INFO] 
[INFO] --- maven-remote-resources-plugin:1.4:process (process-resource-bundles) @ streams-examples
---
[INFO] 
[INFO] --- maven-surefire-plugin:2.19.1:test (test) @ streams-examples ---
[INFO] No tests to run.
[JENKINS] Recording test results[INFO] 
[INFO] --- maven-site-plugin:3.5:attach-descriptor (attach-descriptor) @ streams-examples
---

[INFO] 
[INFO] --- maven-failsafe-plugin:2.19.1:integration-test (integration-tests) @ streams-examples
---
[INFO] Tests are skipped.
[INFO] 
[INFO] --- maven-failsafe-plugin:2.19.1:verify (integration-tests) @ streams-examples ---
[INFO] Tests are skipped.
[INFO] 
[INFO] --- maven-install-plugin:2.5.2:install (default-install) @ streams-examples ---
[INFO] Installing <https://builds.apache.org/job/streams-examples/ws/pom.xml> to /home/jenkins/jenkins-slave/maven-repositories/1/org/apache/streams/streams-examples/0.5-incubating-SNAPSHOT/streams-examples-0.5-incubating-SNAPSHOT.pom
[INFO] Installing <https://builds.apache.org/job/streams-examples/ws/target/streams-examples-0.5-incubating-SNAPSHOT-site.xml>
to /home/jenkins/jenkins-slave/maven-repositories/1/org/apache/streams/streams-examples/0.5-incubating-SNAPSHOT/streams-examples-0.5-incubating-SNAPSHOT-site.xml
[INFO] 
[INFO] --- maven-checkstyle-plugin:2.17:check (validate) @ streams-examples ---
[INFO] Starting audit...
Audit done.
[INFO] 
[INFO] --- scalastyle-maven-plugin:0.8.0:check (validate) @ streams-examples ---
[WARNING] sourceDirectory is not specified or does not exist value=<https://builds.apache.org/job/streams-examples/ws/src/main/scala>
[WARNING] testSourceDirectory is not specified or does not exist value=<https://builds.apache.org/job/streams-examples/ws/src/test/scala>
Saving to outputFile=<https://builds.apache.org/job/streams-examples/ws/target/scalastyle-output.xml>
Processed 0 file(s)
Found 0 errors
Found 0 warnings
Found 0 infos
Finished in 1 ms
[INFO] 
[INFO] --- maven-enforcer-plugin:1.4.1:enforce (enforce-java) @ streams-examples ---
[INFO] 
[INFO] --- maven-enforcer-plugin:1.4.1:enforce (enforce-banned-dependencies) @ streams-examples
---
[INFO] 
[INFO] --- maven-enforcer-plugin:1.4.1:enforce (enforce-no-snapshots) @ streams-examples ---
[INFO] 
[INFO] --- maven-remote-resources-plugin:1.4:process (default) @ streams-examples ---
[INFO] 
[INFO] --- maven-remote-resources-plugin:1.4:process (process-resource-bundles) @ streams-examples
---
[INFO] 
[INFO] --- maven-surefire-plugin:2.19.1:test (test) @ streams-examples ---
[INFO] No tests to run.
[INFO] Skipping execution of surefire because it has already been run for this configuration
[JENKINS] Recording test results[INFO] 
[INFO] --- maven-site-plugin:3.5:attach-descriptor (attach-descriptor) @ streams-examples
---

[INFO] 
[INFO] --- maven-failsafe-plugin:2.19.1:integration-test (integration-tests) @ streams-examples
---
[INFO] Tests are skipped.
[INFO] 
[INFO] --- maven-failsafe-plugin:2.19.1:verify (integration-tests) @ streams-examples ---
[INFO] Tests are skipped.
[INFO]                                                                         
[INFO] ------------------------------------------------------------------------
[INFO] Building streams-examples-flink 0.5-incubating-SNAPSHOT
[INFO] ------------------------------------------------------------------------
[INFO] 
[INFO] --- maven-clean-plugin:2.6:clean (default-clean) @ streams-examples-flink ---
[INFO] Deleting <https://builds.apache.org/job/streams-examples/ws/flink/target>
[INFO] 
[INFO] --- maven-resources-plugin:2.7:copy-resources (copy-resources) @ streams-examples-flink
---
[INFO] Using 'UTF-8' encoding to copy filtered resources.
[INFO] skip non existing resourceDirectory <https://builds.apache.org/job/streams-examples/ws/flink/src/main/resources>
[INFO] 
[INFO] --- maven-checkstyle-plugin:2.17:check (validate) @ streams-examples-flink ---
[INFO] Starting audit...
Audit done.
[INFO] 
[INFO] --- scalastyle-maven-plugin:0.8.0:check (validate) @ streams-examples-flink ---
[WARNING] sourceDirectory is not specified or does not exist value=<https://builds.apache.org/job/streams-examples/ws/flink/src/main/scala>
[WARNING] testSourceDirectory is not specified or does not exist value=<https://builds.apache.org/job/streams-examples/ws/flink/src/test/scala>
Saving to outputFile=<https://builds.apache.org/job/streams-examples/ws/flink/target/scalastyle-output.xml>
Processed 0 file(s)
Found 0 errors
Found 0 warnings
Found 0 infos
Finished in 2 ms
[INFO] 
[INFO] --- maven-enforcer-plugin:1.4.1:enforce (enforce-java) @ streams-examples-flink ---
[INFO] 
[INFO] --- maven-enforcer-plugin:1.4.1:enforce (enforce-banned-dependencies) @ streams-examples-flink
---
[INFO] 
[INFO] --- maven-enforcer-plugin:1.4.1:enforce (enforce-no-snapshots) @ streams-examples-flink
---
[INFO] 
[INFO] --- maven-remote-resources-plugin:1.4:process (default) @ streams-examples-flink ---
[INFO] 
[INFO] --- maven-remote-resources-plugin:1.4:process (process-resource-bundles) @ streams-examples-flink
---
[INFO] 
[INFO] --- maven-surefire-plugin:2.19.1:test (test) @ streams-examples-flink ---
[INFO] No tests to run.
[JENKINS] Recording test results[INFO] 
[INFO] --- maven-site-plugin:3.5:attach-descriptor (attach-descriptor) @ streams-examples-flink
---

[INFO] 
[INFO] --- maven-failsafe-plugin:2.19.1:integration-test (integration-tests) @ streams-examples-flink
---
[INFO] Tests are skipped.
[INFO] 
[INFO] --- maven-failsafe-plugin:2.19.1:verify (integration-tests) @ streams-examples-flink
---
[INFO] Tests are skipped.
[INFO] 
[INFO] --- maven-install-plugin:2.5.2:install (default-install) @ streams-examples-flink ---
[INFO] Installing <https://builds.apache.org/job/streams-examples/ws/flink/pom.xml>
to /home/jenkins/jenkins-slave/maven-repositories/1/org/apache/streams/streams-examples-flink/0.5-incubating-SNAPSHOT/streams-examples-flink-0.5-incubating-SNAPSHOT.pom
[INFO] Installing <https://builds.apache.org/job/streams-examples/ws/flink/target/streams-examples-flink-0.5-incubating-SNAPSHOT-site.xml>
to /home/jenkins/jenkins-slave/maven-repositories/1/org/apache/streams/streams-examples-flink/0.5-incubating-SNAPSHOT/streams-examples-flink-0.5-incubating-SNAPSHOT-site.xml
[INFO] 
[INFO] --- maven-checkstyle-plugin:2.17:check (validate) @ streams-examples-flink ---
[INFO] Starting audit...
Audit done.
[INFO] 
[INFO] --- scalastyle-maven-plugin:0.8.0:check (validate) @ streams-examples-flink ---
[WARNING] sourceDirectory is not specified or does not exist value=<https://builds.apache.org/job/streams-examples/ws/flink/src/main/scala>
[WARNING] testSourceDirectory is not specified or does not exist value=<https://builds.apache.org/job/streams-examples/ws/flink/src/test/scala>
Saving to outputFile=<https://builds.apache.org/job/streams-examples/ws/flink/target/scalastyle-output.xml>
Processed 0 file(s)
Found 0 errors
Found 0 warnings
Found 0 infos
Finished in 1 ms
[INFO] 
[INFO] --- maven-enforcer-plugin:1.4.1:enforce (enforce-java) @ streams-examples-flink ---
[INFO] 
[INFO] --- maven-enforcer-plugin:1.4.1:enforce (enforce-banned-dependencies) @ streams-examples-flink
---
[INFO] 
[INFO] --- maven-enforcer-plugin:1.4.1:enforce (enforce-no-snapshots) @ streams-examples-flink
---
[INFO] 
[INFO] --- maven-remote-resources-plugin:1.4:process (default) @ streams-examples-flink ---
[INFO] 
[INFO] --- maven-remote-resources-plugin:1.4:process (process-resource-bundles) @ streams-examples-flink
---
[INFO] 
[INFO] --- maven-surefire-plugin:2.19.1:test (test) @ streams-examples-flink ---
[INFO] No tests to run.
[INFO] Skipping execution of surefire because it has already been run for this configuration
[JENKINS] Recording test results[INFO] 
[INFO] --- maven-site-plugin:3.5:attach-descriptor (attach-descriptor) @ streams-examples-flink
---

[INFO] 
[INFO] --- maven-failsafe-plugin:2.19.1:integration-test (integration-tests) @ streams-examples-flink
---
[INFO] Tests are skipped.
[INFO] 
[INFO] --- maven-failsafe-plugin:2.19.1:verify (integration-tests) @ streams-examples-flink
---
[INFO] Tests are skipped.
[INFO]                                                                         
[INFO] ------------------------------------------------------------------------
[INFO] Building flink-twitter-collection 0.5-incubating-SNAPSHOT
[INFO] ------------------------------------------------------------------------
[WARNING] The POM for org.apache.streams.plugins:streams-plugin-pojo:jar:0.5-incubating-SNAPSHOT
is missing, no dependency information available
[INFO] ------------------------------------------------------------------------
[INFO] Reactor Summary:
[INFO] 
[INFO] streams-examples ................................... SUCCESS [  7.939 s]
[INFO] streams-examples-flink ............................. SUCCESS [  2.669 s]
[INFO] flink-twitter-collection ........................... FAILURE [  0.089 s]
[INFO] streams-examples-local ............................. SKIPPED
[INFO] elasticsearch-hdfs ................................. SKIPPED
[INFO] elasticsearch-reindex .............................. SKIPPED
[INFO] mongo-elasticsearch-sync ........................... SKIPPED
[INFO] twitter-follow-neo4j ............................... SKIPPED
[INFO] twitter-history-elasticsearch ...................... SKIPPED
[INFO] twitter-userstream-elasticsearch ................... SKIPPED
[INFO] ------------------------------------------------------------------------
[INFO] BUILD FAILURE
[INFO] ------------------------------------------------------------------------
[INFO] Total time: 14.981 s
[INFO] Finished at: 2016-12-18T09:13:31+00:00
[INFO] Final Memory: 31M/414M
[INFO] ------------------------------------------------------------------------
[ERROR] Plugin org.apache.streams.plugins:streams-plugin-pojo:0.5-incubating-SNAPSHOT or one
of its dependencies could not be resolved: Could not find artifact org.apache.streams.plugins:streams-plugin-pojo:jar:0.5-incubating-SNAPSHOT
-> [Help 1]
[ERROR] 
[ERROR] To see the full stack trace of the errors, re-run Maven with the -e switch.
[ERROR] Re-run Maven using the -X switch to enable full debug logging.
[ERROR] 
[ERROR] For more information about the errors and possible solutions, please read the following
articles:
[ERROR] [Help 1] http://cwiki.apache.org/confluence/display/MAVEN/PluginResolutionException
[JENKINS] Archiving <https://builds.apache.org/job/streams-examples/ws/local/pom.xml>
to org.apache.streams/streams-examples-local/0.5-incubating-SNAPSHOT/streams-examples-local-0.5-incubating-SNAPSHOT.pom
[JENKINS] Archiving <https://builds.apache.org/job/streams-examples/ws/local/elasticsearch-reindex/pom.xml>
to org.apache.streams/elasticsearch-reindex/0.5-incubating-SNAPSHOT/elasticsearch-reindex-0.5-incubating-SNAPSHOT.pom
[JENKINS] Archiving <https://builds.apache.org/job/streams-examples/ws/local/twitter-follow-neo4j/pom.xml>
to org.apache.streams/twitter-follow-neo4j/0.5-incubating-SNAPSHOT/twitter-follow-neo4j-0.5-incubating-SNAPSHOT.pom
[JENKINS] Archiving <https://builds.apache.org/job/streams-examples/ws/local/elasticsearch-hdfs/pom.xml>
to org.apache.streams/elasticsearch-hdfs/0.5-incubating-SNAPSHOT/elasticsearch-hdfs-0.5-incubating-SNAPSHOT.pom
[JENKINS] Archiving <https://builds.apache.org/job/streams-examples/ws/local/twitter-userstream-elasticsearch/pom.xml>
to org.apache.streams/twitter-userstream-elasticsearch/0.5-incubating-SNAPSHOT/twitter-userstream-elasticsearch-0.5-incubating-SNAPSHOT.pom
[JENKINS] Archiving <https://builds.apache.org/job/streams-examples/ws/pom.xml> to org.apache.streams/streams-examples/0.5-incubating-SNAPSHOT/streams-examples-0.5-incubating-SNAPSHOT.pom
[JENKINS] Archiving <https://builds.apache.org/job/streams-examples/ws/target/streams-examples-0.5-incubating-SNAPSHOT-site.xml>
to org.apache.streams/streams-examples/0.5-incubating-SNAPSHOT/streams-examples-0.5-incubating-SNAPSHOT-site.xml
[JENKINS] Archiving <https://builds.apache.org/job/streams-examples/ws/flink/pom.xml>
to org.apache.streams/streams-examples-flink/0.5-incubating-SNAPSHOT/streams-examples-flink-0.5-incubating-SNAPSHOT.pom
[JENKINS] Archiving <https://builds.apache.org/job/streams-examples/ws/flink/target/streams-examples-flink-0.5-incubating-SNAPSHOT-site.xml>
to org.apache.streams/streams-examples-flink/0.5-incubating-SNAPSHOT/streams-examples-flink-0.5-incubating-SNAPSHOT-site.xml
[JENKINS] Archiving <https://builds.apache.org/job/streams-examples/ws/local/twitter-history-elasticsearch/pom.xml>
to org.apache.streams/twitter-history-elasticsearch/0.5-incubating-SNAPSHOT/twitter-history-elasticsearch-0.5-incubating-SNAPSHOT.pom
[JENKINS] Archiving <https://builds.apache.org/job/streams-examples/ws/flink/flink-twitter-collection/pom.xml>
to org.apache.streams/flink-twitter-collection/0.5-incubating-SNAPSHOT/flink-twitter-collection-0.5-incubating-SNAPSHOT.pom
[JENKINS] Archiving <https://builds.apache.org/job/streams-examples/ws/local/mongo-elasticsearch-sync/pom.xml>
to org.apache.streams/mongo-elasticsearch-sync/0.5-incubating-SNAPSHOT/mongo-elasticsearch-sync-0.5-incubating-SNAPSHOT.pom
channel stopped

Mime
View raw message