streams-commits mailing list archives

Site index · List index
Message view « Date » · « Thread »
Top « Date » · « Thread »
From Apache Jenkins Server <jenk...@builds.apache.org>
Subject Build failed in Jenkins: streams-examples #149
Date Fri, 18 Nov 2016 01:31:22 GMT
See <https://builds.apache.org/job/streams-examples/149/>

------------------------------------------
[...truncated 88 lines...]
[INFO] Downloading: https://repo.maven.apache.org/maven2/org/scala-lang/scala-library/2.11.6/scala-library-2.11.6.pom
[INFO] Downloaded: https://repo.maven.apache.org/maven2/org/scala-lang/scala-library/2.11.6/scala-library-2.11.6.pom
(2 KB at 86.9 KB/sec)
[INFO] Downloading: https://repo.maven.apache.org/maven2/org/scalariform/scalariform_2.11/0.1.7/scalariform_2.11-0.1.7.pom
[INFO] Downloaded: https://repo.maven.apache.org/maven2/org/scalariform/scalariform_2.11/0.1.7/scalariform_2.11-0.1.7.pom
(3 KB at 114.8 KB/sec)
[INFO] Downloading: https://repo.maven.apache.org/maven2/com/typesafe/config/1.2.0/config-1.2.0.pom
[INFO] Downloaded: https://repo.maven.apache.org/maven2/com/typesafe/config/1.2.0/config-1.2.0.pom
(2 KB at 107.2 KB/sec)
[INFO] Downloading: https://repo.maven.apache.org/maven2/org/scalastyle/scalastyle_2.11/0.8.0/scalastyle_2.11-0.8.0.jar
[INFO] Downloading: https://repo.maven.apache.org/maven2/org/scala-lang/scala-library/2.11.6/scala-library-2.11.6.jar
[INFO] Downloading: https://repo.maven.apache.org/maven2/org/scalariform/scalariform_2.11/0.1.7/scalariform_2.11-0.1.7.jar
[INFO] Downloading: https://repo.maven.apache.org/maven2/com/typesafe/config/1.2.0/config-1.2.0.jar
[INFO] Downloading: https://repo.maven.apache.org/maven2/org/codehaus/plexus/plexus-component-annotations/1.5.4/plexus-component-annotations-1.5.4.jar
[INFO] Downloaded: https://repo.maven.apache.org/maven2/org/codehaus/plexus/plexus-component-annotations/1.5.4/plexus-component-annotations-1.5.4.jar
(5 KB at 73.4 KB/sec)
[INFO] Downloaded: https://repo.maven.apache.org/maven2/com/typesafe/config/1.2.0/config-1.2.0.jar
(213 KB at 3083.9 KB/sec)
[INFO] Downloaded: https://repo.maven.apache.org/maven2/org/scalastyle/scalastyle_2.11/0.8.0/scalastyle_2.11-0.8.0.jar
(874 KB at 6286.8 KB/sec)
[INFO] Downloaded: https://repo.maven.apache.org/maven2/org/scalariform/scalariform_2.11/0.1.7/scalariform_2.11-0.1.7.jar
(1889 KB at 7741.2 KB/sec)
[INFO] Downloaded: https://repo.maven.apache.org/maven2/org/scala-lang/scala-library/2.11.6/scala-library-2.11.6.jar
(5434 KB at 14040.3 KB/sec)
[WARNING] sourceDirectory is not specified or does not exist value=<https://builds.apache.org/job/streams-examples/ws/src/main/scala>
[WARNING] testSourceDirectory is not specified or does not exist value=<https://builds.apache.org/job/streams-examples/ws/src/test/scala>
Saving to outputFile=<https://builds.apache.org/job/streams-examples/ws/target/scalastyle-output.xml>
Processed 0 file(s)
Found 0 errors
Found 0 warnings
Found 0 infos
Finished in 116 ms
[INFO] 
[INFO] --- maven-remote-resources-plugin:1.4:process (default) @ streams-examples ---
[INFO] Downloading: http://repo.maven.apache.org/maven2/org/apache/apache-incubator-disclaimer-resource-bundle/1.1/apache-incubator-disclaimer-resource-bundle-1.1.jar
[INFO] Downloaded: http://repo.maven.apache.org/maven2/org/apache/apache-incubator-disclaimer-resource-bundle/1.1/apache-incubator-disclaimer-resource-bundle-1.1.jar
(7 KB at 24.4 KB/sec)
[INFO] 
[INFO] --- maven-remote-resources-plugin:1.4:process (process-resource-bundles) @ streams-examples
---
[INFO] 
[INFO] --- maven-surefire-plugin:2.19.1:test (test) @ streams-examples ---
[INFO] No tests to run.
[JENKINS] Recording test results[INFO] 
[INFO] --- maven-site-plugin:3.5:attach-descriptor (attach-descriptor) @ streams-examples
---

[INFO] Downloading: https://repo.maven.apache.org/maven2/org/apache/maven/wagon/wagon-ssh/2.5/wagon-ssh-2.5.pom
[INFO] Downloaded: https://repo.maven.apache.org/maven2/org/apache/maven/wagon/wagon-ssh/2.5/wagon-ssh-2.5.pom
(6 KB at 60.7 KB/sec)
[INFO] Downloading: https://repo.maven.apache.org/maven2/org/apache/maven/wagon/wagon-providers/2.5/wagon-providers-2.5.pom
[INFO] Downloaded: https://repo.maven.apache.org/maven2/org/apache/maven/wagon/wagon-providers/2.5/wagon-providers-2.5.pom
(3 KB at 166.4 KB/sec)
[INFO] Downloading: https://repo.maven.apache.org/maven2/org/apache/maven/wagon/wagon/2.5/wagon-2.5.pom
[INFO] Downloaded: https://repo.maven.apache.org/maven2/org/apache/maven/wagon/wagon/2.5/wagon-2.5.pom
(20 KB at 1223.4 KB/sec)
[INFO] Downloading: https://repo.maven.apache.org/maven2/org/apache/maven/wagon/wagon-ssh-common/2.5/wagon-ssh-common-2.5.pom
[INFO] Downloaded: https://repo.maven.apache.org/maven2/org/apache/maven/wagon/wagon-ssh-common/2.5/wagon-ssh-common-2.5.pom
(2 KB at 19.7 KB/sec)
[INFO] Downloading: https://repo.maven.apache.org/maven2/org/apache/maven/wagon/wagon-provider-api/2.5/wagon-provider-api-2.5.pom
[INFO] Downloaded: https://repo.maven.apache.org/maven2/org/apache/maven/wagon/wagon-provider-api/2.5/wagon-provider-api-2.5.pom
(2 KB at 105.3 KB/sec)
[INFO] Downloading: https://repo.maven.apache.org/maven2/org/apache/maven/wagon/wagon-scm/2.5/wagon-scm-2.5.pom
[INFO] Downloaded: https://repo.maven.apache.org/maven2/org/apache/maven/wagon/wagon-scm/2.5/wagon-scm-2.5.pom
(3 KB at 2.5 KB/sec)
[INFO] Downloading: https://repo.maven.apache.org/maven2/org/apache/maven/doxia/doxia-decoration-model/1.7/doxia-decoration-model-1.7.pom
[INFO] Downloaded: https://repo.maven.apache.org/maven2/org/apache/maven/doxia/doxia-decoration-model/1.7/doxia-decoration-model-1.7.pom
(4 KB at 189.7 KB/sec)
[INFO] Downloading: https://repo.maven.apache.org/maven2/org/apache/maven/doxia/doxia-sitetools/1.7/doxia-sitetools-1.7.pom
[INFO] Downloaded: https://repo.maven.apache.org/maven2/org/apache/maven/doxia/doxia-sitetools/1.7/doxia-sitetools-1.7.pom
(14 KB at 812.2 KB/sec)
[INFO] Downloading: https://repo.maven.apache.org/maven2/org/apache/maven/doxia/doxia-site-renderer/1.7/doxia-site-renderer-1.7.pom
[INFO] Downloaded: https://repo.maven.apache.org/maven2/org/apache/maven/doxia/doxia-site-renderer/1.7/doxia-site-renderer-1.7.pom
(7 KB at 377.5 KB/sec)
[INFO] Downloading: https://repo.maven.apache.org/maven2/org/apache/maven/doxia/doxia-skin-model/1.7/doxia-skin-model-1.7.pom
[INFO] Downloaded: https://repo.maven.apache.org/maven2/org/apache/maven/doxia/doxia-skin-model/1.7/doxia-skin-model-1.7.pom
(3 KB at 159.3 KB/sec)
[INFO] Downloading: https://repo.maven.apache.org/maven2/org/apache/maven/doxia/doxia-integration-tools/1.7/doxia-integration-tools-1.7.pom
[INFO] Downloaded: https://repo.maven.apache.org/maven2/org/apache/maven/doxia/doxia-integration-tools/1.7/doxia-integration-tools-1.7.pom
(6 KB at 386.2 KB/sec)
[INFO] Downloading: https://repo.maven.apache.org/maven2/org/apache/maven/wagon/wagon-ssh/2.5/wagon-ssh-2.5.jar
[INFO] Downloading: https://repo.maven.apache.org/maven2/org/apache/maven/wagon/wagon-ssh-common/2.5/wagon-ssh-common-2.5.jar
[INFO] Downloading: https://repo.maven.apache.org/maven2/org/apache/maven/wagon/wagon-scm/2.5/wagon-scm-2.5.jar
[INFO] Downloading: https://repo.maven.apache.org/maven2/org/apache/maven/doxia/doxia-decoration-model/1.7/doxia-decoration-model-1.7.jar
[INFO] Downloading: https://repo.maven.apache.org/maven2/org/apache/maven/doxia/doxia-site-renderer/1.7/doxia-site-renderer-1.7.jar
[INFO] Downloaded: https://repo.maven.apache.org/maven2/org/apache/maven/wagon/wagon-ssh/2.5/wagon-ssh-2.5.jar
(29 KB at 1132.1 KB/sec)
[INFO] Downloading: https://repo.maven.apache.org/maven2/org/apache/maven/doxia/doxia-skin-model/1.7/doxia-skin-model-1.7.jar
[INFO] Downloaded: https://repo.maven.apache.org/maven2/org/apache/maven/doxia/doxia-decoration-model/1.7/doxia-decoration-model-1.7.jar
(59 KB at 1899.9 KB/sec)
[INFO] Downloading: https://repo.maven.apache.org/maven2/org/apache/maven/doxia/doxia-integration-tools/1.7/doxia-integration-tools-1.7.jar
[INFO] Downloaded: https://repo.maven.apache.org/maven2/org/apache/maven/doxia/doxia-site-renderer/1.7/doxia-site-renderer-1.7.jar
(61 KB at 1487.0 KB/sec)
[INFO] Downloaded: https://repo.maven.apache.org/maven2/org/apache/maven/doxia/doxia-skin-model/1.7/doxia-skin-model-1.7.jar
(16 KB at 389.9 KB/sec)
[INFO] Downloaded: https://repo.maven.apache.org/maven2/org/apache/maven/doxia/doxia-integration-tools/1.7/doxia-integration-tools-1.7.jar
(46 KB at 840.9 KB/sec)
[INFO] Downloaded: https://repo.maven.apache.org/maven2/org/apache/maven/wagon/wagon-ssh-common/2.5/wagon-ssh-common-2.5.jar
(25 KB at 248.1 KB/sec)
[INFO] Downloaded: https://repo.maven.apache.org/maven2/org/apache/maven/wagon/wagon-scm/2.5/wagon-scm-2.5.jar
(16 KB at 48.0 KB/sec)
[INFO] 
[INFO] --- maven-failsafe-plugin:2.19.1:integration-test (integration-tests) @ streams-examples
---
[INFO] Tests are skipped.
[INFO] 
[INFO] --- maven-failsafe-plugin:2.19.1:verify (integration-tests) @ streams-examples ---
[INFO] Tests are skipped.
[INFO] 
[INFO] --- maven-install-plugin:2.5.2:install (default-install) @ streams-examples ---
[INFO] Installing <https://builds.apache.org/job/streams-examples/ws/pom.xml> to /home/jenkins/jenkins-slave/maven-repositories/0/org/apache/streams/streams-examples/0.5-incubating-SNAPSHOT/streams-examples-0.5-incubating-SNAPSHOT.pom
[INFO] Installing <https://builds.apache.org/job/streams-examples/ws/target/streams-examples-0.5-incubating-SNAPSHOT-site.xml>
to /home/jenkins/jenkins-slave/maven-repositories/0/org/apache/streams/streams-examples/0.5-incubating-SNAPSHOT/streams-examples-0.5-incubating-SNAPSHOT-site.xml
[INFO] 
[INFO] --- maven-enforcer-plugin:1.4.1:enforce (enforce-java) @ streams-examples ---
[INFO] 
[INFO] --- maven-enforcer-plugin:1.4.1:enforce (enforce-banned-dependencies) @ streams-examples
---
[INFO] 
[INFO] --- maven-enforcer-plugin:1.4.1:enforce (enforce-no-snapshots) @ streams-examples ---
[INFO] 
[INFO] --- maven-checkstyle-plugin:2.17:check (validate) @ streams-examples ---
[INFO] Starting audit...
Audit done.
[INFO] 
[INFO] --- scalastyle-maven-plugin:0.8.0:check (validate) @ streams-examples ---
[WARNING] sourceDirectory is not specified or does not exist value=<https://builds.apache.org/job/streams-examples/ws/src/main/scala>
[WARNING] testSourceDirectory is not specified or does not exist value=<https://builds.apache.org/job/streams-examples/ws/src/test/scala>
Saving to outputFile=<https://builds.apache.org/job/streams-examples/ws/target/scalastyle-output.xml>
Processed 0 file(s)
Found 0 errors
Found 0 warnings
Found 0 infos
Finished in 1 ms
[INFO] 
[INFO] --- maven-remote-resources-plugin:1.4:process (default) @ streams-examples ---
[INFO] 
[INFO] --- maven-remote-resources-plugin:1.4:process (process-resource-bundles) @ streams-examples
---
[INFO] 
[INFO] --- maven-surefire-plugin:2.19.1:test (test) @ streams-examples ---
[INFO] No tests to run.
[INFO] Skipping execution of surefire because it has already been run for this configuration
[JENKINS] Recording test results[INFO] 
[INFO] --- maven-site-plugin:3.5:attach-descriptor (attach-descriptor) @ streams-examples
---

[INFO] 
[INFO] --- maven-failsafe-plugin:2.19.1:integration-test (integration-tests) @ streams-examples
---
[INFO] Tests are skipped.
[INFO] 
[INFO] --- maven-failsafe-plugin:2.19.1:verify (integration-tests) @ streams-examples ---
[INFO] Tests are skipped.
[INFO]                                                                         
[INFO] ------------------------------------------------------------------------
[INFO] Building streams-examples-flink 0.5-incubating-SNAPSHOT
[INFO] ------------------------------------------------------------------------
[INFO] 
[INFO] --- maven-clean-plugin:2.6:clean (default-clean) @ streams-examples-flink ---
[INFO] Deleting <https://builds.apache.org/job/streams-examples/ws/flink/target>
[INFO] 
[INFO] --- maven-enforcer-plugin:1.4.1:enforce (enforce-java) @ streams-examples-flink ---
[INFO] 
[INFO] --- maven-enforcer-plugin:1.4.1:enforce (enforce-banned-dependencies) @ streams-examples-flink
---
[INFO] 
[INFO] --- maven-enforcer-plugin:1.4.1:enforce (enforce-no-snapshots) @ streams-examples-flink
---
[INFO] 
[INFO] --- maven-checkstyle-plugin:2.17:check (validate) @ streams-examples-flink ---
[INFO] Starting audit...
Audit done.
[INFO] 
[INFO] --- scalastyle-maven-plugin:0.8.0:check (validate) @ streams-examples-flink ---
[WARNING] sourceDirectory is not specified or does not exist value=<https://builds.apache.org/job/streams-examples/ws/flink/src/main/scala>
[WARNING] testSourceDirectory is not specified or does not exist value=<https://builds.apache.org/job/streams-examples/ws/flink/src/test/scala>
Saving to outputFile=<https://builds.apache.org/job/streams-examples/ws/flink/target/scalastyle-output.xml>
Processed 0 file(s)
Found 0 errors
Found 0 warnings
Found 0 infos
Finished in 1 ms
[INFO] 
[INFO] --- maven-remote-resources-plugin:1.4:process (default) @ streams-examples-flink ---
[INFO] 
[INFO] --- maven-remote-resources-plugin:1.4:process (process-resource-bundles) @ streams-examples-flink
---
[INFO] 
[INFO] --- maven-surefire-plugin:2.19.1:test (test) @ streams-examples-flink ---
[INFO] No tests to run.
[JENKINS] Recording test results[INFO] 
[INFO] --- maven-site-plugin:3.5:attach-descriptor (attach-descriptor) @ streams-examples-flink
---

[INFO] 
[INFO] --- maven-failsafe-plugin:2.19.1:integration-test (integration-tests) @ streams-examples-flink
---
[INFO] Tests are skipped.
[INFO] 
[INFO] --- maven-failsafe-plugin:2.19.1:verify (integration-tests) @ streams-examples-flink
---
[INFO] Tests are skipped.
[INFO] 
[INFO] --- maven-install-plugin:2.5.2:install (default-install) @ streams-examples-flink ---
[INFO] Installing <https://builds.apache.org/job/streams-examples/ws/flink/pom.xml>
to /home/jenkins/jenkins-slave/maven-repositories/0/org/apache/streams/streams-examples-flink/0.5-incubating-SNAPSHOT/streams-examples-flink-0.5-incubating-SNAPSHOT.pom
[INFO] Installing <https://builds.apache.org/job/streams-examples/ws/flink/target/streams-examples-flink-0.5-incubating-SNAPSHOT-site.xml>
to /home/jenkins/jenkins-slave/maven-repositories/0/org/apache/streams/streams-examples-flink/0.5-incubating-SNAPSHOT/streams-examples-flink-0.5-incubating-SNAPSHOT-site.xml
[INFO] 
[INFO] --- maven-enforcer-plugin:1.4.1:enforce (enforce-java) @ streams-examples-flink ---
[INFO] 
[INFO] --- maven-enforcer-plugin:1.4.1:enforce (enforce-banned-dependencies) @ streams-examples-flink
---
[INFO] 
[INFO] --- maven-enforcer-plugin:1.4.1:enforce (enforce-no-snapshots) @ streams-examples-flink
---
[INFO] 
[INFO] --- maven-checkstyle-plugin:2.17:check (validate) @ streams-examples-flink ---
[INFO] Starting audit...
Audit done.
[INFO] 
[INFO] --- scalastyle-maven-plugin:0.8.0:check (validate) @ streams-examples-flink ---
[WARNING] sourceDirectory is not specified or does not exist value=<https://builds.apache.org/job/streams-examples/ws/flink/src/main/scala>
[WARNING] testSourceDirectory is not specified or does not exist value=<https://builds.apache.org/job/streams-examples/ws/flink/src/test/scala>
Saving to outputFile=<https://builds.apache.org/job/streams-examples/ws/flink/target/scalastyle-output.xml>
Processed 0 file(s)
Found 0 errors
Found 0 warnings
Found 0 infos
Finished in 1 ms
[INFO] 
[INFO] --- maven-remote-resources-plugin:1.4:process (default) @ streams-examples-flink ---
[INFO] 
[INFO] --- maven-remote-resources-plugin:1.4:process (process-resource-bundles) @ streams-examples-flink
---
[INFO] 
[INFO] --- maven-surefire-plugin:2.19.1:test (test) @ streams-examples-flink ---
[INFO] No tests to run.
[INFO] Skipping execution of surefire because it has already been run for this configuration
[JENKINS] Recording test results[INFO] 
[INFO] --- maven-site-plugin:3.5:attach-descriptor (attach-descriptor) @ streams-examples-flink
---

[INFO] 
[INFO] --- maven-failsafe-plugin:2.19.1:integration-test (integration-tests) @ streams-examples-flink
---
[INFO] Tests are skipped.
[INFO] 
[INFO] --- maven-failsafe-plugin:2.19.1:verify (integration-tests) @ streams-examples-flink
---
[INFO] Tests are skipped.
[INFO]                                                                         
[INFO] ------------------------------------------------------------------------
[INFO] Building flink-twitter-collection 0.5-incubating-SNAPSHOT
[INFO] ------------------------------------------------------------------------
[WARNING] The POM for org.apache.streams.plugins:streams-plugin-pojo:jar:0.5-incubating-SNAPSHOT
is missing, no dependency information available
[INFO] ------------------------------------------------------------------------
[INFO] Reactor Summary:
[INFO] 
[INFO] streams-examples ................................... SUCCESS [ 16.334 s]
[INFO] streams-examples-flink ............................. SUCCESS [  2.210 s]
[INFO] flink-twitter-collection ........................... FAILURE [  0.080 s]
[INFO] streams-examples-local ............................. SKIPPED
[INFO] elasticsearch-hdfs ................................. SKIPPED
[INFO] elasticsearch-reindex .............................. SKIPPED
[INFO] mongo-elasticsearch-sync ........................... SKIPPED
[INFO] twitter-follow-neo4j ............................... SKIPPED
[INFO] twitter-history-elasticsearch ...................... SKIPPED
[INFO] twitter-userstream-elasticsearch ................... SKIPPED
[INFO] ------------------------------------------------------------------------
[INFO] BUILD FAILURE
[INFO] ------------------------------------------------------------------------
[INFO] Total time: 22.856 s
[INFO] Finished at: 2016-11-18T01:31:27+00:00
[INFO] Final Memory: 33M/396M
[INFO] ------------------------------------------------------------------------
Waiting for Jenkins to finish collecting data[ERROR] Plugin org.apache.streams.plugins:streams-plugin-pojo:0.5-incubating-SNAPSHOT
or one of its dependencies could not be resolved: Could not find artifact org.apache.streams.plugins:streams-plugin-pojo:jar:0.5-incubating-SNAPSHOT
-> [Help 1]
[ERROR] 
[ERROR] To see the full stack trace of the errors, re-run Maven with the -e switch.
[ERROR] Re-run Maven using the -X switch to enable full debug logging.
[ERROR] 
[ERROR] For more information about the errors and possible solutions, please read the following
articles:
[ERROR] [Help 1] http://cwiki.apache.org/confluence/display/MAVEN/PluginResolutionException

[JENKINS] Archiving <https://builds.apache.org/job/streams-examples/ws/local/pom.xml>
to org.apache.streams/streams-examples-local/0.5-incubating-SNAPSHOT/streams-examples-local-0.5-incubating-SNAPSHOT.pom
[JENKINS] Archiving <https://builds.apache.org/job/streams-examples/ws/local/elasticsearch-reindex/pom.xml>
to org.apache.streams/elasticsearch-reindex/0.5-incubating-SNAPSHOT/elasticsearch-reindex-0.5-incubating-SNAPSHOT.pom
[JENKINS] Archiving <https://builds.apache.org/job/streams-examples/ws/local/twitter-follow-neo4j/pom.xml>
to org.apache.streams/twitter-follow-neo4j/0.5-incubating-SNAPSHOT/twitter-follow-neo4j-0.5-incubating-SNAPSHOT.pom
[JENKINS] Archiving <https://builds.apache.org/job/streams-examples/ws/local/elasticsearch-hdfs/pom.xml>
to org.apache.streams/elasticsearch-hdfs/0.5-incubating-SNAPSHOT/elasticsearch-hdfs-0.5-incubating-SNAPSHOT.pom
[JENKINS] Archiving <https://builds.apache.org/job/streams-examples/ws/local/twitter-userstream-elasticsearch/pom.xml>
to org.apache.streams/twitter-userstream-elasticsearch/0.5-incubating-SNAPSHOT/twitter-userstream-elasticsearch-0.5-incubating-SNAPSHOT.pom
[JENKINS] Archiving <https://builds.apache.org/job/streams-examples/ws/pom.xml> to org.apache.streams/streams-examples/0.5-incubating-SNAPSHOT/streams-examples-0.5-incubating-SNAPSHOT.pom
[JENKINS] Archiving <https://builds.apache.org/job/streams-examples/ws/target/streams-examples-0.5-incubating-SNAPSHOT-site.xml>
to org.apache.streams/streams-examples/0.5-incubating-SNAPSHOT/streams-examples-0.5-incubating-SNAPSHOT-site.xml
[JENKINS] Archiving <https://builds.apache.org/job/streams-examples/ws/flink/pom.xml>
to org.apache.streams/streams-examples-flink/0.5-incubating-SNAPSHOT/streams-examples-flink-0.5-incubating-SNAPSHOT.pom
[JENKINS] Archiving <https://builds.apache.org/job/streams-examples/ws/flink/target/streams-examples-flink-0.5-incubating-SNAPSHOT-site.xml>
to org.apache.streams/streams-examples-flink/0.5-incubating-SNAPSHOT/streams-examples-flink-0.5-incubating-SNAPSHOT-site.xml
[JENKINS] Archiving <https://builds.apache.org/job/streams-examples/ws/local/twitter-history-elasticsearch/pom.xml>
to org.apache.streams/twitter-history-elasticsearch/0.5-incubating-SNAPSHOT/twitter-history-elasticsearch-0.5-incubating-SNAPSHOT.pom
[JENKINS] Archiving <https://builds.apache.org/job/streams-examples/ws/flink/flink-twitter-collection/pom.xml>
to org.apache.streams/flink-twitter-collection/0.5-incubating-SNAPSHOT/flink-twitter-collection-0.5-incubating-SNAPSHOT.pom
[JENKINS] Archiving <https://builds.apache.org/job/streams-examples/ws/local/mongo-elasticsearch-sync/pom.xml>
to org.apache.streams/mongo-elasticsearch-sync/0.5-incubating-SNAPSHOT/mongo-elasticsearch-sync-0.5-incubating-SNAPSHOT.pom
channel stopped

Mime
View raw message