streams-commits mailing list archives

Site index · List index
Message view « Date » · « Thread »
Top « Date » · « Thread »
From Apache Jenkins Server <jenk...@builds.apache.org>
Subject Build failed in Jenkins: Streams Trunk #237
Date Mon, 17 Oct 2016 18:06:16 GMT
See <https://builds.apache.org/job/Streams%20Trunk/237/>

------------------------------------------
[...truncated 274 lines...]
30836 [TEST-LocalStreamBuilderTest.testParallelLinearStream1-seed#[D5DFB666C0C04205]] WARN
 o.a.s.l.builders.LocalStreamBuilder - Task org.apache.streams.local.tasks.StreamsPersistWriterTask@39c2648b
failed to terminate in allotted timeframe 
347522 [TEST-LocalStreamBuilderTest.testSlowProcessorBranch-seed#[D5DFB666C0C04205]] WARN
 o.a.s.l.builders.LocalStreamBuilder - Task org.apache.streams.local.tasks.StreamsPersistWriterTask@7520d2a
failed to terminate in allotted timeframe 
365547 [TEST-LocalStreamBuilderTest.testBasicLinearStream2-seed#[D5DFB666C0C04205]] WARN 
o.a.s.l.builders.LocalStreamBuilder - Task org.apache.streams.local.tasks.StreamsPersistWriterTask@68887242
failed to terminate in allotted timeframe 
396578 [TEST-LocalStreamBuilderTest.testConfiguredProviderTimeout-seed#[D5DFB666C0C04205]]
WARN  o.a.s.l.builders.LocalStreamBuilder - Task org.apache.streams.local.tasks.StreamsPersistWriterTask@12da2ebd
failed to terminate in allotted timeframe 
422609 [TEST-LocalStreamBuilderTest.testBasicBranch-seed#[D5DFB666C0C04205]] WARN  o.a.s.l.builders.LocalStreamBuilder
- Task org.apache.streams.local.tasks.StreamsPersistWriterTask@6eb53873 failed to terminate
in allotted timeframe 
450624 [TEST-LocalStreamBuilderTest.testBasicLinearStream3-seed#[D5DFB666C0C04205]] WARN 
o.a.s.l.builders.LocalStreamBuilder - Task org.apache.streams.local.tasks.StreamsPersistWriterTask@70c21e36
failed to terminate in allotted timeframe 
469670 [TEST-LocalStreamBuilderTest.testBasicMergeStream-seed#[D5DFB666C0C04205]] WARN  o.a.s.l.builders.LocalStreamBuilder
- Task org.apache.streams.local.tasks.StreamsPersistWriterTask@7db2ba6d failed to terminate
in allotted timeframe 
495910 [TEST-LocalStreamBuilderTest.testBasicLinearStreamRandom-seed#[D5DFB666C0C04205]] WARN
 o.a.s.l.builders.LocalStreamBuilder - Task org.apache.streams.local.tasks.StreamsPersistWriterTask@2379856d
failed to terminate in allotted timeframe 
539449 [TEST-LocalStreamBuilderTest.testBasicLinearStreamRandom-seed#[D5DFB666C0C04205]] WARN
 o.a.s.l.builders.LocalStreamBuilder - Task org.apache.streams.local.tasks.StreamsPersistWriterTask@35beb3c4
failed to terminate in allotted timeframe 
572288 [TEST-LocalStreamBuilderTest.testBasicLinearStreamRandom-seed#[D5DFB666C0C04205]] WARN
 o.a.s.l.builders.LocalStreamBuilder - Task org.apache.streams.local.tasks.StreamsPersistWriterTask@49b811b4
failed to terminate in allotted timeframe 
Tests run: 13, Failures: 0, Errors: 0, Skipped: 1, Time elapsed: 587.028 sec - in org.apache.streams.local.builders.LocalStreamBuilderTest
Running org.apache.streams.local.tasks.StreamsProviderTaskTest
930  [pool-2-thread-1] ERROR o.a.s.l.tasks.StreamsProviderTask - Caught Throwable in Provider
StreamsProvider$$EnhancerByMockitoWithCGLIB$$75fdf663 
java.lang.RuntimeException: null
	at org.apache.streams.local.tasks.StreamsProviderTask.run(StreamsProviderTask.java:154) ~[classes/:na]
	at java.util.concurrent.Executors$RunnableAdapter.call(Executors.java:471) [na:1.7.0_80]
	at java.util.concurrent.FutureTask.run(FutureTask.java:262) [na:1.7.0_80]
	at java.util.concurrent.ThreadPoolExecutor.runWorker(ThreadPoolExecutor.java:1145) [na:1.7.0_80]
	at java.util.concurrent.ThreadPoolExecutor$Worker.run(ThreadPoolExecutor.java:615) [na:1.7.0_80]
	at java.lang.Thread.run(Thread.java:745) [na:1.7.0_80]
Tests run: 5, Failures: 0, Errors: 0, Skipped: 0, Time elapsed: 2.149 sec - in org.apache.streams.local.tasks.StreamsProviderTaskTest
Running org.apache.streams.local.tasks.BasicTasksTest
Tests run: 6, Failures: 0, Errors: 0, Skipped: 0, Time elapsed: 36.587 sec - in org.apache.streams.local.tasks.BasicTasksTest

Results :

Tests run: 67, Failures: 0, Errors: 0, Skipped: 1

[JENKINS] Recording test results
[JENKINS] Recording test results
[INFO] Installing <https://builds.apache.org/job/Streams%20Trunk/ws/streams-runtimes/streams-runtime-local/target/streams-runtime-local-0.4-incubating-SNAPSHOT.jar>
to /home/jenkins/jenkins-slave/maven-repositories/1/org/apache/streams/streams-runtime-local/0.4-incubating-SNAPSHOT/streams-runtime-local-0.4-incubating-SNAPSHOT.jar
[INFO] Installing <https://builds.apache.org/job/Streams%20Trunk/ws/streams-runtimes/streams-runtime-local/pom.xml>
to /home/jenkins/jenkins-slave/maven-repositories/1/org/apache/streams/streams-runtime-local/0.4-incubating-SNAPSHOT/streams-runtime-local-0.4-incubating-SNAPSHOT.pom
[INFO] Installing <https://builds.apache.org/job/Streams%20Trunk/ws/streams-runtimes/streams-runtime-local/target/streams-runtime-local-0.4-incubating-SNAPSHOT-tests.jar>
to /home/jenkins/jenkins-slave/maven-repositories/1/org/apache/streams/streams-runtime-local/0.4-incubating-SNAPSHOT/streams-runtime-local-0.4-incubating-SNAPSHOT-tests.jar
[JENKINS] Recording test results
[JENKINS] Recording test results
[JENKINS] Recording test results
[INFO] Installing <https://builds.apache.org/job/Streams%20Trunk/ws/streams-contrib/pom.xml>
to /home/jenkins/jenkins-slave/maven-repositories/1/org/apache/streams/streams-contrib/0.4-incubating-SNAPSHOT/streams-contrib-0.4-incubating-SNAPSHOT.pom
[JENKINS] Recording test results
[JENKINS] Recording test results
[JENKINS] Recording test results
[INFO] Installing <https://builds.apache.org/job/Streams%20Trunk/ws/streams-contrib/streams-persist-console/target/streams-persist-console-0.4-incubating-SNAPSHOT.jar>
to /home/jenkins/jenkins-slave/maven-repositories/1/org/apache/streams/streams-persist-console/0.4-incubating-SNAPSHOT/streams-persist-console-0.4-incubating-SNAPSHOT.jar
[INFO] Installing <https://builds.apache.org/job/Streams%20Trunk/ws/streams-contrib/streams-persist-console/pom.xml>
to /home/jenkins/jenkins-slave/maven-repositories/1/org/apache/streams/streams-persist-console/0.4-incubating-SNAPSHOT/streams-persist-console-0.4-incubating-SNAPSHOT.pom
[JENKINS] Recording test results
[JENKINS] Recording test results

-------------------------------------------------------
 T E S T S
-------------------------------------------------------
Running org.apache.streams.pojo.extensions.test.ExtensionUtilTest
Tests run: 1, Failures: 0, Errors: 0, Skipped: 0, Time elapsed: 0.596 sec - in org.apache.streams.pojo.extensions.test.ExtensionUtilTest

Results :

Tests run: 1, Failures: 0, Errors: 0, Skipped: 0

[JENKINS] Recording test results
[JENKINS] Recording test results
[INFO] Installing <https://builds.apache.org/job/Streams%20Trunk/ws/streams-pojo-extensions/target/streams-pojo-extensions-0.4-incubating-SNAPSHOT.jar>
to /home/jenkins/jenkins-slave/maven-repositories/1/org/apache/streams/streams-pojo-extensions/0.4-incubating-SNAPSHOT/streams-pojo-extensions-0.4-incubating-SNAPSHOT.jar
[INFO] Installing <https://builds.apache.org/job/Streams%20Trunk/ws/streams-pojo-extensions/pom.xml>
to /home/jenkins/jenkins-slave/maven-repositories/1/org/apache/streams/streams-pojo-extensions/0.4-incubating-SNAPSHOT/streams-pojo-extensions-0.4-incubating-SNAPSHOT.pom
[JENKINS] Recording test results
[JENKINS] Recording test results

-------------------------------------------------------
 T E S T S
-------------------------------------------------------
Running org.apache.streams.elasticsearch.processor.PercolateTagProcessorTest
Tests run: 1, Failures: 0, Errors: 0, Skipped: 0, Time elapsed: 0.107 sec - in org.apache.streams.elasticsearch.processor.PercolateTagProcessorTest

Results :

Tests run: 1, Failures: 0, Errors: 0, Skipped: 0

[JENKINS] Recording test results
[JENKINS] Recording test results
[INFO] Installing <https://builds.apache.org/job/Streams%20Trunk/ws/streams-contrib/streams-persist-elasticsearch/target/streams-persist-elasticsearch-0.4-incubating-SNAPSHOT.jar>
to /home/jenkins/jenkins-slave/maven-repositories/1/org/apache/streams/streams-persist-elasticsearch/0.4-incubating-SNAPSHOT/streams-persist-elasticsearch-0.4-incubating-SNAPSHOT.jar
[INFO] Installing <https://builds.apache.org/job/Streams%20Trunk/ws/streams-contrib/streams-persist-elasticsearch/pom.xml>
to /home/jenkins/jenkins-slave/maven-repositories/1/org/apache/streams/streams-persist-elasticsearch/0.4-incubating-SNAPSHOT/streams-persist-elasticsearch-0.4-incubating-SNAPSHOT.pom
[INFO] Installing <https://builds.apache.org/job/Streams%20Trunk/ws/streams-contrib/streams-persist-elasticsearch/target/streams-persist-elasticsearch-0.4-incubating-SNAPSHOT-tests.jar>
to /home/jenkins/jenkins-slave/maven-repositories/1/org/apache/streams/streams-persist-elasticsearch/0.4-incubating-SNAPSHOT/streams-persist-elasticsearch-0.4-incubating-SNAPSHOT-tests.jar
[JENKINS] Recording test results
[JENKINS] Recording test results
[JENKINS] Recording test results
[JENKINS] Recording test results
[INFO] Installing <https://builds.apache.org/job/Streams%20Trunk/ws/streams-contrib/streams-persist-filebuffer/target/streams-persist-filebuffer-0.4-incubating-SNAPSHOT.jar>
to /home/jenkins/jenkins-slave/maven-repositories/1/org/apache/streams/streams-persist-filebuffer/0.4-incubating-SNAPSHOT/streams-persist-filebuffer-0.4-incubating-SNAPSHOT.jar
[INFO] Installing <https://builds.apache.org/job/Streams%20Trunk/ws/streams-contrib/streams-persist-filebuffer/pom.xml>
to /home/jenkins/jenkins-slave/maven-repositories/1/org/apache/streams/streams-persist-filebuffer/0.4-incubating-SNAPSHOT/streams-persist-filebuffer-0.4-incubating-SNAPSHOT.pom
[JENKINS] Recording test results
[JENKINS] Recording test results
[JENKINS] Recording test results
[JENKINS] Recording test results
[INFO] Installing <https://builds.apache.org/job/Streams%20Trunk/ws/streams-contrib/streams-persist-hbase/target/streams-persist-hbase-0.4-incubating-SNAPSHOT.jar>
to /home/jenkins/jenkins-slave/maven-repositories/1/org/apache/streams/streams-persist-hbase/0.4-incubating-SNAPSHOT/streams-persist-hbase-0.4-incubating-SNAPSHOT.jar
[INFO] Installing <https://builds.apache.org/job/Streams%20Trunk/ws/streams-contrib/streams-persist-hbase/pom.xml>
to /home/jenkins/jenkins-slave/maven-repositories/1/org/apache/streams/streams-persist-hbase/0.4-incubating-SNAPSHOT/streams-persist-hbase-0.4-incubating-SNAPSHOT.pom
[JENKINS] Recording test results
[JENKINS] Recording test results
[JENKINS] Recording test results
[INFO] Installing <https://builds.apache.org/job/Streams%20Trunk/ws/streams-components/pom.xml>
to /home/jenkins/jenkins-slave/maven-repositories/1/org/apache/streams/streams-components/0.4-incubating-SNAPSHOT/streams-components-0.4-incubating-SNAPSHOT.pom
[JENKINS] Recording test results

-------------------------------------------------------
 T E S T S
-------------------------------------------------------
Running org.apache.streams.converter.test.CustomActivityConverterProcessorTest
Tests run: 3, Failures: 0, Errors: 0, Skipped: 0, Time elapsed: 1.194 sec - in org.apache.streams.converter.test.CustomActivityConverterProcessorTest
Running org.apache.streams.converter.test.BaseActivityObjectConverterProcessorTest
958  [main] WARN  o.a.s.c.ActivityObjectConverterProcessor - General exception in process!
null 
Tests run: 3, Failures: 0, Errors: 0, Skipped: 0, Time elapsed: 1.347 sec - in org.apache.streams.converter.test.BaseActivityObjectConverterProcessorTest
Running org.apache.streams.converter.test.TypeConverterProcessorTest
Tests run: 7, Failures: 0, Errors: 0, Skipped: 0, Time elapsed: 1.125 sec - in org.apache.streams.converter.test.TypeConverterProcessorTest
Running org.apache.streams.converter.test.HoconConverterTest
Tests run: 4, Failures: 0, Errors: 0, Skipped: 0, Time elapsed: 0.875 sec - in org.apache.streams.converter.test.HoconConverterTest
Running org.apache.streams.converter.test.NoConfigActivityConverterProcessorTest
Tests run: 3, Failures: 0, Errors: 0, Skipped: 0, Time elapsed: 1.162 sec - in org.apache.streams.converter.test.NoConfigActivityConverterProcessorTest
Running org.apache.streams.converter.test.HoconConverterProcessorTest
Tests run: 3, Failures: 0, Errors: 0, Skipped: 0, Time elapsed: 0.861 sec - in org.apache.streams.converter.test.HoconConverterProcessorTest
Running org.apache.streams.converter.test.CustomActivityObjectConverterProcessorTest
Tests run: 3, Failures: 0, Errors: 0, Skipped: 0, Time elapsed: 1.296 sec - in org.apache.streams.converter.test.CustomActivityObjectConverterProcessorTest
Running org.apache.streams.converter.test.BaseActivityConverterProcessorTest
Tests run: 3, Failures: 0, Errors: 0, Skipped: 0, Time elapsed: 1.404 sec - in org.apache.streams.converter.test.BaseActivityConverterProcessorTest

Results :

Tests run: 29, Failures: 0, Errors: 0, Skipped: 0

[JENKINS] Recording test results
[JENKINS] Recording test results
[INFO] Installing <https://builds.apache.org/job/Streams%20Trunk/ws/streams-components/streams-converters/target/streams-converters-0.4-incubating-SNAPSHOT.jar>
to /home/jenkins/jenkins-slave/maven-repositories/1/org/apache/streams/streams-converters/0.4-incubating-SNAPSHOT/streams-converters-0.4-incubating-SNAPSHOT.jar
[INFO] Installing <https://builds.apache.org/job/Streams%20Trunk/ws/streams-components/streams-converters/pom.xml>
to /home/jenkins/jenkins-slave/maven-repositories/1/org/apache/streams/streams-converters/0.4-incubating-SNAPSHOT/streams-converters-0.4-incubating-SNAPSHOT.pom
[JENKINS] Recording test results
[JENKINS] Recording test results
org.codehaus.plexus.archiver.ArchiverException: The source must not be a directory.
	at org.codehaus.plexus.archiver.AbstractUnArchiver.validate(AbstractUnArchiver.java:185)
	at org.codehaus.plexus.archiver.AbstractUnArchiver.extract(AbstractUnArchiver.java:118)
	at org.apache.maven.plugin.dependency.AbstractDependencyMojo.unpack(AbstractDependencyMojo.java:258)
	at org.apache.maven.plugin.dependency.UnpackDependenciesMojo.execute(UnpackDependenciesMojo.java:88)
	at org.apache.maven.plugin.DefaultBuildPluginManager.executeMojo(DefaultBuildPluginManager.java:134)
	at org.apache.maven.lifecycle.internal.MojoExecutor.execute(MojoExecutor.java:208)
	at org.apache.maven.lifecycle.internal.MojoExecutor.execute(MojoExecutor.java:153)
	at org.apache.maven.lifecycle.internal.MojoExecutor.execute(MojoExecutor.java:145)
	at org.apache.maven.lifecycle.internal.LifecycleModuleBuilder.buildProject(LifecycleModuleBuilder.java:116)
	at org.apache.maven.lifecycle.internal.LifecycleModuleBuilder.buildProject(LifecycleModuleBuilder.java:80)
	at org.apache.maven.lifecycle.internal.builder.singlethreaded.SingleThreadedBuilder.build(SingleThreadedBuilder.java:51)
	at org.apache.maven.lifecycle.internal.LifecycleStarter.execute(LifecycleStarter.java:128)
	at org.apache.maven.DefaultMaven.doExecute(DefaultMaven.java:307)
	at org.apache.maven.DefaultMaven.doExecute(DefaultMaven.java:193)
	at org.apache.maven.DefaultMaven.execute(DefaultMaven.java:106)
	at org.jvnet.hudson.maven3.launcher.Maven32Launcher.main(Maven32Launcher.java:132)
	at sun.reflect.NativeMethodAccessorImpl.invoke0(Native Method)
	at sun.reflect.NativeMethodAccessorImpl.invoke(NativeMethodAccessorImpl.java:57)
	at sun.reflect.DelegatingMethodAccessorImpl.invoke(DelegatingMethodAccessorImpl.java:43)
	at java.lang.reflect.Method.invoke(Method.java:606)
	at org.codehaus.plexus.classworlds.launcher.Launcher.launchStandard(Launcher.java:330)
	at org.codehaus.plexus.classworlds.launcher.Launcher.launch(Launcher.java:238)
	at jenkins.maven3.agent.Maven32Main.launch(Maven32Main.java:186)
	at sun.reflect.NativeMethodAccessorImpl.invoke0(Native Method)
	at sun.reflect.NativeMethodAccessorImpl.invoke(NativeMethodAccessorImpl.java:57)
	at sun.reflect.DelegatingMethodAccessorImpl.invoke(DelegatingMethodAccessorImpl.java:43)
	at java.lang.reflect.Method.invoke(Method.java:606)
	at hudson.maven.Maven3Builder.call(Maven3Builder.java:136)
	at hudson.maven.Maven3Builder.call(Maven3Builder.java:71)
	at hudson.remoting.UserRequest.perform(UserRequest.java:153)
	at hudson.remoting.UserRequest.perform(UserRequest.java:50)
	at hudson.remoting.Request$2.run(Request.java:332)
	at hudson.remoting.InterceptingExecutorService$1.call(InterceptingExecutorService.java:68)
	at java.util.concurrent.FutureTask.run(FutureTask.java:262)
	at java.util.concurrent.ThreadPoolExecutor.runWorker(ThreadPoolExecutor.java:1145)
	at java.util.concurrent.ThreadPoolExecutor$Worker.run(ThreadPoolExecutor.java:615)
	at java.lang.Thread.run(Thread.java:745)
Waiting for Jenkins to finish collecting data
[ERROR] Failed to execute goal org.apache.maven.plugins:maven-dependency-plugin:2.4:unpack-dependencies
(resource-dependencies) on project streams-persist-hdfs: Error unpacking file: <https://builds.apache.org/job/Streams%20Trunk/ws/streams-pojo/target/classes>
to: <https://builds.apache.org/job/Streams%20Trunk/ws/streams-contrib/streams-persist-hdfs/target/test-classes>
[ERROR] org.codehaus.plexus.archiver.ArchiverException: The source must not be a directory.
[ERROR] -> [Help 1]
[ERROR] 
[ERROR] To see the full stack trace of the errors, re-run Maven with the -e switch.
[ERROR] Re-run Maven using the -X switch to enable full debug logging.
[ERROR] 
[ERROR] For more information about the errors and possible solutions, please read the following
articles:
[ERROR] [Help 1] http://cwiki.apache.org/confluence/display/MAVEN/MojoExecutionException
[ERROR] 
[ERROR] After correcting the problems, you can resume the build with the command
[ERROR]   mvn <goals> -rf :streams-persist-hdfs
[JENKINS] Archiving <https://builds.apache.org/job/Streams%20Trunk/ws/streams-components/streams-filters/pom.xml>
to org.apache.streams/streams-filters/0.4-incubating-SNAPSHOT/streams-filters-0.4-incubating-SNAPSHOT.pom
[JENKINS] Archiving <https://builds.apache.org/job/Streams%20Trunk/ws/streams-runtimes/streams-runtime-pig/pom.xml>
to org.apache.streams/streams-runtime-pig/0.4-incubating-SNAPSHOT/streams-runtime-pig-0.4-incubating-SNAPSHOT.pom
[JENKINS] Archiving <https://builds.apache.org/job/Streams%20Trunk/ws/streams-core/pom.xml>
to org.apache.streams/streams-core/0.4-incubating-SNAPSHOT/streams-core-0.4-incubating-SNAPSHOT.pom
[JENKINS] Archiving <https://builds.apache.org/job/Streams%20Trunk/ws/streams-contrib/streams-provider-gnip/pom.xml>
to org.apache.streams/streams-provider-gnip/0.4-incubating-SNAPSHOT/streams-provider-gnip-0.4-incubating-SNAPSHOT.pom
[JENKINS] Archiving <https://builds.apache.org/job/Streams%20Trunk/ws/streams-contrib/streams-processor-regex/pom.xml>
to org.apache.streams/streams-processor-regex/0.4-incubating-SNAPSHOT/streams-processor-regex-0.4-incubating-SNAPSHOT.pom
[JENKINS] Archiving <https://builds.apache.org/job/Streams%20Trunk/ws/streams-runtimes/pom.xml>
to org.apache.streams/streams-runtimes/0.4-incubating-SNAPSHOT/streams-runtimes-0.4-incubating-SNAPSHOT.pom
[JENKINS] Archiving <https://builds.apache.org/job/Streams%20Trunk/ws/streams-contrib/streams-persist-filebuffer/pom.xml>
to org.apache.streams/streams-persist-filebuffer/0.4-incubating-SNAPSHOT/streams-persist-filebuffer-0.4-incubating-SNAPSHOT.pom
[JENKINS] Archiving <https://builds.apache.org/job/Streams%20Trunk/ws/streams-plugins/streams-plugin-hive/pom.xml>
to org.apache.streams.plugins/streams-plugin-hive/0.4-incubating-SNAPSHOT/streams-plugin-hive-0.4-incubating-SNAPSHOT.pom
[JENKINS] Archiving <https://builds.apache.org/job/Streams%20Trunk/ws/streams-components/streams-converters/pom.xml>
to org.apache.streams/streams-converters/0.4-incubating-SNAPSHOT/streams-converters-0.4-incubating-SNAPSHOT.pom
[JENKINS] Archiving <https://builds.apache.org/job/Streams%20Trunk/ws/streams-contrib/streams-persist-console/pom.xml>
to org.apache.streams/streams-persist-console/0.4-incubating-SNAPSHOT/streams-persist-console-0.4-incubating-SNAPSHOT.pom
[JENKINS] Archiving <https://builds.apache.org/job/Streams%20Trunk/ws/streams-contrib/pom.xml>
to org.apache.streams/streams-contrib/0.4-incubating-SNAPSHOT/streams-contrib-0.4-incubating-SNAPSHOT.pom
[JENKINS] Archiving <https://builds.apache.org/job/Streams%20Trunk/ws/streams-contrib/streams-amazon-aws/pom.xml>
to org.apache.streams/streams-amazon-aws/0.4-incubating-SNAPSHOT/streams-amazon-aws-0.4-incubating-SNAPSHOT.pom
[JENKINS] Archiving <https://builds.apache.org/job/Streams%20Trunk/ws/streams-contrib/streams-provider-gnip/gnip-edc-reddit/pom.xml>
to org.apache.streams/gnip-edc-reddit/0.4-incubating-SNAPSHOT/gnip-edc-reddit-0.4-incubating-SNAPSHOT.pom
[JENKINS] Archiving <https://builds.apache.org/job/Streams%20Trunk/ws/streams-contrib/streams-processor-json/pom.xml>
to org.apache.streams/streams-processor-json/0.4-incubating-SNAPSHOT/streams-processor-json-0.4-incubating-SNAPSHOT.pom
[JENKINS] Archiving <https://builds.apache.org/job/Streams%20Trunk/ws/streams-contrib/streams-provider-gnip/gnip-edc-facebook/pom.xml>
to org.apache.streams/gnip-edc-facebook/0.4-incubating-SNAPSHOT/gnip-edc-facebook-0.4-incubating-SNAPSHOT.pom
[JENKINS] Archiving <https://builds.apache.org/job/Streams%20Trunk/ws/streams-plugins/streams-plugin-pig/pom.xml>
to org.apache.streams.plugins/streams-plugin-pig/0.4-incubating-SNAPSHOT/streams-plugin-pig-0.4-incubating-SNAPSHOT.pom
[JENKINS] Archiving <https://builds.apache.org/job/Streams%20Trunk/ws/streams-contrib/streams-processor-peoplepattern/pom.xml>
to org.apache.streams/streams-processor-peoplepattern/0.4-incubating-SNAPSHOT/streams-processor-peoplepattern-0.4-incubating-SNAPSHOT.pom
[JENKINS] Archiving <https://builds.apache.org/job/Streams%20Trunk/ws/streams-contrib/streams-provider-rss/pom.xml>
to org.apache.streams/streams-provider-rss/0.4-incubating-SNAPSHOT/streams-provider-rss-0.4-incubating-SNAPSHOT.pom
[JENKINS] Archiving <https://builds.apache.org/job/Streams%20Trunk/ws/streams-plugins/streams-plugin-hbase/pom.xml>
to org.apache.streams.plugins/streams-plugin-hbase/0.4-incubating-SNAPSHOT/streams-plugin-hbase-0.4-incubating-SNAPSHOT.pom
[JENKINS] Archiving <https://builds.apache.org/job/Streams%20Trunk/ws/streams-components/streams-http/pom.xml>
to org.apache.streams/streams-http/0.4-incubating-SNAPSHOT/streams-http-0.4-incubating-SNAPSHOT.pom
[JENKINS] Archiving <https://builds.apache.org/job/Streams%20Trunk/ws/streams-plugins/streams-plugin-pojo/pom.xml>
to org.apache.streams.plugins/streams-plugin-pojo/0.4-incubating-SNAPSHOT/streams-plugin-pojo-0.4-incubating-SNAPSHOT.pom
[JENKINS] Archiving <https://builds.apache.org/job/Streams%20Trunk/ws/streams-pojo/pom.xml>
to org.apache.streams/streams-pojo/0.4-incubating-SNAPSHOT/streams-pojo-0.4-incubating-SNAPSHOT.pom
[JENKINS] Archiving <https://builds.apache.org/job/Streams%20Trunk/ws/streams-pojo/target/streams-pojo-0.4-incubating-SNAPSHOT-tests.jar>
to org.apache.streams/streams-pojo/0.4-incubating-SNAPSHOT/streams-pojo-0.4-incubating-SNAPSHOT-tests.jar
[JENKINS] Archiving <https://builds.apache.org/job/Streams%20Trunk/ws/streams-contrib/streams-amazon-aws/streams-persist-kinesis/pom.xml>
to org.apache.streams/streams-persist-kinesis/0.4-incubating-SNAPSHOT/streams-persist-kinesis-0.4-incubating-SNAPSHOT.pom
[JENKINS] Archiving <https://builds.apache.org/job/Streams%20Trunk/ws/streams-plugins/streams-plugin-scala/pom.xml>
to org.apache.streams.plugins/streams-plugin-scala/0.4-incubating-SNAPSHOT/streams-plugin-scala-0.4-incubating-SNAPSHOT.pom
[JENKINS] Archiving <https://builds.apache.org/job/Streams%20Trunk/ws/streams-contrib/streams-processor-urls/pom.xml>
to org.apache.streams/streams-processor-urls/0.4-incubating-SNAPSHOT/streams-processor-urls-0.4-incubating-SNAPSHOT.pom
[JENKINS] Archiving <https://builds.apache.org/job/Streams%20Trunk/ws/streams-plugins/streams-plugin-elasticsearch/pom.xml>
to org.apache.streams.plugins/streams-plugin-elasticsearch/0.4-incubating-SNAPSHOT/streams-plugin-elasticsearch-0.4-incubating-SNAPSHOT.pom
[JENKINS] Archiving <https://builds.apache.org/job/Streams%20Trunk/ws/streams-contrib/streams-provider-google/google-gplus/pom.xml>
to org.apache.streams/google-gplus/0.4-incubating-SNAPSHOT/google-gplus-0.4-incubating-SNAPSHOT.pom
[JENKINS] Archiving <https://builds.apache.org/job/Streams%20Trunk/ws/streams-runtimes/streams-runtime-dropwizard/pom.xml>
to org.apache.streams/streams-runtime-dropwizard/0.4-incubating-SNAPSHOT/streams-runtime-dropwizard-0.4-incubating-SNAPSHOT.pom
[JENKINS] Archiving <https://builds.apache.org/job/Streams%20Trunk/ws/streams-contrib/streams-provider-google/pom.xml>
to org.apache.streams/streams-provider-google/0.4-incubating-SNAPSHOT/streams-provider-google-0.4-incubating-SNAPSHOT.pom
[JENKINS] Archiving <https://builds.apache.org/job/Streams%20Trunk/ws/streams-pojo-extensions/pom.xml>
to org.apache.streams/streams-pojo-extensions/0.4-incubating-SNAPSHOT/streams-pojo-extensions-0.4-incubating-SNAPSHOT.pom
[JENKINS] Archiving <https://builds.apache.org/job/Streams%20Trunk/ws/streams-contrib/streams-processor-jackson/pom.xml>
to org.apache.streams/streams-processor-jackson/0.4-incubating-SNAPSHOT/streams-processor-jackson-0.4-incubating-SNAPSHOT.pom
[JENKINS] Archiving <https://builds.apache.org/job/Streams%20Trunk/ws/streams-components/pom.xml>
to org.apache.streams/streams-components/0.4-incubating-SNAPSHOT/streams-components-0.4-incubating-SNAPSHOT.pom
[JENKINS] Archiving <https://builds.apache.org/job/Streams%20Trunk/ws/streams-schemas/streams-schema-activitystreams/pom.xml>
to org.apache.streams/streams-schema-activitystreams/0.4-incubating-SNAPSHOT/streams-schema-activitystreams-0.4-incubating-SNAPSHOT.pom
[JENKINS] Archiving <https://builds.apache.org/job/Streams%20Trunk/ws/streams-schemas/streams-schema-activitystreams/target/streams-schema-activitystreams-0.4-incubating-SNAPSHOT-tests.jar>
to org.apache.streams/streams-schema-activitystreams/0.4-incubating-SNAPSHOT/streams-schema-activitystreams-0.4-incubating-SNAPSHOT-tests.jar
[JENKINS] Archiving <https://builds.apache.org/job/Streams%20Trunk/ws/streams-contrib/streams-provider-sysomos/pom.xml>
to org.apache.streams/streams-provider-sysomos/0.4-incubating-SNAPSHOT/streams-provider-sysomos-0.4-incubating-SNAPSHOT.pom
[JENKINS] Archiving <https://builds.apache.org/job/Streams%20Trunk/ws/streams-contrib/streams-provider-youtube/pom.xml>
to org.apache.streams/streams-provider-youtube/0.4-incubating-SNAPSHOT/streams-provider-youtube-0.4-incubating-SNAPSHOT.pom
[JENKINS] Archiving <https://builds.apache.org/job/Streams%20Trunk/ws/streams-contrib/streams-provider-gnip/gnip-edc-googleplus/pom.xml>
to org.apache.streams/gnip-edc-googleplus/0.4-incubating-SNAPSHOT/gnip-edc-googleplus-0.4-incubating-SNAPSHOT.pom
[JENKINS] Archiving <https://builds.apache.org/job/Streams%20Trunk/ws/streams-schemas/pom.xml>
to org.apache.streams/streams-schemas/0.4-incubating-SNAPSHOT/streams-schemas-0.4-incubating-SNAPSHOT.pom
[JENKINS] Archiving <https://builds.apache.org/job/Streams%20Trunk/ws/streams-contrib/streams-provider-datasift/pom.xml>
to org.apache.streams/streams-provider-datasift/0.4-incubating-SNAPSHOT/streams-provider-datasift-0.4-incubating-SNAPSHOT.pom
[JENKINS] Archiving <https://builds.apache.org/job/Streams%20Trunk/ws/streams-contrib/streams-provider-facebook/pom.xml>
to org.apache.streams/streams-provider-facebook/0.4-incubating-SNAPSHOT/streams-provider-facebook-0.4-incubating-SNAPSHOT.pom
[JENKINS] Archiving <https://builds.apache.org/job/Streams%20Trunk/ws/streams-contrib/streams-provider-gnip/gnip-powertrack/pom.xml>
to org.apache.streams/gnip-powertrack/0.4-incubating-SNAPSHOT/gnip-powertrack-0.4-incubating-SNAPSHOT.pom
[JENKINS] Archiving <https://builds.apache.org/job/Streams%20Trunk/ws/streams-contrib/streams-persist-elasticsearch/pom.xml>
to org.apache.streams/streams-persist-elasticsearch/0.4-incubating-SNAPSHOT/streams-persist-elasticsearch-0.4-incubating-SNAPSHOT.pom
[JENKINS] Archiving <https://builds.apache.org/job/Streams%20Trunk/ws/streams-contrib/streams-persist-elasticsearch/target/streams-persist-elasticsearch-0.4-incubating-SNAPSHOT-tests.jar>
to org.apache.streams/streams-persist-elasticsearch/0.4-incubating-SNAPSHOT/streams-persist-elasticsearch-0.4-incubating-SNAPSHOT-tests.jar
[JENKINS] Archiving <https://builds.apache.org/job/Streams%20Trunk/ws/streams-contrib/streams-provider-gnip/gnip-edc-youtube/pom.xml>
to org.apache.streams/gnip-edc-youtube/0.4-incubating-SNAPSHOT/gnip-edc-youtube-0.4-incubating-SNAPSHOT.pom
[JENKINS] Archiving <https://builds.apache.org/job/Streams%20Trunk/ws/streams-contrib/streams-provider-google/google-gmail/pom.xml>
to org.apache.streams/google-gmail/0.4-incubating-SNAPSHOT/google-gmail-0.4-incubating-SNAPSHOT.pom
[JENKINS] Archiving <https://builds.apache.org/job/Streams%20Trunk/ws/streams-runtimes/streams-runtime-storm/pom.xml>
to org.apache.streams/streams-runtime-storm/0.4-incubating-SNAPSHOT/streams-runtime-storm-0.4-incubating-SNAPSHOT.pom
[JENKINS] Archiving <https://builds.apache.org/job/Streams%20Trunk/ws/streams-config/pom.xml>
to org.apache.streams/streams-config/0.4-incubating-SNAPSHOT/streams-config-0.4-incubating-SNAPSHOT.pom
[JENKINS] Archiving <https://builds.apache.org/job/Streams%20Trunk/ws/streams-util/pom.xml>
to org.apache.streams/streams-util/0.4-incubating-SNAPSHOT/streams-util-0.4-incubating-SNAPSHOT.pom
[JENKINS] Archiving <https://builds.apache.org/job/Streams%20Trunk/ws/streams-util/target/streams-util-0.4-incubating-SNAPSHOT-tests.jar>
to org.apache.streams/streams-util/0.4-incubating-SNAPSHOT/streams-util-0.4-incubating-SNAPSHOT-tests.jar
[JENKINS] Archiving <https://builds.apache.org/job/Streams%20Trunk/ws/streams-contrib/streams-persist-hdfs/pom.xml>
to org.apache.streams/streams-persist-hdfs/0.4-incubating-SNAPSHOT/streams-persist-hdfs-0.4-incubating-SNAPSHOT.pom
[JENKINS] Archiving <https://builds.apache.org/job/Streams%20Trunk/ws/pom.xml> to org.apache.streams/streams-project/0.4-incubating-SNAPSHOT/streams-project-0.4-incubating-SNAPSHOT.pom
[JENKINS] Archiving <https://builds.apache.org/job/Streams%20Trunk/ws/target/streams-project-0.4-incubating-SNAPSHOT-site.xml>
to org.apache.streams/streams-project/0.4-incubating-SNAPSHOT/streams-project-0.4-incubating-SNAPSHOT-site.xml
[JENKINS] Archiving <https://builds.apache.org/job/Streams%20Trunk/ws/streams-contrib/streams-provider-twitter/pom.xml>
to org.apache.streams/streams-provider-twitter/0.4-incubating-SNAPSHOT/streams-provider-twitter-0.4-incubating-SNAPSHOT.pom
[JENKINS] Archiving <https://builds.apache.org/job/Streams%20Trunk/ws/streams-contrib/streams-amazon-aws/streams-persist-s3/pom.xml>
to org.apache.streams/streams-persist-s3/0.4-incubating-SNAPSHOT/streams-persist-s3-0.4-incubating-SNAPSHOT.pom
[JENKINS] Archiving <https://builds.apache.org/job/Streams%20Trunk/ws/streams-verbs/pom.xml>
to org.apache.streams/streams-verbs/0.4-incubating-SNAPSHOT/streams-verbs-0.4-incubating-SNAPSHOT.pom
[JENKINS] Archiving <https://builds.apache.org/job/Streams%20Trunk/ws/streams-contrib/streams-provider-instagram/pom.xml>
to org.apache.streams/streams-provider-instagram/0.4-incubating-SNAPSHOT/streams-provider-instagram-0.4-incubating-SNAPSHOT.pom
[JENKINS] Archiving <https://builds.apache.org/job/Streams%20Trunk/ws/streams-contrib/streams-persist-kafka/pom.xml>
to org.apache.streams/streams-persist-kafka/0.4-incubating-SNAPSHOT/streams-persist-kafka-0.4-incubating-SNAPSHOT.pom
[JENKINS] Archiving <https://builds.apache.org/job/Streams%20Trunk/ws/streams-contrib/streams-provider-moreover/pom.xml>
to org.apache.streams/streams-provider-moreover/0.4-incubating-SNAPSHOT/streams-provider-moreover-0.4-incubating-SNAPSHOT.pom
[JENKINS] Archiving <https://builds.apache.org/job/Streams%20Trunk/ws/streams-contrib/streams-provider-gnip/gnip-edc-instagram/pom.xml>
to org.apache.streams/gnip-edc-instagram/0.4-incubating-SNAPSHOT/gnip-edc-instagram-0.4-incubating-SNAPSHOT.pom
[JENKINS] Archiving <https://builds.apache.org/job/Streams%20Trunk/ws/streams-monitoring/pom.xml>
to org.apache.streams/streams-monitoring/0.4-incubating-SNAPSHOT/streams-monitoring-0.4-incubating-SNAPSHOT.pom
[JENKINS] Archiving <https://builds.apache.org/job/Streams%20Trunk/ws/streams-contrib/streams-persist-graph/pom.xml>
to org.apache.streams/streams-persist-graph/0.4-incubating-SNAPSHOT/streams-persist-graph-0.4-incubating-SNAPSHOT.pom
[JENKINS] Archiving <https://builds.apache.org/job/Streams%20Trunk/ws/streams-contrib/streams-provider-gnip/gnip-edc-flickr/pom.xml>
to org.apache.streams/gnip-edc-flickr/0.4-incubating-SNAPSHOT/gnip-edc-flickr-0.4-incubating-SNAPSHOT.pom
[JENKINS] Archiving <https://builds.apache.org/job/Streams%20Trunk/ws/streams-plugins/pom.xml>
to org.apache.streams/streams-plugins/0.4-incubating-SNAPSHOT/streams-plugins-0.4-incubating-SNAPSHOT.pom
[JENKINS] Archiving <https://builds.apache.org/job/Streams%20Trunk/ws/streams-testing/pom.xml>
to org.apache.streams/streams-testing/0.4-incubating-SNAPSHOT/streams-testing-0.4-incubating-SNAPSHOT.pom
[JENKINS] Archiving <https://builds.apache.org/job/Streams%20Trunk/ws/streams-testing/target/streams-testing-0.4-incubating-SNAPSHOT-tests.jar>
to org.apache.streams/streams-testing/0.4-incubating-SNAPSHOT/streams-testing-0.4-incubating-SNAPSHOT-tests.jar
[JENKINS] Archiving <https://builds.apache.org/job/Streams%20Trunk/ws/streams-contrib/streams-persist-hbase/pom.xml>
to org.apache.streams/streams-persist-hbase/0.4-incubating-SNAPSHOT/streams-persist-hbase-0.4-incubating-SNAPSHOT.pom
[JENKINS] Archiving <https://builds.apache.org/job/Streams%20Trunk/ws/streams-contrib/streams-persist-mongo/pom.xml>
to org.apache.streams/streams-persist-mongo/0.4-incubating-SNAPSHOT/streams-persist-mongo-0.4-incubating-SNAPSHOT.pom
[JENKINS] Archiving <https://builds.apache.org/job/Streams%20Trunk/ws/streams-plugins/streams-plugin-cassandra/pom.xml>
to org.apache.streams.plugins/streams-plugin-cassandra/0.4-incubating-SNAPSHOT/streams-plugin-cassandra-0.4-incubating-SNAPSHOT.pom
[JENKINS] Archiving <https://builds.apache.org/job/Streams%20Trunk/ws/streams-runtimes/streams-runtime-local/pom.xml>
to org.apache.streams/streams-runtime-local/0.4-incubating-SNAPSHOT/streams-runtime-local-0.4-incubating-SNAPSHOT.pom
[JENKINS] Archiving <https://builds.apache.org/job/Streams%20Trunk/ws/streams-runtimes/streams-runtime-local/target/streams-runtime-local-0.4-incubating-SNAPSHOT-tests.jar>
to org.apache.streams/streams-runtime-local/0.4-incubating-SNAPSHOT/streams-runtime-local-0.4-incubating-SNAPSHOT-tests.jar
channel stopped

Mime
View raw message