streams-commits mailing list archives

Site index · List index
Message view « Date » · « Thread »
Top « Date » · « Thread »
From Apache Jenkins Server <jenk...@builds.apache.org>
Subject Build failed in Jenkins: streams-examples-site #15
Date Sat, 22 Oct 2016 20:20:07 GMT
See <https://builds.apache.org/job/streams-examples-site/15/>

------------------------------------------
Started by upstream project "streams-examples" build number 110
originally caused by:
 Started by an SCM change
[EnvInject] - Loading node environment variables.
Building remotely on H11 (Ubuntu yahoo-not-h2 ubuntu docker) in workspace <https://builds.apache.org/job/streams-examples-site/ws/>
Wiping out workspace first.
Cloning the remote Git repository
Cloning repository https://git-wip-us.apache.org/repos/asf/incubator-streams-examples.git
 > git init <https://builds.apache.org/job/streams-examples-site/ws/> # timeout=10
Fetching upstream changes from https://git-wip-us.apache.org/repos/asf/incubator-streams-examples.git
 > git --version # timeout=10
 > git -c core.askpass=true fetch --tags --progress https://git-wip-us.apache.org/repos/asf/incubator-streams-examples.git
+refs/heads/*:refs/remotes/origin/*
 > git config remote.origin.url https://git-wip-us.apache.org/repos/asf/incubator-streams-examples.git
# timeout=10
 > git config --add remote.origin.fetch +refs/heads/*:refs/remotes/origin/* # timeout=10
 > git config remote.origin.url https://git-wip-us.apache.org/repos/asf/incubator-streams-examples.git
# timeout=10
Cleaning workspace
 > git rev-parse --verify HEAD # timeout=10
No valid HEAD. Skipping the resetting
 > git clean -fdx # timeout=10
Fetching upstream changes from https://git-wip-us.apache.org/repos/asf/incubator-streams-examples.git
 > git -c core.askpass=true fetch --tags --progress https://git-wip-us.apache.org/repos/asf/incubator-streams-examples.git
+refs/heads/*:refs/remotes/origin/*
 > git rev-parse origin/master^{commit} # timeout=10
Checking out Revision be27e3fad93563c1b8035469b88fd1921a0e3eb9 (origin/master)
 > git config core.sparsecheckout # timeout=10
 > git checkout -f be27e3fad93563c1b8035469b88fd1921a0e3eb9
 > git rev-list be27e3fad93563c1b8035469b88fd1921a0e3eb9 # timeout=10
Parsing POMs
using settings config with name simple-deploy-settings-no-mirror
Replacing all maven server entries not found in credentials list is true
Downloaded artifact https://repository.apache.org/content/repositories/snapshots/org/apache/streams/streams-master/0.4-incubating-SNAPSHOT/maven-metadata.xml
Downloaded artifact https://repository.apache.org/snapshots/org/apache/streams/streams-master/0.4-incubating-SNAPSHOT/maven-metadata.xml
Modules changed, recalculating dependency graph
Established TCP socket on 39062
maven32-agent.jar already up to date
maven32-interceptor.jar already up to date
maven3-interceptor-commons.jar already up to date
[streams-examples-site] $ /home/jenkins/tools/java/latest1.8/bin/java -Xmx2g -Xms256m -XX:MaxPermSize=512m
-Dfile.encoding=UTF-8 -cp /home/jenkins/jenkins-slave/maven32-agent.jar:/home/jenkins/tools/maven/apache-maven-3.3.3/boot/plexus-classworlds-2.5.2.jar:/home/jenkins/tools/maven/apache-maven-3.3.3/conf/logging
jenkins.maven3.agent.Maven32Main /home/jenkins/tools/maven/apache-maven-3.3.3 /home/jenkins/jenkins-slave/slave.jar
/home/jenkins/jenkins-slave/maven32-interceptor.jar /home/jenkins/jenkins-slave/maven3-interceptor-commons.jar
39062
Java HotSpot(TM) 64-Bit Server VM warning: ignoring option MaxPermSize=512m; support was removed
in 8.0
<===[JENKINS REMOTING CAPACITY]===>   channel started
using settings config with name simple-deploy-settings-no-mirror
Replacing all maven server entries not found in credentials list is true
Executing Maven:  -B -f <https://builds.apache.org/job/streams-examples-site/ws/pom.xml>
-Dmaven.repo.local=/home/jenkins/jenkins-slave/maven-repositories/0 -s /tmp/settings7468052861221674004.xml
-q -U generate-sources site:site site:stage
Waiting for Jenkins to finish collecting data[ERROR] Failed to execute goal org.apache.maven.plugins:maven-enforcer-plugin:1.4.1:enforce
(enforce-java) on project streams-examples: Some Enforcer rules have failed. Look above for
specific messages explaining why the rule failed. -> [Help 1]
[ERROR] 
[ERROR] To see the full stack trace of the errors, re-run Maven with the -e switch.
[ERROR] Re-run Maven using the -X switch to enable full debug logging.
[ERROR] 
[ERROR] For more information about the errors and possible solutions, please read the following
articles:
[ERROR] [Help 1] http://cwiki.apache.org/confluence/display/MAVEN/MojoExecutionException

[JENKINS] Archiving <https://builds.apache.org/job/streams-examples-site/ws/local/pom.xml>
to org.apache.streams/streams-examples-local/0.4-incubating-SNAPSHOT/streams-examples-local-0.4-incubating-SNAPSHOT.pom
[JENKINS] Archiving <https://builds.apache.org/job/streams-examples-site/ws/local/elasticsearch-reindex/pom.xml>
to org.apache.streams/elasticsearch-reindex/0.4-incubating-SNAPSHOT/elasticsearch-reindex-0.4-incubating-SNAPSHOT.pom
[JENKINS] Archiving <https://builds.apache.org/job/streams-examples-site/ws/local/twitter-follow-neo4j/pom.xml>
to org.apache.streams/twitter-follow-neo4j/0.4-incubating-SNAPSHOT/twitter-follow-neo4j-0.4-incubating-SNAPSHOT.pom
[JENKINS] Archiving <https://builds.apache.org/job/streams-examples-site/ws/local/elasticsearch-hdfs/pom.xml>
to org.apache.streams/elasticsearch-hdfs/0.4-incubating-SNAPSHOT/elasticsearch-hdfs-0.4-incubating-SNAPSHOT.pom
[JENKINS] Archiving <https://builds.apache.org/job/streams-examples-site/ws/local/twitter-userstream-elasticsearch/pom.xml>
to org.apache.streams/twitter-userstream-elasticsearch/0.4-incubating-SNAPSHOT/twitter-userstream-elasticsearch-0.4-incubating-SNAPSHOT.pom
[JENKINS] Archiving <https://builds.apache.org/job/streams-examples-site/ws/pom.xml>
to org.apache.streams/streams-examples/0.4-incubating-SNAPSHOT/streams-examples-0.4-incubating-SNAPSHOT.pom
[JENKINS] Archiving <https://builds.apache.org/job/streams-examples-site/ws/flink/pom.xml>
to org.apache.streams/streams-examples-flink/0.4-incubating-SNAPSHOT/streams-examples-flink-0.4-incubating-SNAPSHOT.pom
[JENKINS] Archiving <https://builds.apache.org/job/streams-examples-site/ws/local/twitter-history-elasticsearch/pom.xml>
to org.apache.streams/twitter-history-elasticsearch/0.4-incubating-SNAPSHOT/twitter-history-elasticsearch-0.4-incubating-SNAPSHOT.pom
[JENKINS] Archiving <https://builds.apache.org/job/streams-examples-site/ws/flink/flink-twitter-collection/pom.xml>
to org.apache.streams/flink-twitter-collection/0.4-incubating-SNAPSHOT/flink-twitter-collection-0.4-incubating-SNAPSHOT.pom
[JENKINS] Archiving <https://builds.apache.org/job/streams-examples-site/ws/local/mongo-elasticsearch-sync/pom.xml>
to org.apache.streams/mongo-elasticsearch-sync/0.4-incubating-SNAPSHOT/mongo-elasticsearch-sync-0.4-incubating-SNAPSHOT.pom
channel stopped

Mime
View raw message