streams-commits mailing list archives

Site index · List index
Message view « Date » · « Thread »
Top « Date » · « Thread »
From Apache Jenkins Server <jenk...@builds.apache.org>
Subject Build failed in Jenkins: Streams Project Site #3
Date Sat, 07 May 2016 01:45:33 GMT
See <https://builds.apache.org/job/Streams%20Project%20Site/3/changes>

Changes:

[sblackmon] move all README.md into src/site/markdown, add example configurations,

[sblackmon] more READMEs

[sblackmon] create index.md for most modules

[sblackmon] new components diagrams

[sblackmon] add diagrams and improve index.md for provider / persist modules

[sblackmon] elasticsearch diagram and confs

[sblackmon] add diagrams and improve index.html

[sblackmon] prefix schema directories with ${project.basedir}

[sblackmon] fix a few edges that were pointing the wrong way

[sblackmon] another round of README and diagram improvements

[sblackmon] tweaks to readmes

------------------------------------------
[...truncated 1853 lines...]
jdk1.7.0_51/jre/lib/locale/zh_TW.BIG5/LC_MESSAGES/
jdk1.7.0_51/jre/lib/locale/zh_TW.BIG5/LC_MESSAGES/sunw_java_plugin.mo
jdk1.7.0_51/jre/lib/locale/pt_BR/
jdk1.7.0_51/jre/lib/locale/pt_BR/LC_MESSAGES/
jdk1.7.0_51/jre/lib/locale/pt_BR/LC_MESSAGES/sunw_java_plugin.mo
jdk1.7.0_51/jre/lib/locale/de/
jdk1.7.0_51/jre/lib/locale/de/LC_MESSAGES/
jdk1.7.0_51/jre/lib/locale/de/LC_MESSAGES/sunw_java_plugin.mo
jdk1.7.0_51/jre/lib/locale/it/
jdk1.7.0_51/jre/lib/locale/it/LC_MESSAGES/
jdk1.7.0_51/jre/lib/locale/it/LC_MESSAGES/sunw_java_plugin.mo
jdk1.7.0_51/jre/lib/locale/zh_TW/
jdk1.7.0_51/jre/lib/locale/zh_TW/LC_MESSAGES/
jdk1.7.0_51/jre/lib/locale/zh_TW/LC_MESSAGES/sunw_java_plugin.mo
jdk1.7.0_51/jre/lib/locale/zh/
jdk1.7.0_51/jre/lib/locale/zh/LC_MESSAGES/
jdk1.7.0_51/jre/lib/locale/zh/LC_MESSAGES/sunw_java_plugin.mo
jdk1.7.0_51/jre/lib/locale/ja/
jdk1.7.0_51/jre/lib/locale/ja/LC_MESSAGES/
jdk1.7.0_51/jre/lib/locale/ja/LC_MESSAGES/sunw_java_plugin.mo
jdk1.7.0_51/jre/lib/locale/fr/
jdk1.7.0_51/jre/lib/locale/fr/LC_MESSAGES/
jdk1.7.0_51/jre/lib/locale/fr/LC_MESSAGES/sunw_java_plugin.mo
jdk1.7.0_51/jre/lib/locale/ko/
jdk1.7.0_51/jre/lib/locale/ko/LC_MESSAGES/
jdk1.7.0_51/jre/lib/locale/ko/LC_MESSAGES/sunw_java_plugin.mo
jdk1.7.0_51/jre/lib/locale/ko.UTF-8/
jdk1.7.0_51/jre/lib/locale/ko.UTF-8/LC_MESSAGES/
jdk1.7.0_51/jre/lib/locale/ko.UTF-8/LC_MESSAGES/sunw_java_plugin.mo
jdk1.7.0_51/jre/lib/locale/zh.GBK/
jdk1.7.0_51/jre/lib/locale/zh.GBK/LC_MESSAGES/
jdk1.7.0_51/jre/lib/locale/zh.GBK/LC_MESSAGES/sunw_java_plugin.mo
jdk1.7.0_51/jre/lib/locale/sv/
jdk1.7.0_51/jre/lib/locale/sv/LC_MESSAGES/
jdk1.7.0_51/jre/lib/locale/sv/LC_MESSAGES/sunw_java_plugin.mo
jdk1.7.0_51/jre/lib/locale/zh_HK.BIG5HK/
jdk1.7.0_51/jre/lib/locale/zh_HK.BIG5HK/LC_MESSAGES/
jdk1.7.0_51/jre/lib/locale/zh_HK.BIG5HK/LC_MESSAGES/sunw_java_plugin.mo
jdk1.7.0_51/jre/lib/locale/es/
jdk1.7.0_51/jre/lib/locale/es/LC_MESSAGES/
jdk1.7.0_51/jre/lib/locale/es/LC_MESSAGES/sunw_java_plugin.mo
jdk1.7.0_51/jre/lib/fonts/
jdk1.7.0_51/jre/lib/fonts/LucidaBrightDemiBold.ttf
jdk1.7.0_51/jre/lib/fonts/LucidaBrightItalic.ttf
jdk1.7.0_51/jre/lib/fonts/LucidaSansDemiBold.ttf
jdk1.7.0_51/jre/lib/fonts/LucidaTypewriterRegular.ttf
jdk1.7.0_51/jre/lib/fonts/LucidaBrightDemiItalic.ttf
jdk1.7.0_51/jre/lib/fonts/LucidaTypewriterBold.ttf
jdk1.7.0_51/jre/lib/fonts/LucidaSansRegular.ttf
jdk1.7.0_51/jre/lib/fonts/fonts.dir
jdk1.7.0_51/jre/lib/fonts/LucidaBrightRegular.ttf
jdk1.7.0_51/jre/lib/ext/
jdk1.7.0_51/jre/lib/ext/sunjce_provider.jar
jdk1.7.0_51/jre/lib/ext/meta-index
jdk1.7.0_51/jre/lib/ext/zipfs.jar
jdk1.7.0_51/jre/lib/ext/sunpkcs11.jar
jdk1.7.0_51/jre/lib/ext/dnsns.jar
jdk1.7.0_51/jre/lib/ext/localedata.jar
jdk1.7.0_51/jre/lib/ext/sunec.jar
jdk1.7.0_51/jre/lib/fontconfig.Turbo.bfc
jdk1.7.0_51/jre/lib/fontconfig.properties.src
jdk1.7.0_51/jre/lib/jce.jar
jdk1.7.0_51/jre/lib/fontconfig.RedHat.6.bfc
jdk1.7.0_51/jre/lib/currency.data
jdk1.7.0_51/jre/lib/javafx.properties
jdk1.7.0_51/jre/THIRDPARTYLICENSEREADME.txt
jdk1.7.0_51/jre/Welcome.html
jdk1.7.0_51/jre/LICENSE
jdk1.7.0_51/jre/plugin/
jdk1.7.0_51/jre/plugin/desktop/
jdk1.7.0_51/jre/plugin/desktop/sun_java.png
jdk1.7.0_51/jre/plugin/desktop/sun_java.desktop
jdk1.7.0_51/jre/COPYRIGHT
jdk1.7.0_51/jre/THIRDPARTYLICENSEREADME-JAVAFX.txt
jdk1.7.0_51/LICENSE
jdk1.7.0_51/COPYRIGHT
jdk1.7.0_51/THIRDPARTYLICENSEREADME-JAVAFX.txt
Building remotely on jenkins-test-897 (jenkins-cloud-4GB cloud-slave Ubuntu ubuntu jenkins-cloud-8GB)
in workspace <https://builds.apache.org/job/Streams%20Project%20Site/ws/>
Unpacking https://repo.maven.apache.org/maven2/org/apache/maven/apache-maven/3.2.1/apache-maven-3.2.1-bin.zip
to /home/jenkins/jenkins-slave/tools/hudson.tasks.Maven_MavenInstallation/maven-3.2.1 on jenkins-test-897
Wiping out workspace first.
Cloning the remote Git repository
Cloning repository https://git-wip-us.apache.org/repos/asf/incubator-streams.git
 > git init <https://builds.apache.org/job/Streams%20Project%20Site/ws/> # timeout=10
Fetching upstream changes from https://git-wip-us.apache.org/repos/asf/incubator-streams.git
 > git --version # timeout=10
 > git -c core.askpass=true fetch --tags --progress https://git-wip-us.apache.org/repos/asf/incubator-streams.git
+refs/heads/*:refs/remotes/origin/*
 > git config remote.origin.url https://git-wip-us.apache.org/repos/asf/incubator-streams.git
# timeout=10
 > git config --add remote.origin.fetch +refs/heads/*:refs/remotes/origin/* # timeout=10
 > git config remote.origin.url https://git-wip-us.apache.org/repos/asf/incubator-streams.git
# timeout=10
Cleaning workspace
 > git rev-parse --verify HEAD # timeout=10
No valid HEAD. Skipping the resetting
 > git clean -fdx # timeout=10
Fetching upstream changes from https://git-wip-us.apache.org/repos/asf/incubator-streams.git
 > git -c core.askpass=true fetch --tags --progress https://git-wip-us.apache.org/repos/asf/incubator-streams.git
+refs/heads/*:refs/remotes/origin/*
 > git rev-parse origin/master^{commit} # timeout=10
Checking out Revision 0e7fbcb6b783373e95073eb12c14b884b9f42489 (origin/master)
 > git config core.sparsecheckout # timeout=10
 > git checkout -f 0e7fbcb6b783373e95073eb12c14b884b9f42489
 > git rev-list c7490d3b621429df235b6280f7b86837623ab80c # timeout=10
Parsing POMs
using settings config with name simple-deploy-settings-no-mirror
Replacing all maven server entries not found in credentials list is true
Downloaded artifact https://repository.apache.org/content/repositories/snapshots/org/apache/streams/streams-master/0.3-incubating-SNAPSHOT/maven-metadata.xml
Downloaded artifact https://repository.apache.org/content/repositories/snapshots/org/apache/streams/streams-master/0.3-incubating-SNAPSHOT/streams-master-0.3-incubating-20160507.003901-15.pom
Failed to transfer Could not find metadata org.apache.streams:streams-master:0.3-incubating-SNAPSHOT/maven-metadata.xml
in sonatype (https://oss.sonatype.org/content/repositories/snapshots)
Failed to transfer Could not find metadata org.apache.streams:streams-master:0.3-incubating-SNAPSHOT/maven-metadata.xml
in typesafe (http://repo.typesafe.com/typesafe/repo)
Failed to transfer Could not find metadata org.apache.streams:streams-master:0.3-incubating-SNAPSHOT/maven-metadata.xml
in google-api-services (http://google-api-client-libraries.appspot.com/mavenrepo)
Failed to transfer Could not find metadata org.apache.streams:streams-master:0.3-incubating-SNAPSHOT/maven-metadata.xml
in clojars.org (http://clojars.org/repo)
Downloaded artifact http://repository.apache.org/snapshots/org/apache/streams/streams-master/0.3-incubating-SNAPSHOT/maven-metadata.xml
Modules changed, recalculating dependency graph
Established TCP socket on 51514
Copied maven32-agent.jar
Copied maven32-interceptor.jar
maven3-interceptor-commons.jar already up to date
[Streams Project Site] $ /home/jenkins/jenkins-slave/tools/hudson.model.JDK/jdk-1.7u51/bin/java
-Xmx2g -Xms256m -XX:MaxPermSize=512m -Dfile.encoding=UTF-8 -cp /home/jenkins/jenkins-slave/maven32-agent.jar:/home/jenkins/jenkins-slave/tools/hudson.tasks.Maven_MavenInstallation/maven-3.2.1/boot/plexus-classworlds-2.5.1.jar:/home/jenkins/jenkins-slave/tools/hudson.tasks.Maven_MavenInstallation/maven-3.2.1/conf/logging
jenkins.maven3.agent.Maven32Main /home/jenkins/jenkins-slave/tools/hudson.tasks.Maven_MavenInstallation/maven-3.2.1
/home/jenkins/jenkins-slave/slave.jar /home/jenkins/jenkins-slave/maven32-interceptor.jar
/home/jenkins/jenkins-slave/maven3-interceptor-commons.jar 51514
<===[JENKINS REMOTING CAPACITY]===>   channel started
using settings config with name simple-deploy-settings-no-mirror
Replacing all maven server entries not found in credentials list is true
Executing Maven:  -B -f <https://builds.apache.org/job/Streams%20Project%20Site/ws/pom.xml>
-Dmaven.repo.local=/home/jenkins/jenkins-slave/maven-repositories/0 -s /tmp/settings1495994512108685218.xml
-q -U generate-sources site-deploy -s settings.xml
[INFO] 
[INFO] Using the builder org.apache.maven.lifecycle.internal.builder.singlethreaded.SingleThreadedBuilder
with a thread count of 1
[JENKINS] Archiving site from <https://builds.apache.org/job/Streams%20Project%20Site/ws/target/site>
to /x1/jenkins/jenkins-home/jobs/Streams Project Site/site
scm:svn:https://svn.apache.org/repos/asf/incubator/streams/site/trunk/content/site/0.3-incubating-SNAPSHOT/streams-master/
- Session: Opened  
Uploading: ../../../../../../../../../infra/websites/production/streams/content/site/0.3-incubating-SNAPSHOT/streams-project
to scm:svn:https://svn.apache.org/repos/asf/incubator/streams/site/trunk/content/site/0.3-incubating-SNAPSHOT/streams-master/

scm:svn:https://svn.apache.org/repos/asf/incubator/streams/site/trunk/content/site/0.3-incubating-SNAPSHOT/streams-master/
- Session: Disconnecting  
scm:svn:https://svn.apache.org/repos/asf/incubator/streams/site/trunk/content/site/0.3-incubating-SNAPSHOT/streams-master/
- Session: Disconnected
Waiting for Jenkins to finish collecting data
[ERROR] Failed to execute goal org.apache.maven.plugins:maven-site-plugin:3.5:deploy (default-deploy)
on project streams-project: Error uploading site: Failed to create directory /tmp/wagon-scm82507487.checkout/..;
parent should exist: /tmp/wagon-scm82507487.checkout -> [Help 1]
[ERROR] 
[ERROR] To see the full stack trace of the errors, re-run Maven with the -e switch.
[ERROR] Re-run Maven using the -X switch to enable full debug logging.
[ERROR] 
[ERROR] For more information about the errors and possible solutions, please read the following
articles:
[ERROR] [Help 1] http://cwiki.apache.org/confluence/display/MAVEN/MojoExecutionException
[JENKINS] Archiving <https://builds.apache.org/job/Streams%20Project%20Site/ws/streams-contrib/streams-amazon-aws/streams-persist-kinesis/pom.xml>
to org.apache.streams/streams-persist-kinesis/0.3-incubating-SNAPSHOT/streams-persist-kinesis-0.3-incubating-SNAPSHOT.pom
No prior successful build to compare, so performing full copy of artifacts
[JENKINS] Archiving <https://builds.apache.org/job/Streams%20Project%20Site/ws/streams-runtimes/streams-runtime-storm/pom.xml>
to org.apache.streams/streams-runtime-storm/0.3-incubating-SNAPSHOT/streams-runtime-storm-0.3-incubating-SNAPSHOT.pom
No prior successful build to compare, so performing full copy of artifacts
[JENKINS] Archiving <https://builds.apache.org/job/Streams%20Project%20Site/ws/streams-contrib/streams-provider-facebook/pom.xml>
to org.apache.streams/streams-provider-facebook/0.3-incubating-SNAPSHOT/streams-provider-facebook-0.3-incubating-SNAPSHOT.pom
No prior successful build to compare, so performing full copy of artifacts
[JENKINS] Archiving <https://builds.apache.org/job/Streams%20Project%20Site/ws/streams-contrib/streams-persist-hbase/pom.xml>
to org.apache.streams/streams-persist-hbase/0.3-incubating-SNAPSHOT/streams-persist-hbase-0.3-incubating-SNAPSHOT.pom
No prior successful build to compare, so performing full copy of artifacts
[JENKINS] Archiving <https://builds.apache.org/job/Streams%20Project%20Site/ws/streams-contrib/streams-provider-moreover/pom.xml>
to org.apache.streams/streams-provider-moreover/0.3-incubating-SNAPSHOT/streams-provider-moreover-0.3-incubating-SNAPSHOT.pom
No prior successful build to compare, so performing full copy of artifacts
[JENKINS] Archiving <https://builds.apache.org/job/Streams%20Project%20Site/ws/streams-contrib/streams-provider-gnip/gnip-edc-reddit/pom.xml>
to org.apache.streams/gnip-edc-reddit/0.3-incubating-SNAPSHOT/gnip-edc-reddit-0.3-incubating-SNAPSHOT.pom
No prior successful build to compare, so performing full copy of artifacts
[JENKINS] Archiving <https://builds.apache.org/job/Streams%20Project%20Site/ws/streams-util/pom.xml>
to org.apache.streams/streams-util/0.3-incubating-SNAPSHOT/streams-util-0.3-incubating-SNAPSHOT.pom
No prior successful build to compare, so performing full copy of artifacts
[JENKINS] Archiving <https://builds.apache.org/job/Streams%20Project%20Site/ws/streams-contrib/streams-provider-gnip/gnip-powertrack/pom.xml>
to org.apache.streams/gnip-powertrack/0.3-incubating-SNAPSHOT/gnip-powertrack-0.3-incubating-SNAPSHOT.pom
No prior successful build to compare, so performing full copy of artifacts
[JENKINS] Archiving <https://builds.apache.org/job/Streams%20Project%20Site/ws/streams-runtimes/streams-runtime-pig/pom.xml>
to org.apache.streams/streams-runtime-pig/0.3-incubating-SNAPSHOT/streams-runtime-pig-0.3-incubating-SNAPSHOT.pom
No prior successful build to compare, so performing full copy of artifacts
[JENKINS] Archiving <https://builds.apache.org/job/Streams%20Project%20Site/ws/streams-runtimes/streams-runtime-dropwizard/pom.xml>
to org.apache.streams/streams-runtime-dropwizard/0.3-incubating-SNAPSHOT/streams-runtime-dropwizard-0.3-incubating-SNAPSHOT.pom
No prior successful build to compare, so performing full copy of artifacts
[JENKINS] Archiving <https://builds.apache.org/job/Streams%20Project%20Site/ws/streams-contrib/streams-provider-gnip/gnip-edc-facebook/pom.xml>
to org.apache.streams/gnip-edc-facebook/0.3-incubating-SNAPSHOT/gnip-edc-facebook-0.3-incubating-SNAPSHOT.pom
No prior successful build to compare, so performing full copy of artifacts
[JENKINS] Archiving <https://builds.apache.org/job/Streams%20Project%20Site/ws/streams-contrib/streams-provider-gnip/gnip-edc-googleplus/pom.xml>
to org.apache.streams/gnip-edc-googleplus/0.3-incubating-SNAPSHOT/gnip-edc-googleplus-0.3-incubating-SNAPSHOT.pom
No prior successful build to compare, so performing full copy of artifacts
[JENKINS] Archiving <https://builds.apache.org/job/Streams%20Project%20Site/ws/streams-components/streams-filters/pom.xml>
to org.apache.streams/streams-filters/0.3-incubating-SNAPSHOT/streams-filters-0.3-incubating-SNAPSHOT.pom
No prior successful build to compare, so performing full copy of artifacts
[JENKINS] Archiving <https://builds.apache.org/job/Streams%20Project%20Site/ws/streams-testing/pom.xml>
to org.apache.streams/streams-testing/0.3-incubating-SNAPSHOT/streams-testing-0.3-incubating-SNAPSHOT.pom
No prior successful build to compare, so performing full copy of artifacts
[JENKINS] Archiving <https://builds.apache.org/job/Streams%20Project%20Site/ws/streams-contrib/streams-provider-google/pom.xml>
to org.apache.streams/streams-provider-google/0.3-incubating-SNAPSHOT/streams-provider-google-0.3-incubating-SNAPSHOT.pom
No prior successful build to compare, so performing full copy of artifacts
[JENKINS] Archiving <https://builds.apache.org/job/Streams%20Project%20Site/ws/streams-contrib/streams-provider-gnip/gnip-edc-flickr/pom.xml>
to org.apache.streams/gnip-edc-flickr/0.3-incubating-SNAPSHOT/gnip-edc-flickr-0.3-incubating-SNAPSHOT.pom
No prior successful build to compare, so performing full copy of artifacts
[JENKINS] Archiving <https://builds.apache.org/job/Streams%20Project%20Site/ws/streams-contrib/streams-processor-jackson/pom.xml>
to org.apache.streams/streams-processor-jackson/0.3-incubating-SNAPSHOT/streams-processor-jackson-0.3-incubating-SNAPSHOT.pom
No prior successful build to compare, so performing full copy of artifacts
[JENKINS] Archiving <https://builds.apache.org/job/Streams%20Project%20Site/ws/streams-contrib/streams-provider-sysomos/pom.xml>
to org.apache.streams/streams-provider-sysomos/0.3-incubating-SNAPSHOT/streams-provider-sysomos-0.3-incubating-SNAPSHOT.pom
No prior successful build to compare, so performing full copy of artifacts
[JENKINS] Archiving <https://builds.apache.org/job/Streams%20Project%20Site/ws/streams-contrib/streams-persist-filebuffer/pom.xml>
to org.apache.streams/streams-persist-filebuffer/0.3-incubating-SNAPSHOT/streams-persist-filebuffer-0.3-incubating-SNAPSHOT.pom
No prior successful build to compare, so performing full copy of artifacts
[JENKINS] Archiving <https://builds.apache.org/job/Streams%20Project%20Site/ws/streams-contrib/streams-persist-kafka/pom.xml>
to org.apache.streams/streams-persist-kafka/0.3-incubating-SNAPSHOT/streams-persist-kafka-0.3-incubating-SNAPSHOT.pom
No prior successful build to compare, so performing full copy of artifacts
[JENKINS] Archiving <https://builds.apache.org/job/Streams%20Project%20Site/ws/streams-runtimes/streams-runtime-webapp/pom.xml>
to org.apache.streams/streams-runtime-webapp/0.3-incubating-SNAPSHOT/streams-runtime-webapp-0.3-incubating-SNAPSHOT.pom
No prior successful build to compare, so performing full copy of artifacts
[JENKINS] Archiving <https://builds.apache.org/job/Streams%20Project%20Site/ws/streams-contrib/streams-persist-mongo/pom.xml>
to org.apache.streams/streams-persist-mongo/0.3-incubating-SNAPSHOT/streams-persist-mongo-0.3-incubating-SNAPSHOT.pom
No prior successful build to compare, so performing full copy of artifacts
[JENKINS] Archiving <https://builds.apache.org/job/Streams%20Project%20Site/ws/streams-core/pom.xml>
to org.apache.streams/streams-core/0.3-incubating-SNAPSHOT/streams-core-0.3-incubating-SNAPSHOT.pom
No prior successful build to compare, so performing full copy of artifacts
[JENKINS] Archiving <https://builds.apache.org/job/Streams%20Project%20Site/ws/streams-contrib/streams-persist-cassandra/pom.xml>
to org.apache.streams/streams-persist-cassandra/0.3-incubating-SNAPSHOT/streams-persist-cassandra-0.3-incubating-SNAPSHOT.pom
No prior successful build to compare, so performing full copy of artifacts
[JENKINS] Archiving <https://builds.apache.org/job/Streams%20Project%20Site/ws/streams-contrib/streams-processor-urls/pom.xml>
to org.apache.streams/streams-processor-urls/0.3-incubating-SNAPSHOT/streams-processor-urls-0.3-incubating-SNAPSHOT.pom
No prior successful build to compare, so performing full copy of artifacts
[JENKINS] Archiving <https://builds.apache.org/job/Streams%20Project%20Site/ws/streams-config/pom.xml>
to org.apache.streams/streams-config/0.3-incubating-SNAPSHOT/streams-config-0.3-incubating-SNAPSHOT.pom
No prior successful build to compare, so performing full copy of artifacts
[JENKINS] Archiving <https://builds.apache.org/job/Streams%20Project%20Site/ws/streams-contrib/streams-processor-json/pom.xml>
to org.apache.streams/streams-processor-json/0.3-incubating-SNAPSHOT/streams-processor-json-0.3-incubating-SNAPSHOT.pom
No prior successful build to compare, so performing full copy of artifacts
[JENKINS] Archiving <https://builds.apache.org/job/Streams%20Project%20Site/ws/streams-contrib/streams-provider-rss/pom.xml>
to org.apache.streams/streams-provider-rss/0.3-incubating-SNAPSHOT/streams-provider-rss-0.3-incubating-SNAPSHOT.pom
No prior successful build to compare, so performing full copy of artifacts
[JENKINS] Archiving <https://builds.apache.org/job/Streams%20Project%20Site/ws/streams-contrib/streams-amazon-aws/streams-persist-s3/pom.xml>
to org.apache.streams/streams-persist-s3/0.3-incubating-SNAPSHOT/streams-persist-s3-0.3-incubating-SNAPSHOT.pom
No prior successful build to compare, so performing full copy of artifacts
[JENKINS] Archiving <https://builds.apache.org/job/Streams%20Project%20Site/ws/streams-components/pom.xml>
to org.apache.streams/streams-components/0.3-incubating-SNAPSHOT/streams-components-0.3-incubating-SNAPSHOT.pom
No prior successful build to compare, so performing full copy of artifacts
[JENKINS] Archiving <https://builds.apache.org/job/Streams%20Project%20Site/ws/streams-contrib/streams-provider-youtube/pom.xml>
to org.apache.streams/streams-provider-youtube/0.3-incubating-SNAPSHOT/streams-provider-youtube-0.3-incubating-SNAPSHOT.pom
No prior successful build to compare, so performing full copy of artifacts
[JENKINS] Archiving <https://builds.apache.org/job/Streams%20Project%20Site/ws/streams-runtimes/pom.xml>
to org.apache.streams/streams-runtimes/0.3-incubating-SNAPSHOT/streams-runtimes-0.3-incubating-SNAPSHOT.pom
No prior successful build to compare, so performing full copy of artifacts
[JENKINS] Archiving <https://builds.apache.org/job/Streams%20Project%20Site/ws/streams-contrib/streams-provider-instagram/pom.xml>
to org.apache.streams/streams-provider-instagram/0.3-incubating-SNAPSHOT/streams-provider-instagram-0.3-incubating-SNAPSHOT.pom
No prior successful build to compare, so performing full copy of artifacts
[JENKINS] Archiving <https://builds.apache.org/job/Streams%20Project%20Site/ws/streams-pojo-extensions/pom.xml>
to org.apache.streams/streams-pojo-extensions/0.3-incubating-SNAPSHOT/streams-pojo-extensions-0.3-incubating-SNAPSHOT.pom
No prior successful build to compare, so performing full copy of artifacts
[JENKINS] Archiving <https://builds.apache.org/job/Streams%20Project%20Site/ws/streams-components/streams-converters/pom.xml>
to org.apache.streams/streams-converters/0.3-incubating-SNAPSHOT/streams-converters-0.3-incubating-SNAPSHOT.pom
No prior successful build to compare, so performing full copy of artifacts
[JENKINS] Archiving <https://builds.apache.org/job/Streams%20Project%20Site/ws/streams-components/streams-http/pom.xml>
to org.apache.streams/streams-http/0.3-incubating-SNAPSHOT/streams-http-0.3-incubating-SNAPSHOT.pom
No prior successful build to compare, so performing full copy of artifacts
[JENKINS] Archiving <https://builds.apache.org/job/Streams%20Project%20Site/ws/streams-verbs/pom.xml>
to org.apache.streams/streams-verbs/0.3-incubating-SNAPSHOT/streams-verbs-0.3-incubating-SNAPSHOT.pom
No prior successful build to compare, so performing full copy of artifacts
[JENKINS] Archiving <https://builds.apache.org/job/Streams%20Project%20Site/ws/streams-contrib/streams-persist-elasticsearch/pom.xml>
to org.apache.streams/streams-persist-elasticsearch/0.3-incubating-SNAPSHOT/streams-persist-elasticsearch-0.3-incubating-SNAPSHOT.pom
No prior successful build to compare, so performing full copy of artifacts
[JENKINS] Archiving <https://builds.apache.org/job/Streams%20Project%20Site/ws/streams-contrib/streams-provider-twitter/pom.xml>
to org.apache.streams/streams-provider-twitter/0.3-incubating-SNAPSHOT/streams-provider-twitter-0.3-incubating-SNAPSHOT.pom
No prior successful build to compare, so performing full copy of artifacts
[JENKINS] Archiving <https://builds.apache.org/job/Streams%20Project%20Site/ws/streams-contrib/streams-processor-regex/pom.xml>
to org.apache.streams/streams-processor-regex/0.3-incubating-SNAPSHOT/streams-processor-regex-0.3-incubating-SNAPSHOT.pom
No prior successful build to compare, so performing full copy of artifacts
[JENKINS] Archiving <https://builds.apache.org/job/Streams%20Project%20Site/ws/streams-pojo/pom.xml>
to org.apache.streams/streams-pojo/0.3-incubating-SNAPSHOT/streams-pojo-0.3-incubating-SNAPSHOT.pom
No prior successful build to compare, so performing full copy of artifacts
[JENKINS] Archiving <https://builds.apache.org/job/Streams%20Project%20Site/ws/streams-contrib/streams-amazon-aws/pom.xml>
to org.apache.streams/streams-amazon-aws/0.3-incubating-SNAPSHOT/streams-amazon-aws-0.3-incubating-SNAPSHOT.pom
No prior successful build to compare, so performing full copy of artifacts
[JENKINS] Archiving <https://builds.apache.org/job/Streams%20Project%20Site/ws/streams-contrib/streams-persist-graph/pom.xml>
to org.apache.streams/streams-persist-graph/0.3-incubating-SNAPSHOT/streams-persist-graph-0.3-incubating-SNAPSHOT.pom
No prior successful build to compare, so performing full copy of artifacts
[JENKINS] Archiving <https://builds.apache.org/job/Streams%20Project%20Site/ws/streams-contrib/streams-provider-gnip/gnip-edc-youtube/pom.xml>
to org.apache.streams/gnip-edc-youtube/0.3-incubating-SNAPSHOT/gnip-edc-youtube-0.3-incubating-SNAPSHOT.pom
No prior successful build to compare, so performing full copy of artifacts
[JENKINS] Archiving <https://builds.apache.org/job/Streams%20Project%20Site/ws/streams-runtimes/streams-runtime-local/pom.xml>
to org.apache.streams/streams-runtime-local/0.3-incubating-SNAPSHOT/streams-runtime-local-0.3-incubating-SNAPSHOT.pom
No prior successful build to compare, so performing full copy of artifacts
[JENKINS] Archiving <https://builds.apache.org/job/Streams%20Project%20Site/ws/streams-contrib/pom.xml>
to org.apache.streams/streams-contrib/0.3-incubating-SNAPSHOT/streams-contrib-0.3-incubating-SNAPSHOT.pom
No prior successful build to compare, so performing full copy of artifacts
[JENKINS] Archiving <https://builds.apache.org/job/Streams%20Project%20Site/ws/streams-monitoring/pom.xml>
to org.apache.streams/streams-monitoring/0.3-incubating-SNAPSHOT/streams-monitoring-0.3-incubating-SNAPSHOT.pom
No prior successful build to compare, so performing full copy of artifacts
[JENKINS] Archiving <https://builds.apache.org/job/Streams%20Project%20Site/ws/pom.xml>
to org.apache.streams/streams-project/0.3-incubating-SNAPSHOT/streams-project-0.3-incubating-SNAPSHOT.pom
No prior successful build to compare, so performing full copy of artifacts
[JENKINS] Archiving <https://builds.apache.org/job/Streams%20Project%20Site/ws/streams-contrib/streams-processor-peoplepattern/pom.xml>
to org.apache.streams/streams-processor-peoplepattern/0.3-incubating-SNAPSHOT/streams-processor-peoplepattern-0.3-incubating-SNAPSHOT.pom
No prior successful build to compare, so performing full copy of artifacts
[JENKINS] Archiving <https://builds.apache.org/job/Streams%20Project%20Site/ws/streams-contrib/streams-provider-google/google-gplus/pom.xml>
to org.apache.streams/google-gplus/0.3-incubating-SNAPSHOT/google-gplus-0.3-incubating-SNAPSHOT.pom
No prior successful build to compare, so performing full copy of artifacts
[JENKINS] Archiving <https://builds.apache.org/job/Streams%20Project%20Site/ws/streams-contrib/streams-provider-gnip/pom.xml>
to org.apache.streams/streams-provider-gnip/0.3-incubating-SNAPSHOT/streams-provider-gnip-0.3-incubating-SNAPSHOT.pom
No prior successful build to compare, so performing full copy of artifacts
[JENKINS] Archiving <https://builds.apache.org/job/Streams%20Project%20Site/ws/streams-contrib/streams-persist-console/pom.xml>
to org.apache.streams/streams-persist-console/0.3-incubating-SNAPSHOT/streams-persist-console-0.3-incubating-SNAPSHOT.pom
No prior successful build to compare, so performing full copy of artifacts
[JENKINS] Archiving <https://builds.apache.org/job/Streams%20Project%20Site/ws/streams-contrib/streams-persist-hdfs/pom.xml>
to org.apache.streams/streams-persist-hdfs/0.3-incubating-SNAPSHOT/streams-persist-hdfs-0.3-incubating-SNAPSHOT.pom
No prior successful build to compare, so performing full copy of artifacts
[JENKINS] Archiving <https://builds.apache.org/job/Streams%20Project%20Site/ws/streams-contrib/streams-provider-datasift/pom.xml>
to org.apache.streams/streams-provider-datasift/0.3-incubating-SNAPSHOT/streams-provider-datasift-0.3-incubating-SNAPSHOT.pom
No prior successful build to compare, so performing full copy of artifacts
[JENKINS] Archiving <https://builds.apache.org/job/Streams%20Project%20Site/ws/streams-contrib/streams-provider-google/google-gmail/pom.xml>
to org.apache.streams/google-gmail/0.3-incubating-SNAPSHOT/google-gmail-0.3-incubating-SNAPSHOT.pom
No prior successful build to compare, so performing full copy of artifacts
[JENKINS] Archiving <https://builds.apache.org/job/Streams%20Project%20Site/ws/streams-contrib/streams-provider-gnip/gnip-edc-instagram/pom.xml>
to org.apache.streams/gnip-edc-instagram/0.3-incubating-SNAPSHOT/gnip-edc-instagram-0.3-incubating-SNAPSHOT.pom
No prior successful build to compare, so performing full copy of artifacts
channel stopped

Mime
View raw message