streams-commits mailing list archives

Site index · List index
Message view « Date » · « Thread »
Top « Date » · « Thread »
From Apache Jenkins Server <jenk...@builds.apache.org>
Subject Build failed in Jenkins: Streams Master #45
Date Mon, 25 Apr 2016 16:31:04 GMT
See <https://builds.apache.org/job/Streams%20Master/45/>

------------------------------------------
[...truncated 13155 lines...]
4699/5527 KB   
4703/5527 KB   
4707/5527 KB   
4711/5527 KB   
4715/5527 KB   
4719/5527 KB   
4723/5527 KB   
4727/5527 KB   
4731/5527 KB   
4735/5527 KB   
4739/5527 KB   
4743/5527 KB   
4747/5527 KB   
4751/5527 KB   
4755/5527 KB   
4759/5527 KB   
4763/5527 KB   
4767/5527 KB   
4771/5527 KB   
4775/5527 KB   
4779/5527 KB   
4783/5527 KB   
4787/5527 KB   
4791/5527 KB   
4795/5527 KB   
4799/5527 KB   
4803/5527 KB   
4807/5527 KB   
4811/5527 KB   
4815/5527 KB   
4819/5527 KB   
4823/5527 KB   
4827/5527 KB   
4831/5527 KB   
4835/5527 KB   
4839/5527 KB   
4843/5527 KB   
4847/5527 KB   
4851/5527 KB   
4855/5527 KB   
4859/5527 KB   
4863/5527 KB   
4867/5527 KB   
4871/5527 KB   
4875/5527 KB   
4879/5527 KB   
4883/5527 KB   
4887/5527 KB   
4891/5527 KB   
4895/5527 KB   
4899/5527 KB   
4903/5527 KB   
4907/5527 KB   
4911/5527 KB   
4915/5527 KB   
4919/5527 KB   
4923/5527 KB   
4927/5527 KB   
4931/5527 KB   
4935/5527 KB   
4939/5527 KB   
4943/5527 KB   
4947/5527 KB   
4951/5527 KB   
4955/5527 KB   
4959/5527 KB   
4963/5527 KB   
4967/5527 KB   
4971/5527 KB   
4975/5527 KB   
4979/5527 KB   
4983/5527 KB   
4987/5527 KB   
4991/5527 KB   
4995/5527 KB   
4999/5527 KB   
5003/5527 KB   
5007/5527 KB   
5011/5527 KB   
5015/5527 KB   
5019/5527 KB   
5023/5527 KB   
5027/5527 KB   
5031/5527 KB   
5035/5527 KB   
5039/5527 KB   
5043/5527 KB   
5047/5527 KB   
5051/5527 KB   
5055/5527 KB   
5059/5527 KB   
5063/5527 KB   
5067/5527 KB   
5071/5527 KB   
5075/5527 KB   
5079/5527 KB   
5083/5527 KB   
5087/5527 KB   
5091/5527 KB   
5095/5527 KB   
5099/5527 KB   
5103/5527 KB   
5107/5527 KB   
5111/5527 KB   
5115/5527 KB   
5119/5527 KB   
5123/5527 KB   
5127/5527 KB   
5131/5527 KB   
5135/5527 KB   
5139/5527 KB   
5143/5527 KB   
5147/5527 KB   
5151/5527 KB   
5155/5527 KB   
5159/5527 KB   
5163/5527 KB   
5167/5527 KB   
5171/5527 KB   
5175/5527 KB   
5179/5527 KB   
5183/5527 KB   
5187/5527 KB   
5191/5527 KB   
5195/5527 KB   
5199/5527 KB   
5203/5527 KB   
5207/5527 KB   
5211/5527 KB   
5215/5527 KB   
5219/5527 KB   
5223/5527 KB   
5227/5527 KB   
5231/5527 KB   
5235/5527 KB   
5239/5527 KB   
5243/5527 KB   
5247/5527 KB   
5251/5527 KB   
5255/5527 KB   
5259/5527 KB   
5263/5527 KB   
5267/5527 KB   
5271/5527 KB   
5275/5527 KB   
5279/5527 KB   
5283/5527 KB   
5287/5527 KB   
5291/5527 KB   
5295/5527 KB   
5299/5527 KB   
5303/5527 KB   
5307/5527 KB   
5311/5527 KB   
5315/5527 KB   
5319/5527 KB   
5323/5527 KB   
5327/5527 KB   
5331/5527 KB   
5335/5527 KB   
5339/5527 KB   
5343/5527 KB   
5347/5527 KB   
5351/5527 KB   
5355/5527 KB   
5359/5527 KB   
5363/5527 KB   
5367/5527 KB   
5371/5527 KB   
5375/5527 KB   
5379/5527 KB   
5383/5527 KB   
5387/5527 KB   
5391/5527 KB   
5395/5527 KB   
5399/5527 KB   
5403/5527 KB   
5407/5527 KB   
5411/5527 KB   
5415/5527 KB   
5419/5527 KB   
5423/5527 KB   
5427/5527 KB   
5431/5527 KB   
5435/5527 KB   
5439/5527 KB   
5443/5527 KB   
5447/5527 KB   
5451/5527 KB   
5455/5527 KB   
5459/5527 KB   
5463/5527 KB   
5467/5527 KB   
5471/5527 KB   
5475/5527 KB   
5479/5527 KB   
5483/5527 KB   
5487/5527 KB   
5491/5527 KB   
5495/5527 KB   
5499/5527 KB   
5503/5527 KB   
5507/5527 KB   
5511/5527 KB   
5515/5527 KB   
5519/5527 KB   
5523/5527 KB   
5527/5527 KB   
               
Downloaded: http://repo.maven.apache.org/maven2/org/codehaus/groovy/groovy-all/1.7.6/groovy-all-1.7.6.jar
(5527 KB at 8621.3 KB/sec)
[INFO] Checking out the pub tree from scm:svn:https://svn.apache.org/repos/infra/websites/production/streams/content/site/0.3-incubating-SNAPSHOT/streams-master
into <https://builds.apache.org/job/Streams%20Master/ws/target/scmpublish-checkout>
[INFO] Executing: /bin/sh -c cd "<https://builds.apache.org/job/Streams%20Master/ws/target">
&& svn --non-interactive checkout https://svn.apache.org/repos/infra/websites/production/streams/content/site/0.3-incubating-SNAPSHOT/streams-master
'<https://builds.apache.org/job/Streams%20Master/ws/target/scmpublish-checkout'>
[INFO] Working directory: <https://builds.apache.org/job/Streams%20Master/ws/target>
[INFO] Updating checkout directory with actual content in <https://builds.apache.org/job/Streams%20Master/ws/target/staging>
[INFO] Content consists in 8 directories and 63 files = 1 MB
[INFO] Publishing content into SCM will result in 10 addition(s), 54 update(s), 0 delete(s)
[INFO] scm add directories: [tutorial]
[INFO] Executing: /bin/sh -c cd "<https://builds.apache.org/job/Streams%20Master/ws/target/scmpublish-checkout">
&& svn add --non-recursive --targets /tmp/maven-scm-6705761225715164556-targets
[INFO] Working directory: <https://builds.apache.org/job/Streams%20Master/ws/target/scmpublish-checkout>
[INFO] scm add files: [tutorial/environment.html, tutorial/database.html, tutorial/docker.html,
tutorial/build.html, concepts.html, architecture.dot.svg, example.dot, architecture.dot, example.dot.svg]
[INFO] Executing: /bin/sh -c cd "<https://builds.apache.org/job/Streams%20Master/ws/target/scmpublish-checkout">
&& svn add --non-recursive --targets /tmp/maven-scm-2951010138958634788-targets
[INFO] Working directory: <https://builds.apache.org/job/Streams%20Master/ws/target/scmpublish-checkout>
[INFO] Checking in SCM, starting at Mon Apr 25 16:31:04 UTC 2016...
[INFO] Executing: /bin/sh -c cd "<https://builds.apache.org/job/Streams%20Master/ws/target/scmpublish-checkout">
&& svn --non-interactive commit --file /tmp/maven-scm-1273035671.commit
[INFO] Working directory: <https://builds.apache.org/job/Streams%20Master/ws/target/scmpublish-checkout>
[ERROR] Failed to check-in files to SCM: The svn command failed. svn: E215004: Authentication
failed and interactive prompting is disabled; see the --force-interactive option
svn: E215004: Commit failed (details follow):
svn: E215004: No more credentials or we tried too many times.
Authentication failed

[INFO] ------------------------------------------------------------------------
[INFO] BUILD FAILURE
[INFO] ------------------------------------------------------------------------
[INFO] Total time: 15.960s
[INFO] Finished at: Mon Apr 25 16:31:05 UTC 2016
[INFO] Final Memory: 15M/248M
[INFO] ------------------------------------------------------------------------
[ERROR] Failed to execute goal org.apache.maven.plugins:maven-scm-publish-plugin:1.1:publish-scm
(default-cli) on project streams-master: Failed to check-in files to SCM: The svn command
failed. svn: E215004: Authentication failed and interactive prompting is disabled; see the
--force-interactive option
[ERROR] svn: E215004: Commit failed (details follow):
[ERROR] svn: E215004: No more credentials or we tried too many times.
[ERROR] Authentication failed
[ERROR] -> [Help 1]
[ERROR] 
[ERROR] To see the full stack trace of the errors, re-run Maven with the -e switch.
[ERROR] Re-run Maven using the -X switch to enable full debug logging.
[ERROR] 
[ERROR] For more information about the errors and possible solutions, please read the following
articles:
[ERROR] [Help 1] http://cwiki.apache.org/confluence/display/MAVEN/MojoExecutionException
Build step 'Invoke top-level Maven targets' marked build as failure

Mime
View raw message