stratos-dev mailing list archives

Site index · List index
Message view « Date » · « Thread »
Top « Date » · « Thread »
From Apache Jenkins Server <jenk...@builds.apache.org>
Subject Build failed in Jenkins: Stratos-Master-Commit-Build » Apache Stratos - Cloud Controller #440
Date Mon, 27 Apr 2015 12:57:00 GMT
See <https://builds.apache.org/job/Stratos-Master-Commit-Build/org.apache.stratos$org.apache.stratos.cloud.controller/440/changes>

Changes:

[lahirus] Adding properties to add payload parameters in network partition

[lahirus] Minor improvements to the code

------------------------------------------
[...truncated 23 lines...]
Downloading: http://repo1.maven.org/maven2/org/apache/cassandra/cassandra-all/1.1.0/cassandra-all-1.1.0.pom
Downloaded: http://repo1.maven.org/maven2/org/apache/cassandra/cassandra-all/1.1.0/cassandra-all-1.1.0.pom
(14 KB at 734.9 KB/sec)
Downloading: http://repo1.maven.org/maven2/org/apache/cassandra/cassandra-parent/1.1.0/cassandra-parent-1.1.0.pom
Downloaded: http://repo1.maven.org/maven2/org/apache/cassandra/cassandra-parent/1.1.0/cassandra-parent-1.1.0.pom
(10 KB at 305.0 KB/sec)
Downloading: http://repo1.maven.org/maven2/com/ning/compress-lzf/0.8.4/compress-lzf-0.8.4.pom
Downloaded: http://repo1.maven.org/maven2/com/ning/compress-lzf/0.8.4/compress-lzf-0.8.4.pom
(8 KB at 393.5 KB/sec)
Downloading: http://repo1.maven.org/maven2/com/google/guava/guava/r08/guava-r08.pom
Downloaded: http://repo1.maven.org/maven2/com/google/guava/guava/r08/guava-r08.pom (4 KB at
167.6 KB/sec)
Downloading: http://repo1.maven.org/maven2/commons-cli/commons-cli/1.1/commons-cli-1.1.pom
Downloaded: http://repo1.maven.org/maven2/commons-cli/commons-cli/1.1/commons-cli-1.1.pom
(5 KB at 255.8 KB/sec)
Downloading: http://repo1.maven.org/maven2/com/googlecode/concurrentlinkedhashmap/concurrentlinkedhashmap-lru/1.2/concurrentlinkedhashmap-lru-1.2.pom
Downloaded: http://repo1.maven.org/maven2/com/googlecode/concurrentlinkedhashmap/concurrentlinkedhashmap-lru/1.2/concurrentlinkedhashmap-lru-1.2.pom
(8 KB at 410.2 KB/sec)
Downloading: http://repo1.maven.org/maven2/org/antlr/antlr/3.2/antlr-3.2.pom
Downloaded: http://repo1.maven.org/maven2/org/antlr/antlr/3.2/antlr-3.2.pom (4 KB at 176.7
KB/sec)
Downloading: http://repo1.maven.org/maven2/org/antlr/antlr-master/3.2/antlr-master-3.2.pom
Downloaded: http://repo1.maven.org/maven2/org/antlr/antlr-master/3.2/antlr-master-3.2.pom
(9 KB at 491.5 KB/sec)
Downloading: http://repo1.maven.org/maven2/org/antlr/antlr-runtime/3.2/antlr-runtime-3.2.pom
Downloaded: http://repo1.maven.org/maven2/org/antlr/antlr-runtime/3.2/antlr-runtime-3.2.pom
(4 KB at 232.6 KB/sec)
Downloading: http://repo1.maven.org/maven2/org/antlr/stringtemplate/3.2/stringtemplate-3.2.pom
Downloaded: http://repo1.maven.org/maven2/org/antlr/stringtemplate/3.2/stringtemplate-3.2.pom
(2 KB at 109.9 KB/sec)
Downloading: http://repo1.maven.org/maven2/org/apache/cassandra/deps/avro/1.4.0-cassandra-1/avro-1.4.0-cassandra-1.pom
Downloaded: http://repo1.maven.org/maven2/org/apache/cassandra/deps/avro/1.4.0-cassandra-1/avro-1.4.0-cassandra-1.pom
(4 KB at 197.1 KB/sec)
Downloading: http://repo1.maven.org/maven2/org/codehaus/jackson/jackson-mapper-asl/1.4.2/jackson-mapper-asl-1.4.2.pom
Downloaded: http://repo1.maven.org/maven2/org/codehaus/jackson/jackson-mapper-asl/1.4.2/jackson-mapper-asl-1.4.2.pom
(2 KB at 67.4 KB/sec)
Downloading: http://repo1.maven.org/maven2/org/codehaus/jackson/jackson-core-asl/1.4.2/jackson-core-asl-1.4.2.pom
Downloaded: http://repo1.maven.org/maven2/org/codehaus/jackson/jackson-core-asl/1.4.2/jackson-core-asl-1.4.2.pom
(1016 B at 55.1 KB/sec)
Downloading: http://repo1.maven.org/maven2/org/slf4j/slf4j-api/1.5.11/slf4j-api-1.5.11.pom
Downloaded: http://repo1.maven.org/maven2/org/slf4j/slf4j-api/1.5.11/slf4j-api-1.5.11.pom
(3 KB at 172.0 KB/sec)
Downloading: http://repo1.maven.org/maven2/org/slf4j/slf4j-parent/1.5.11/slf4j-parent-1.5.11.pom
Downloaded: http://repo1.maven.org/maven2/org/slf4j/slf4j-parent/1.5.11/slf4j-parent-1.5.11.pom
(9 KB at 477.8 KB/sec)
Downloading: http://repo1.maven.org/maven2/org/mortbay/jetty/jetty/6.1.22/jetty-6.1.22.pom
Downloaded: http://repo1.maven.org/maven2/org/mortbay/jetty/jetty/6.1.22/jetty-6.1.22.pom
(7 KB at 339.6 KB/sec)
Downloading: http://repo1.maven.org/maven2/org/mortbay/jetty/project/6.1.22/project-6.1.22.pom
Downloaded: http://repo1.maven.org/maven2/org/mortbay/jetty/project/6.1.22/project-6.1.22.pom
(9 KB at 497.5 KB/sec)
Downloading: http://repo1.maven.org/maven2/org/mortbay/jetty/jetty-util/6.1.22/jetty-util-6.1.22.pom
Downloaded: http://repo1.maven.org/maven2/org/mortbay/jetty/jetty-util/6.1.22/jetty-util-6.1.22.pom
(4 KB at 210.3 KB/sec)
Downloading: http://repo1.maven.org/maven2/org/codehaus/jackson/jackson-core-asl/1.4.0/jackson-core-asl-1.4.0.pom
Downloaded: http://repo1.maven.org/maven2/org/codehaus/jackson/jackson-core-asl/1.4.0/jackson-core-asl-1.4.0.pom
(1016 B at 58.4 KB/sec)
Downloading: http://repo1.maven.org/maven2/org/codehaus/jackson/jackson-mapper-asl/1.4.0/jackson-mapper-asl-1.4.0.pom
Downloaded: http://repo1.maven.org/maven2/org/codehaus/jackson/jackson-mapper-asl/1.4.0/jackson-mapper-asl-1.4.0.pom
(2 KB at 71.3 KB/sec)
Downloading: http://repo1.maven.org/maven2/com/googlecode/json-simple/json-simple/1.1/json-simple-1.1.pom
Downloaded: http://repo1.maven.org/maven2/com/googlecode/json-simple/json-simple/1.1/json-simple-1.1.pom
(2 KB at 55.8 KB/sec)
Downloading: http://repo1.maven.org/maven2/com/github/stephenc/high-scale-lib/high-scale-lib/1.1.2/high-scale-lib-1.1.2.pom
Downloaded: http://repo1.maven.org/maven2/com/github/stephenc/high-scale-lib/high-scale-lib/1.1.2/high-scale-lib-1.1.2.pom
(933 B at 50.6 KB/sec)
Downloading: http://repo1.maven.org/maven2/com/github/stephenc/high-scale-lib/high-scale-lib-parent/1.1.2/high-scale-lib-parent-1.1.2.pom
Downloaded: http://repo1.maven.org/maven2/com/github/stephenc/high-scale-lib/high-scale-lib-parent/1.1.2/high-scale-lib-parent-1.1.2.pom
(5 KB at 226.9 KB/sec)
Downloading: http://repo1.maven.org/maven2/org/yaml/snakeyaml/1.6/snakeyaml-1.6.pom
Downloaded: http://repo1.maven.org/maven2/org/yaml/snakeyaml/1.6/snakeyaml-1.6.pom (8 KB at
437.1 KB/sec)
Downloading: http://repo1.maven.org/maven2/edu/stanford/ppl/snaptree/0.1/snaptree-0.1.pom
Downloaded: http://repo1.maven.org/maven2/edu/stanford/ppl/snaptree/0.1/snaptree-0.1.pom (7
KB at 332.4 KB/sec)
Downloading: http://repo1.maven.org/maven2/com/yammer/metrics/metrics-core/2.0.3/metrics-core-2.0.3.pom
Downloaded: http://repo1.maven.org/maven2/com/yammer/metrics/metrics-core/2.0.3/metrics-core-2.0.3.pom
(2 KB at 68.2 KB/sec)
Downloading: http://repo1.maven.org/maven2/com/yammer/metrics/metrics-parent/2.0.3/metrics-parent-2.0.3.pom
Downloaded: http://repo1.maven.org/maven2/com/yammer/metrics/metrics-parent/2.0.3/metrics-parent-2.0.3.pom
(10 KB at 488.7 KB/sec)
Downloading: http://repo1.maven.org/maven2/org/apache/cassandra/cassandra-thrift/1.1.0/cassandra-thrift-1.1.0.pom
Downloaded: http://repo1.maven.org/maven2/org/apache/cassandra/cassandra-thrift/1.1.0/cassandra-thrift-1.1.0.pom
(10 KB at 441.9 KB/sec)
Downloading: http://repo1.maven.org/maven2/com/google/guava/guava/r09/guava-r09.pom
Downloaded: http://repo1.maven.org/maven2/com/google/guava/guava/r09/guava-r09.pom (4 KB at
167.6 KB/sec)
Downloading: http://repo1.maven.org/maven2/org/wso2/andes/wso2/andes-client/0.13.wso2v3/andes-client-0.13.wso2v3.pom
Downloading: http://maven.wso2.org/nexus/content/groups/wso2-public/org/wso2/andes/wso2/andes-client/0.13.wso2v3/andes-client-0.13.wso2v3.pom
Downloaded: http://maven.wso2.org/nexus/content/groups/wso2-public/org/wso2/andes/wso2/andes-client/0.13.wso2v3/andes-client-0.13.wso2v3.pom
(5 KB at 0.8 KB/sec)
Downloading: http://repo1.maven.org/maven2/org/apache/geronimo/specs/wso2/geronimo-jms_1.1_spec/1.1.0.wso2v1/geronimo-jms_1.1_spec-1.1.0.wso2v1.pom
Downloading: http://maven.wso2.org/nexus/content/groups/wso2-public/org/apache/geronimo/specs/wso2/geronimo-jms_1.1_spec/1.1.0.wso2v1/geronimo-jms_1.1_spec-1.1.0.wso2v1.pom
Downloaded: http://maven.wso2.org/nexus/content/groups/wso2-public/org/apache/geronimo/specs/wso2/geronimo-jms_1.1_spec/1.1.0.wso2v1/geronimo-jms_1.1_spec-1.1.0.wso2v1.pom
(3 KB at 1.2 KB/sec)
Downloading: http://repo1.maven.org/maven2/org/wso2/carbon/org.wso2.carbon.analytics.hive.stub/4.2.0/org.wso2.carbon.analytics.hive.stub-4.2.0.pom
Downloading: http://maven.wso2.org/nexus/content/groups/wso2-public/org/wso2/carbon/org.wso2.carbon.analytics.hive.stub/4.2.0/org.wso2.carbon.analytics.hive.stub-4.2.0.pom
Downloaded: http://maven.wso2.org/nexus/content/groups/wso2-public/org/wso2/carbon/org.wso2.carbon.analytics.hive.stub/4.2.0/org.wso2.carbon.analytics.hive.stub-4.2.0.pom
(7 KB at 2.7 KB/sec)
Downloading: http://maven.wso2.org/nexus/content/groups/wso2-public/net/schmizz/sshj/maven-metadata.xml
Downloading: http://repo.springsource.org/plugins-release/net/schmizz/sshj/maven-metadata.xml
Downloaded: http://repo.springsource.org/plugins-release/net/schmizz/sshj/maven-metadata.xml
(818 B at 4.9 KB/sec)
Downloaded: http://maven.wso2.org/nexus/content/groups/wso2-public/net/schmizz/sshj/maven-metadata.xml
(970 B at 0.1 KB/sec)
Downloading: http://repo1.maven.org/maven2/net/schmizz/sshj/0.10.0-maven2/sshj-0.10.0-maven2.pom
Downloading: http://maven.wso2.org/nexus/content/groups/wso2-public/net/schmizz/sshj/0.10.0-maven2/sshj-0.10.0-maven2.pom
Downloaded: http://maven.wso2.org/nexus/content/groups/wso2-public/net/schmizz/sshj/0.10.0-maven2/sshj-0.10.0-maven2.pom
(12 KB at 4.3 KB/sec)
Downloading: http://repo1.maven.org/maven2/net/schmizz/sshj/0.10.0-maven2-1/sshj-0.10.0-maven2-1.pom
Downloading: http://maven.wso2.org/nexus/content/groups/wso2-public/net/schmizz/sshj/0.10.0-maven2-1/sshj-0.10.0-maven2-1.pom
Downloaded: http://maven.wso2.org/nexus/content/groups/wso2-public/net/schmizz/sshj/0.10.0-maven2-1/sshj-0.10.0-maven2-1.pom
(12 KB at 4.3 KB/sec)
Downloading: http://repo1.maven.org/maven2/net/schmizz/sshj/0.10.0-maven2-2/sshj-0.10.0-maven2-2.pom
Downloading: http://maven.wso2.org/nexus/content/groups/wso2-public/net/schmizz/sshj/0.10.0-maven2-2/sshj-0.10.0-maven2-2.pom
Downloaded: http://maven.wso2.org/nexus/content/groups/wso2-public/net/schmizz/sshj/0.10.0-maven2-2/sshj-0.10.0-maven2-2.pom
(12 KB at 4.2 KB/sec)
Downloading: http://repo1.maven.org/maven2/net/schmizz/sshj/0.10.0-maven2-3/sshj-0.10.0-maven2-3.pom
Downloading: http://maven.wso2.org/nexus/content/groups/wso2-public/net/schmizz/sshj/0.10.0-maven2-3/sshj-0.10.0-maven2-3.pom
Downloaded: http://maven.wso2.org/nexus/content/groups/wso2-public/net/schmizz/sshj/0.10.0-maven2-3/sshj-0.10.0-maven2-3.pom
(12 KB at 3.7 KB/sec)
Downloading: http://repo1.maven.org/maven2/org/apache/jclouds/driver/jclouds-enterprise/1.8.1/jclouds-enterprise-1.8.1.pom
Downloaded: http://repo1.maven.org/maven2/org/apache/jclouds/driver/jclouds-enterprise/1.8.1/jclouds-enterprise-1.8.1.pom
(4 KB at 99.1 KB/sec)
Downloading: http://repo1.maven.org/maven2/org/apache/jclouds/driver/jclouds-joda/1.8.1/jclouds-joda-1.8.1.pom
Downloaded: http://repo1.maven.org/maven2/org/apache/jclouds/driver/jclouds-joda/1.8.1/jclouds-joda-1.8.1.pom
(3 KB at 152.4 KB/sec)
Downloading: http://repo1.maven.org/maven2/org/apache/jclouds/driver/jclouds-netty/1.8.1/jclouds-netty-1.8.1.pom
Downloaded: http://repo1.maven.org/maven2/org/apache/jclouds/driver/jclouds-netty/1.8.1/jclouds-netty-1.8.1.pom
(3 KB at 19.3 KB/sec)
Downloading: http://repo1.maven.org/maven2/io/netty/netty/3.5.9.Final/netty-3.5.9.Final.pom
Downloaded: http://repo1.maven.org/maven2/io/netty/netty/3.5.9.Final/netty-3.5.9.Final.pom
(26 KB at 821.7 KB/sec)
Downloading: http://repo1.maven.org/maven2/org/apache/jclouds/api/openstack-nova/1.8.1/openstack-nova-1.8.1.pom
Downloaded: http://repo1.maven.org/maven2/org/apache/jclouds/api/openstack-nova/1.8.1/openstack-nova-1.8.1.pom
(7 KB at 328.7 KB/sec)
Downloading: http://repo1.maven.org/maven2/com/jamesmurty/utils/wso2/java-xmlbuilder/0.4.wso2v1/java-xmlbuilder-0.4.wso2v1.pom
Downloading: http://maven.wso2.org/nexus/content/groups/wso2-public/com/jamesmurty/utils/wso2/java-xmlbuilder/0.4.wso2v1/java-xmlbuilder-0.4.wso2v1.pom
Downloaded: http://maven.wso2.org/nexus/content/groups/wso2-public/com/jamesmurty/utils/wso2/java-xmlbuilder/0.4.wso2v1/java-xmlbuilder-0.4.wso2v1.pom
(3 KB at 1.2 KB/sec)
Downloading: http://repo1.maven.org/maven2/com/google/code/gson/gson/2.2/gson-2.2.pom
Downloaded: http://repo1.maven.org/maven2/com/google/code/gson/gson/2.2/gson-2.2.pom (8 KB
at 235.7 KB/sec)
Downloading: http://repo1.maven.org/maven2/com/google/guice/wso2/guice/3.0.wso2v1/guice-3.0.wso2v1.pom
Downloading: http://maven.wso2.org/nexus/content/groups/wso2-public/com/google/guice/wso2/guice/3.0.wso2v1/guice-3.0.wso2v1.pom
Downloaded: http://maven.wso2.org/nexus/content/groups/wso2-public/com/google/guice/wso2/guice/3.0.wso2v1/guice-3.0.wso2v1.pom
(4 KB at 1.8 KB/sec)
Downloading: http://repo1.maven.org/maven2/com/google/inject/extensions/guice-multibindings/3.0/guice-multibindings-3.0.pom
Downloaded: http://repo1.maven.org/maven2/com/google/inject/extensions/guice-multibindings/3.0/guice-multibindings-3.0.pom
(547 B at 17.8 KB/sec)
Downloading: http://repo1.maven.org/maven2/com/google/guice/assistedinject/wso2/guice-assistedinject/3.0.wso2v1/guice-assistedinject-3.0.wso2v1.pom
Downloading: http://maven.wso2.org/nexus/content/groups/wso2-public/com/google/guice/assistedinject/wso2/guice-assistedinject/3.0.wso2v1/guice-assistedinject-3.0.wso2v1.pom
Downloaded: http://maven.wso2.org/nexus/content/groups/wso2-public/com/google/guice/assistedinject/wso2/guice-assistedinject/3.0.wso2v1/guice-assistedinject-3.0.wso2v1.pom
(4 KB at 1.4 KB/sec)
Downloading: http://repo1.maven.org/maven2/com/sun/jersey/jersey-core/1.12/jersey-core-1.12.pom
Downloaded: http://repo1.maven.org/maven2/com/sun/jersey/jersey-core/1.12/jersey-core-1.12.pom
(11 KB at 338.3 KB/sec)
Downloading: http://repo1.maven.org/maven2/com/sun/jersey/jersey-project/1.12/jersey-project-1.12.pom
Downloaded: http://repo1.maven.org/maven2/com/sun/jersey/jersey-project/1.12/jersey-project-1.12.pom
(17 KB at 530.4 KB/sec)
Downloading: http://repo1.maven.org/maven2/net/oauth/core/oauth/20100527/oauth-20100527.pom
Downloaded: http://repo1.maven.org/maven2/net/oauth/core/oauth/20100527/oauth-20100527.pom
(553 B at 31.8 KB/sec)
Downloading: http://repo1.maven.org/maven2/net/oauth/core/oauth-core-parent/20090531/oauth-core-parent-20090531.pom
Downloaded: http://repo1.maven.org/maven2/net/oauth/core/oauth-core-parent/20090531/oauth-core-parent-20090531.pom
(2 KB at 60.8 KB/sec)
Downloading: http://repo1.maven.org/maven2/net/oauth/oauth-parent/20090531/oauth-parent-20090531.pom
Downloaded: http://repo1.maven.org/maven2/net/oauth/oauth-parent/20090531/oauth-parent-20090531.pom
(4 KB at 177.5 KB/sec)
Downloading: http://repo1.maven.org/maven2/commons-io/wso2/commons-io/2.0.0.wso2v1/commons-io-2.0.0.wso2v1.pom
Downloading: http://maven.wso2.org/nexus/content/groups/wso2-public/commons-io/wso2/commons-io/2.0.0.wso2v1/commons-io-2.0.0.wso2v1.pom
Downloaded: http://maven.wso2.org/nexus/content/groups/wso2-public/commons-io/wso2/commons-io/2.0.0.wso2v1/commons-io-2.0.0.wso2v1.pom
(3 KB at 1.1 KB/sec)
Downloading: http://repo1.maven.org/maven2/rhino/wso2/js/1.7.0.R1-wso2v3/js-1.7.0.R1-wso2v3.pom
Downloading: http://maven.wso2.org/nexus/content/groups/wso2-public/rhino/wso2/js/1.7.0.R1-wso2v3/js-1.7.0.R1-wso2v3.pom
Downloaded: http://maven.wso2.org/nexus/content/groups/wso2-public/rhino/wso2/js/1.7.0.R1-wso2v3/js-1.7.0.R1-wso2v3.pom
(3 KB at 1.1 KB/sec)
Downloading: http://repo1.maven.org/maven2/com/jcraft/jsch.agentproxy.jsch/0.0.7/jsch.agentproxy.jsch-0.0.7.jar
Downloading: http://repo1.maven.org/maven2/org/reflections/reflections/0.9.9-RC1/reflections-0.9.9-RC1.jar
Downloading: http://repo1.maven.org/maven2/org/javassist/javassist/3.16.1-GA/javassist-3.16.1-GA.jar
Downloading: http://repo1.maven.org/maven2/org/apache/jclouds/api/cloudstack/1.8.1/cloudstack-1.8.1.jar
Downloading: http://repo1.maven.org/maven2/org/hectorclient/wso2/hector-core/1.1.0.wso2v1/hector-core-1.1.0.wso2v1.jar
Downloaded: http://repo1.maven.org/maven2/com/jcraft/jsch.agentproxy.jsch/0.0.7/jsch.agentproxy.jsch-0.0.7.jar
(5 KB at 142.3 KB/sec)
Downloading: http://repo1.maven.org/maven2/org/hectorclient/hector-core/1.1-0/hector-core-1.1-0.jar
Downloading: http://repo1.maven.org/maven2/commons-pool/commons-pool/1.5.3/commons-pool-1.5.3.jar
Downloaded: http://repo1.maven.org/maven2/org/reflections/reflections/0.9.9-RC1/reflections-0.9.9-RC1.jar
(119 KB at 1193.7 KB/sec)
Downloading: http://repo1.maven.org/maven2/org/apache/cassandra/cassandra-all/1.1.0/cassandra-all-1.1.0.jar
Downloaded: http://repo1.maven.org/maven2/commons-pool/commons-pool/1.5.3/commons-pool-1.5.3.jar
(94 KB at 1055.6 KB/sec)
Downloading: http://repo1.maven.org/maven2/com/ning/compress-lzf/0.8.4/compress-lzf-0.8.4.jar
Downloaded: http://repo1.maven.org/maven2/com/ning/compress-lzf/0.8.4/compress-lzf-0.8.4.jar
(25 KB at 1382.9 KB/sec)
Downloading: http://repo1.maven.org/maven2/com/googlecode/concurrentlinkedhashmap/concurrentlinkedhashmap-lru/1.2/concurrentlinkedhashmap-lru-1.2.jar
Downloaded: http://repo1.maven.org/maven2/com/googlecode/concurrentlinkedhashmap/concurrentlinkedhashmap-lru/1.2/concurrentlinkedhashmap-lru-1.2.jar
(52 KB at 1617.8 KB/sec)
Downloading: http://repo1.maven.org/maven2/org/antlr/antlr/3.2/antlr-3.2.jar
Downloaded: http://repo1.maven.org/maven2/org/javassist/javassist/3.16.1-GA/javassist-3.16.1-GA.jar
(644 KB at 2787.4 KB/sec)
Downloading: http://repo1.maven.org/maven2/org/antlr/antlr-runtime/3.2/antlr-runtime-3.2.jar
Downloaded: http://repo1.maven.org/maven2/org/apache/jclouds/api/cloudstack/1.8.1/cloudstack-1.8.1.jar
(740 KB at 3054.2 KB/sec)
Downloading: http://repo1.maven.org/maven2/org/antlr/stringtemplate/3.2/stringtemplate-3.2.jar
Downloaded: http://repo1.maven.org/maven2/org/hectorclient/hector-core/1.1-0/hector-core-1.1-0.jar
(530 KB at 2342.6 KB/sec)
Downloading: http://repo1.maven.org/maven2/org/apache/cassandra/deps/avro/1.4.0-cassandra-1/avro-1.4.0-cassandra-1.jar
Downloaded: http://repo1.maven.org/maven2/org/antlr/stringtemplate/3.2/stringtemplate-3.2.jar
(168 KB at 5090.6 KB/sec)
Downloading: http://repo1.maven.org/maven2/org/mortbay/jetty/jetty/6.1.22/jetty-6.1.22.jar
Downloaded: http://repo1.maven.org/maven2/org/antlr/antlr-runtime/3.2/antlr-runtime-3.2.jar
(149 KB at 3226.7 KB/sec)
Downloading: http://repo1.maven.org/maven2/org/mortbay/jetty/jetty-util/6.1.22/jetty-util-6.1.22.jar
Downloaded: http://repo1.maven.org/maven2/org/mortbay/jetty/jetty-util/6.1.22/jetty-util-6.1.22.jar
(173 KB at 3600.5 KB/sec)
Downloading: http://repo1.maven.org/maven2/org/codehaus/jackson/jackson-core-asl/1.4.0/jackson-core-asl-1.4.0.jar
Downloaded: http://repo1.maven.org/maven2/org/codehaus/jackson/jackson-core-asl/1.4.0/jackson-core-asl-1.4.0.jar
(147 KB at 2994.4 KB/sec)
Downloading: http://repo1.maven.org/maven2/org/codehaus/jackson/jackson-mapper-asl/1.4.0/jackson-mapper-asl-1.4.0.jar
Downloaded: http://repo1.maven.org/maven2/org/mortbay/jetty/jetty/6.1.22/jetty-6.1.22.jar
(525 KB at 5190.9 KB/sec)
Downloading: http://repo1.maven.org/maven2/com/googlecode/json-simple/json-simple/1.1/json-simple-1.1.jar
Downloaded: http://repo1.maven.org/maven2/com/googlecode/json-simple/json-simple/1.1/json-simple-1.1.jar
(16 KB at 979.4 KB/sec)
Downloading: http://repo1.maven.org/maven2/com/github/stephenc/high-scale-lib/high-scale-lib/1.1.2/high-scale-lib-1.1.2.jar
Downloaded: http://repo1.maven.org/maven2/com/github/stephenc/high-scale-lib/high-scale-lib/1.1.2/high-scale-lib-1.1.2.jar
(94 KB at 4936.6 KB/sec)
Downloading: http://repo1.maven.org/maven2/org/yaml/snakeyaml/1.6/snakeyaml-1.6.jar
Downloaded: http://repo1.maven.org/maven2/org/antlr/antlr/3.2/antlr-3.2.jar (875 KB at 3455.1
KB/sec)
Downloading: http://repo1.maven.org/maven2/edu/stanford/ppl/snaptree/0.1/snaptree-0.1.jar
Downloaded: http://repo1.maven.org/maven2/org/apache/cassandra/deps/avro/1.4.0-cassandra-1/avro-1.4.0-cassandra-1.jar
(583 KB at 3386.1 KB/sec)
Downloading: http://repo1.maven.org/maven2/com/yammer/metrics/metrics-core/2.0.3/metrics-core-2.0.3.jar
Downloaded: http://repo1.maven.org/maven2/edu/stanford/ppl/snaptree/0.1/snaptree-0.1.jar (54
KB at 2688.8 KB/sec)
Downloading: http://repo1.maven.org/maven2/org/apache/cassandra/cassandra-thrift/1.1.0/cassandra-thrift-1.1.0.jar
Downloaded: http://repo1.maven.org/maven2/com/yammer/metrics/metrics-core/2.0.3/metrics-core-2.0.3.jar
(79 KB at 2391.1 KB/sec)
Downloading: http://repo1.maven.org/maven2/org/wso2/andes/wso2/andes-client/0.13.wso2v3/andes-client-0.13.wso2v3.jar
Downloaded: http://repo1.maven.org/maven2/org/yaml/snakeyaml/1.6/snakeyaml-1.6.jar (227 KB
at 4359.2 KB/sec)
Downloading: http://repo1.maven.org/maven2/org/apache/geronimo/specs/wso2/geronimo-jms_1.1_spec/1.1.0.wso2v1/geronimo-jms_1.1_spec-1.1.0.wso2v1.jar
Downloading: http://repo1.maven.org/maven2/org/wso2/carbon/org.wso2.carbon.analytics.hive.stub/4.2.0/org.wso2.carbon.analytics.hive.stub-4.2.0.jar
Downloaded: http://repo1.maven.org/maven2/org/codehaus/jackson/jackson-mapper-asl/1.4.0/jackson-mapper-asl-1.4.0.jar
(378 KB at 3626.8 KB/sec)
Downloading: http://repo1.maven.org/maven2/org/apache/jclouds/driver/jclouds-enterprise/1.8.1/jclouds-enterprise-1.8.1.jar
Downloading: http://repo1.maven.org/maven2/org/apache/jclouds/driver/jclouds-joda/1.8.1/jclouds-joda-1.8.1.jar
Downloaded: http://repo1.maven.org/maven2/org/apache/jclouds/driver/jclouds-enterprise/1.8.1/jclouds-enterprise-1.8.1.jar
(10 KB at 306.6 KB/sec)
Downloading: http://repo1.maven.org/maven2/org/apache/jclouds/driver/jclouds-netty/1.8.1/jclouds-netty-1.8.1.jar
Downloaded: http://repo1.maven.org/maven2/org/apache/cassandra/cassandra-all/1.1.0/cassandra-all-1.1.0.jar
(2065 KB at 4845.4 KB/sec)
Downloading: http://repo1.maven.org/maven2/io/netty/netty/3.5.9.Final/netty-3.5.9.Final.jar
Downloading: http://repo1.maven.org/maven2/org/apache/jclouds/api/openstack-nova/1.8.1/openstack-nova-1.8.1.jar
Downloaded: http://repo1.maven.org/maven2/org/apache/jclouds/driver/jclouds-joda/1.8.1/jclouds-joda-1.8.1.jar
(12 KB at 199.9 KB/sec)
Downloading: http://repo1.maven.org/maven2/com/jamesmurty/utils/wso2/java-xmlbuilder/0.4.wso2v1/java-xmlbuilder-0.4.wso2v1.jar
Downloaded: http://repo1.maven.org/maven2/org/apache/jclouds/driver/jclouds-netty/1.8.1/jclouds-netty-1.8.1.jar
(12 KB at 362.3 KB/sec)
Downloading: http://repo1.maven.org/maven2/com/google/code/gson/gson/2.2/gson-2.2.jar
Downloading: http://repo1.maven.org/maven2/com/google/guice/wso2/guice/3.0.wso2v1/guice-3.0.wso2v1.jar
Downloaded: http://repo1.maven.org/maven2/org/apache/cassandra/cassandra-thrift/1.1.0/cassandra-thrift-1.1.0.jar
(911 KB at 7585.1 KB/sec)
Downloading: http://repo1.maven.org/maven2/com/google/inject/extensions/guice-multibindings/3.0/guice-multibindings-3.0.jar
Downloaded: http://repo1.maven.org/maven2/com/google/inject/extensions/guice-multibindings/3.0/guice-multibindings-3.0.jar
(34 KB at 1870.2 KB/sec)
Downloading: http://repo1.maven.org/maven2/com/google/guice/assistedinject/wso2/guice-assistedinject/3.0.wso2v1/guice-assistedinject-3.0.wso2v1.jar
Downloaded: http://repo1.maven.org/maven2/com/google/code/gson/gson/2.2/gson-2.2.jar (186
KB at 3857.7 KB/sec)
Downloading: http://repo1.maven.org/maven2/com/sun/jersey/jersey-core/1.12/jersey-core-1.12.jar
Downloading: http://repo1.maven.org/maven2/net/oauth/core/oauth/20100527/oauth-20100527.jar
Downloaded: http://repo1.maven.org/maven2/io/netty/netty/3.5.9.Final/netty-3.5.9.Final.jar
(1103 KB at 11983.7 KB/sec)
Downloading: http://repo1.maven.org/maven2/commons-io/wso2/commons-io/2.0.0.wso2v1/commons-io-2.0.0.wso2v1.jar
Downloading: http://repo1.maven.org/maven2/rhino/wso2/js/1.7.0.R1-wso2v3/js-1.7.0.R1-wso2v3.jar
Downloading: http://repo1.maven.org/maven2/commons-pool/wso2/commons-pool/1.5.0.wso2v1/commons-pool-1.5.0.wso2v1.jar
Downloaded: http://repo1.maven.org/maven2/net/oauth/core/oauth/20100527/oauth-20100527.jar
(44 KB at 731.7 KB/sec)
Downloaded: http://repo1.maven.org/maven2/org/apache/jclouds/api/openstack-nova/1.8.1/openstack-nova-1.8.1.jar
(375 KB at 2601.0 KB/sec)
Downloaded: http://repo1.maven.org/maven2/com/sun/jersey/jersey-core/1.12/jersey-core-1.12.jar
(452 KB at 3991.5 KB/sec)
Downloading: http://maven.wso2.org/nexus/content/groups/wso2-public/org/hectorclient/wso2/hector-core/1.1.0.wso2v1/hector-core-1.1.0.wso2v1.jar
Downloading: http://maven.wso2.org/nexus/content/groups/wso2-public/org/wso2/andes/wso2/andes-client/0.13.wso2v3/andes-client-0.13.wso2v3.jar
Downloading: http://maven.wso2.org/nexus/content/groups/wso2-public/org/apache/geronimo/specs/wso2/geronimo-jms_1.1_spec/1.1.0.wso2v1/geronimo-jms_1.1_spec-1.1.0.wso2v1.jar
Downloading: http://maven.wso2.org/nexus/content/groups/wso2-public/com/jamesmurty/utils/wso2/java-xmlbuilder/0.4.wso2v1/java-xmlbuilder-0.4.wso2v1.jar
Downloading: http://maven.wso2.org/nexus/content/groups/wso2-public/org/wso2/carbon/org.wso2.carbon.analytics.hive.stub/4.2.0/org.wso2.carbon.analytics.hive.stub-4.2.0.jar
Downloaded: http://maven.wso2.org/nexus/content/groups/wso2-public/org/apache/geronimo/specs/wso2/geronimo-jms_1.1_spec/1.1.0.wso2v1/geronimo-jms_1.1_spec-1.1.0.wso2v1.jar
(29 KB at 11.7 KB/sec)
Downloading: http://maven.wso2.org/nexus/content/groups/wso2-public/com/google/guice/wso2/guice/3.0.wso2v1/guice-3.0.wso2v1.jar
Downloaded: http://maven.wso2.org/nexus/content/groups/wso2-public/com/jamesmurty/utils/wso2/java-xmlbuilder/0.4.wso2v1/java-xmlbuilder-0.4.wso2v1.jar
(19 KB at 6.6 KB/sec)
Downloading: http://maven.wso2.org/nexus/content/groups/wso2-public/com/google/guice/assistedinject/wso2/guice-assistedinject/3.0.wso2v1/guice-assistedinject-3.0.wso2v1.jar
Downloaded: http://maven.wso2.org/nexus/content/groups/wso2-public/org/wso2/carbon/org.wso2.carbon.analytics.hive.stub/4.2.0/org.wso2.carbon.analytics.hive.stub-4.2.0.jar
(146 KB at 42.8 KB/sec)
Downloading: http://maven.wso2.org/nexus/content/groups/wso2-public/commons-io/wso2/commons-io/2.0.0.wso2v1/commons-io-2.0.0.wso2v1.jar
Downloaded: http://maven.wso2.org/nexus/content/groups/wso2-public/org/hectorclient/wso2/hector-core/1.1.0.wso2v1/hector-core-1.1.0.wso2v1.jar
(529 KB at 108.1 KB/sec)
Downloading: http://maven.wso2.org/nexus/content/groups/wso2-public/rhino/wso2/js/1.7.0.R1-wso2v3/js-1.7.0.R1-wso2v3.jar
Downloaded: http://maven.wso2.org/nexus/content/groups/wso2-public/org/wso2/andes/wso2/andes-client/0.13.wso2v3/andes-client-0.13.wso2v3.jar
(2092 KB at 385.3 KB/sec)
Downloading: http://maven.wso2.org/nexus/content/groups/wso2-public/commons-pool/wso2/commons-pool/1.5.0.wso2v1/commons-pool-1.5.0.wso2v1.jar
Downloaded: http://maven.wso2.org/nexus/content/groups/wso2-public/com/google/guice/assistedinject/wso2/guice-assistedinject/3.0.wso2v1/guice-assistedinject-3.0.wso2v1.jar
(35 KB at 11.6 KB/sec)
Downloaded: http://maven.wso2.org/nexus/content/groups/wso2-public/commons-io/wso2/commons-io/2.0.0.wso2v1/commons-io-2.0.0.wso2v1.jar
(152 KB at 44.3 KB/sec)
Downloaded: http://maven.wso2.org/nexus/content/groups/wso2-public/com/google/guice/wso2/guice/3.0.wso2v1/guice-3.0.wso2v1.jar
(740 KB at 163.6 KB/sec)
Downloaded: http://maven.wso2.org/nexus/content/groups/wso2-public/commons-pool/wso2/commons-pool/1.5.0.wso2v1/commons-pool-1.5.0.wso2v1.jar
(89 KB at 31.2 KB/sec)
Downloaded: http://maven.wso2.org/nexus/content/groups/wso2-public/rhino/wso2/js/1.7.0.R1-wso2v3/js-1.7.0.R1-wso2v3.jar
(747 KB at 150.9 KB/sec)
[INFO] 
[INFO] --- maven-clean-plugin:2.5:clean (default-clean) @ org.apache.stratos.cloud.controller
---
[INFO] 
[INFO] --- maven-enforcer-plugin:1.3.1:enforce (enforce) @ org.apache.stratos.cloud.controller
---
[INFO] 
[INFO] --- incremental-build-plugin:1.3:incremental-build (default) @ org.apache.stratos.cloud.controller
---
[INFO] Verifying module descriptor ...
[INFO] Pom descriptor modification detected.
[INFO] Deleting <https://builds.apache.org/job/Stratos-Master-Commit-Build/org.apache.stratos$org.apache.stratos.cloud.controller/ws/target>
[INFO] 
[INFO] --- maven-remote-resources-plugin:1.4:process (default) @ org.apache.stratos.cloud.controller
---
[INFO] artifact net.schmizz:sshj: checking for updates from wso2-nexus
[INFO] artifact net.schmizz:sshj: checking for updates from spring-plugin-releases
Downloading: http://repo1.maven.org/maven2/net/schmizz/sshj/0.10.1-SNAPSHOT/maven-metadata.xml
Downloading: http://maven.wso2.org/nexus/content/groups/wso2-public/net/schmizz/sshj/0.10.1-SNAPSHOT/maven-metadata.xml
Downloading: http://repo.springsource.org/plugins-release/net/schmizz/sshj/0.10.1-SNAPSHOT/maven-metadata.xml
[INFO] 
[INFO] --- maven-resources-plugin:2.6:resources (default-resources) @ org.apache.stratos.cloud.controller
---
[INFO] Using 'UTF-8' encoding to copy filtered resources.
[INFO] Copying 6 resources
[INFO] Copying 3 resources
[INFO] 
[INFO] --- maven-compiler-plugin:2.5.1:compile (default-compile) @ org.apache.stratos.cloud.controller
---
[INFO] Compiling 118 source files to <https://builds.apache.org/job/Stratos-Master-Commit-Build/org.apache.stratos$org.apache.stratos.cloud.controller/ws/target/classes>
[INFO] -------------------------------------------------------------
[ERROR] COMPILATION ERROR : 
[INFO] -------------------------------------------------------------
[ERROR] <https://builds.apache.org/job/Stratos-Master-Commit-Build/org.apache.stratos$org.apache.stratos.cloud.controller/ws/src/main/java/org/apache/stratos/cloud/controller/services/impl/CloudControllerServiceImpl.java>:[24,49]
package org.apache.stratos.autoscaler.applications does not exist
[ERROR] <https://builds.apache.org/job/Stratos-Master-Commit-Build/org.apache.stratos$org.apache.stratos.cloud.controller/ws/src/main/java/org/apache/stratos/cloud/controller/services/impl/CloudControllerServiceImpl.java>:[449,58]
cannot find symbol
symbol  : variable ApplicationUtils
location: class org.apache.stratos.cloud.controller.services.impl.CloudControllerServiceImpl
[INFO] 2 errors 
[INFO] -------------------------------------------------------------

Mime
View raw message