Hi Devs,

I am getting a build failure [1] when trying to build Stratos from the source distribution. Can someone please tell me how to sort this issue out.

[1]
Admin16s-MacBook-Air:stratos Admin16$ git pull
remote: Counting objects: 256, done.
remote: Compressing objects: 100% (132/132), done.
remote: Total 197 (delta 76), reused 0 (delta 0)
Receiving objects: 100% (197/197), 29.69 KiB | 0 bytes/s, done.
Resolving deltas: 100% (76/76), completed with 32 local objects.
From https://git-wip-us.apache.org/repos/asf/stratos
   66f1732..cd182f2  master     -> origin/master
   7cc23ff..495e86f  master-deployment-policy-fix-merge -> origin/master-deployment-policy-fix-merge
Updating 66f1732..cd182f2
Fast-forward
 .../src/main/java/org/apache/stratos/autoscaler/applications/pojo/PersistenceContext.java                         |   54 +++
 .../src/main/java/org/apache/stratos/autoscaler/applications/pojo/SubscribableInfoContext.java                    |    9 +
 .../src/main/java/org/apache/stratos/autoscaler/applications/pojo/VolumeContext.java                              |  126 ++++++
 .../org.apache.stratos.autoscaler/src/main/java/org/apache/stratos/autoscaler/monitor/cluster/ClusterMonitor.java |   68 ++--
 components/org.apache.stratos.autoscaler/src/main/java/org/apache/stratos/autoscaler/rule/RuleTasksDelegator.java |   70 ++--
 .../org.apache.stratos.common/src/main/java/org/apache/stratos/common/beans/application/SubscribableInfo.java     |   10 +
 components/org.apache.stratos.common/src/main/java/org/apache/stratos/common/beans/cartridge/PersistenceBean.java |    6 +-
 components/org.apache.stratos.common/src/main/java/org/apache/stratos/common/beans/cartridge/VolumeBean.java      |    2 +-
 components/org.apache.stratos.rest.endpoint/src/main/java/org/apache/stratos/rest/endpoint/api/StratosApiV41.java |  809 +++++++++++++++++++------------------
 .../org.apache.stratos.rest.endpoint/src/main/java/org/apache/stratos/rest/endpoint/api/StratosApiV41Utils.java   | 1252 +++++++++++++++++++++++++++++----------------------------
 .../src/main/java/org/apache/stratos/rest/endpoint/util/converter/ObjectConverter.java                            |  876 ++++++++++++++++++++++------------------
 products/cartridge-agent/modules/distribution/src/main/bin/stratos.sh                                             |    2 +-
 products/stratos/modules/distribution/src/main/conf/drools/scaling.drl                                            |   69 +++-
 service-stubs/org.apache.stratos.autoscaler.service.stub/src/main/resources/AutoscalerService.wsdl                | 1141 ++++++++++++++++++++++++++--------------------------
 14 files changed, 2445 insertions(+), 2049 deletions(-)
 create mode 100644 components/org.apache.stratos.autoscaler/src/main/java/org/apache/stratos/autoscaler/applications/pojo/PersistenceContext.java
 create mode 100644 components/org.apache.stratos.autoscaler/src/main/java/org/apache/stratos/autoscaler/applications/pojo/VolumeContext.java
Admin16s-MacBook-Air:stratos Admin16$ mvn clean install -Dmaven.test.skip=true
[INFO] Scanning for projects...
[WARNING] 
[WARNING] Some problems were encountered while building the effective model for org.apache.stratos:org.apache.stratos.autoscaler:bundle:4.1.0-SNAPSHOT
[WARNING] 'build.plugins.plugin.version' for org.apache.axis2:axis2-java2wsdl-maven-plugin is missing. @ line 236, column 21
[WARNING] 
[WARNING] Some problems were encountered while building the effective model for org.apache.stratos:org.apache.stratos.cloud.controller:bundle:4.1.0-SNAPSHOT
[WARNING] 'build.plugins.plugin.version' for org.apache.axis2:axis2-java2wsdl-maven-plugin is missing. @ line 72, column 21
[WARNING] 
[WARNING] Some problems were encountered while building the effective model for org.apache.stratos:org.apache.stratos.mock.iaas:bundle:4.1.0-SNAPSHOT
[WARNING] The expression ${pom.artifactId} is deprecated. Please use ${project.artifactId} instead.
[WARNING] The expression ${pom.artifactId} is deprecated. Please use ${project.artifactId} instead.
[WARNING] 
[WARNING] Some problems were encountered while building the effective model for org.apache.stratos:org.apache.stratos.mock.iaas.client:bundle:4.1.0-SNAPSHOT
[WARNING] The expression ${pom.artifactId} is deprecated. Please use ${project.artifactId} instead.
[WARNING] 
[WARNING] Some problems were encountered while building the effective model for org.apache.stratos:org.apache.stratos.mock.iaas.api.feature:pom:4.1.0-SNAPSHOT
[WARNING] 'build.plugins.plugin.version' for org.wso2.maven:carbon-p2-plugin is missing. @ line 266, column 21
[WARNING] 
[WARNING] Some problems were encountered while building the effective model for org.apache.stratos:org.apache.stratos.rest.endpoint.feature:pom:4.1.0-SNAPSHOT
[WARNING] 'build.plugins.plugin.version' for org.wso2.maven:carbon-p2-plugin is missing. @ line 271, column 21
[WARNING] 
[WARNING] Some problems were encountered while building the effective model for org.apache.stratos:org.apache.stratos.metadata.service.feature:pom:4.1.0-SNAPSHOT
[WARNING] 'build.plugins.plugin.version' for org.wso2.maven:carbon-p2-plugin is missing. @ line 273, column 21
[WARNING] 
[WARNING] Some problems were encountered while building the effective model for org.apache.stratos:python-cartridge-agent:pom:4.1.0-SNAPSHOT
[WARNING] The expression ${pom.version} is deprecated. Please use ${project.version} instead.
[WARNING] The expression ${pom.version} is deprecated. Please use ${project.version} instead.
[WARNING] 
[WARNING] It is highly recommended to fix these problems because they threaten the stability of your build.
[WARNING] 
[WARNING] For this reason, future Maven versions might no longer support building such malformed projects.
[WARNING] 
[INFO] ------------------------------------------------------------------------
[INFO] Reactor Build Order:
[INFO] 
[INFO] jclouds vcloud api
[INFO] jclouds openstack-neutron api
[INFO] jclouds Google Compute Engine provider
[INFO] jclouds Amazon EC2 provider
[INFO] Apache Stratos
[INFO] Apache Stratos - Dependent Projects
[INFO] WSO2 Carbon - UI
[INFO] Apache Stratos - Service Stubs
[INFO] Apache Stratos - Cloud Controller Service Stub
[INFO] Apache Stratos - Manager Service Stub
[INFO] Apache Stratos - Common Stubs
[INFO] Apache Stratos - Autoscaler Service Stub
[INFO] Apache Stratos - Components
[INFO] Apache Stratos - Common
[INFO] Apache Stratos - Messaging Component
[INFO] Apache Stratos - Metadata Client
[INFO] Apache Stratos - Autoscaler
[INFO] Apache Stratos - Kubernetes API Java Client
[INFO] Apache Stratos - Mock IaaS
[INFO] Apache Stratos - Mock IaaS API Client
[INFO] Apache Stratos - Cloud Controller
[INFO] Apache Stratos - Manager
[INFO] Apache Stratos - Deployment
[INFO] Apache Stratos - CLI
[INFO] Apache Stratos - Python Cartridge Agent
[INFO] Apache Stratos - Cartridge Agent
[INFO] Apache Stratos - Load Balancer - Common
[INFO] Apache Stratos - Load Balancer
[INFO] Apache Stratos - Load Balancer - Extension API
[INFO] Apache Stratos - TenantActivity
[INFO] Apache Stratos - Tenant Activity - User Interface
[INFO] Apache Stratos - Account Management
[INFO] Apache Stratos - Account Managment - User Interface
[INFO] Apache Stratos - Email Sender Component
[INFO] Apache Stratos - Validate Domains
[INFO] Apache Stratos - Validate Domains - User Interface
[INFO] Apache Stratos - SSO redirector UI component
[INFO] Apache Stratos - Keystore Generation and Management
[INFO] Apache Stratos - Activation
[INFO] Apache Stratos - Logging View UI
[INFO] Apache Stratos - RESTful admin service module
[INFO] Apache Stratos - Cloud Manager UI styles
[INFO] Apache Stratos - Custom Handlers
[INFO] Apache Stratos - Metadata Service
[INFO] Apache Stratos - Mock IaaS API
[INFO] Apache Stratos - Extensions
[INFO] Apache Stratos - CEP Extensions
[INFO] Apache Stratos - Load Balancer Extensions
[INFO] Apache Stratos - HAProxy Extension
[INFO] Apache Stratos - Features
[INFO] Apache Stratos - Load Balancer Features
[INFO] Apache Stratos - Load Balancer - Management Feature
[INFO] Apache Stratos - Load Balancer - Common Feature
[INFO] Apache Stratos - Autoscaler Features
[INFO] Apache Stratos - Autoscaler Feature
[INFO] Apache Stratos - Mock IaaS Features
[INFO] Apache Stratos - Mock IaaS API Feature
[INFO] Apache Stratos - Cloud Controller Features
[INFO] Apache Stratos - Cloud Controller Feature
[INFO] Apache Stratos - Manager Features Aggregator Module
[INFO] Apache Stratos - Stratos Management Aggregator Module
[INFO] Apache Stratos - Management Core Feature
[INFO] Apache Stratos - Management Composite Feature
[INFO] Apache Stratos - GApp Feature Aggregator Module
[INFO] Apache Stratos - GApp Server Feature
[INFO] Apache Stratos - GApp UI Feature
[INFO] Apache Stratos - GApp Composite Feature
[INFO] Apache Stratos - Deployment Features
[INFO] Apache Stratos - Status Monitor Aggregator Module
[INFO] Apache Stratos - Status Monitor Server Feature
[INFO] Apache Stratos - Status Monitor UI Feature
[INFO] Apache Stratos - Status Monitor Agent Feature
[INFO] Apache Stratos - Status Monitor Feature
[INFO] Apache Stratos - Tenant activity Feature Aggregator Module
[INFO] Apache Stratos - Tenant Activity UI Feature
[INFO] Apache Stratos - Tenant activity Server Feature
[INFO] Apache Stratos - Logging Management Aggregator Module
[INFO] Apache Stratos - Logging Management Feature
[INFO] Apache Stratos - RESTful admin services feature
[INFO] Apache Stratos - stratos manager admin theme
[INFO] Apache Stratos - Meta Data Service feature
[INFO] Apache Stratos - Metadata client Feature
[INFO] Apache Stratos - Messaging Module
[INFO] Apache Stratos - Messaging Feature
[INFO] Apache Stratos - Common Features
[INFO] Apache Stratos - Common Server Feature
[INFO] Apache Stratos - Common UI Feature
[INFO] Apache Stratos - Common Composite Feature
[INFO] Apache Stratos - Custom Handlers Feature
[INFO] Apache Stratos - Products
[INFO] Apache Stratos - Python Cartridge Agent Product
[INFO] Apache Stratos - Cartridge Agent Product
[INFO] Apache Stratos - Cartridge Agent Distribution
[INFO] Apache Stratos - CLI Product
[INFO] Apache Stratos - CLI
[INFO] Apache Stratos - Load Balancer Product
[INFO] Apache Stratos - Load Balancer - P2 Profile Generation
[INFO] Apache Stratos - Load Balancer - Distribution
[INFO] Apache Stratos - Product
[INFO] Apache Stratos - Profile Generation
[INFO] Apache Stratos - Distribution
[INFO] Apache Stratos - Integration Tests
[INFO] Apache Stratos - Tools
[INFO] 
[INFO] Using the builder org.apache.maven.lifecycle.internal.builder.singlethreaded.SingleThreadedBuilder with a thread count of 1
[INFO]                                                                         
[INFO] ------------------------------------------------------------------------
[INFO] Building jclouds vcloud api 1.8.1-stratos
[INFO] ------------------------------------------------------------------------
Downloading: http://repo.maven.apache.org/maven2/net/schmizz/sshj/maven-metadata.xml
Downloading: https://repository.apache.org/content/repositories/snapshots/net/schmizz/sshj/maven-metadata.xml
Downloading: http://repository.apache.org/snapshots/net/schmizz/sshj/maven-metadata.xml
Downloading: https://oss.sonatype.org/content/repositories/snapshots/net/schmizz/sshj/maven-metadata.xml
Downloading: https://oss.sonatype.org/content/repositories/snapshots/net/schmizz/sshj/maven-metadata.xml
Downloaded: https://oss.sonatype.org/content/repositories/snapshots/net/schmizz/sshj/maven-metadata.xml (398 B at 0.1 KB/sec)
Downloaded: http://repo.maven.apache.org/maven2/net/schmizz/sshj/maven-metadata.xml (790 B at 0.2 KB/sec)
Downloaded: https://oss.sonatype.org/content/repositories/snapshots/net/schmizz/sshj/maven-metadata.xml (398 B at 0.2 KB/sec)
Downloading: http://repository.apache.org/snapshots/net/schmizz/sshj/0.9.1-SNAPSHOT/maven-metadata.xml
Downloading: https://repository.apache.org/content/repositories/snapshots/net/schmizz/sshj/0.9.1-SNAPSHOT/maven-metadata.xml
Downloading: https://oss.sonatype.org/content/repositories/snapshots/net/schmizz/sshj/0.9.1-SNAPSHOT/maven-metadata.xml
Downloading: https://oss.sonatype.org/content/repositories/snapshots/net/schmizz/sshj/0.9.1-SNAPSHOT/maven-metadata.xml
Downloaded: https://oss.sonatype.org/content/repositories/snapshots/net/schmizz/sshj/0.9.1-SNAPSHOT/maven-metadata.xml (2 KB at 1.5 KB/sec)
Downloaded: https://oss.sonatype.org/content/repositories/snapshots/net/schmizz/sshj/0.9.1-SNAPSHOT/maven-metadata.xml (2 KB at 1.5 KB/sec)
Downloading: https://repository.apache.org/content/repositories/snapshots/net/schmizz/sshj/0.10.1-SNAPSHOT/maven-metadata.xml
Downloading: https://oss.sonatype.org/content/repositories/snapshots/net/schmizz/sshj/0.10.1-SNAPSHOT/maven-metadata.xml
Downloading: http://repository.apache.org/snapshots/net/schmizz/sshj/0.10.1-SNAPSHOT/maven-metadata.xml
Downloading: https://oss.sonatype.org/content/repositories/snapshots/net/schmizz/sshj/0.10.1-SNAPSHOT/maven-metadata.xml
Downloaded: https://oss.sonatype.org/content/repositories/snapshots/net/schmizz/sshj/0.10.1-SNAPSHOT/maven-metadata.xml (2 KB at 1.8 KB/sec)
Downloaded: https://oss.sonatype.org/content/repositories/snapshots/net/schmizz/sshj/0.10.1-SNAPSHOT/maven-metadata.xml (2 KB at 1.8 KB/sec)
Downloading: https://repository.apache.org/content/repositories/snapshots/com/google/guava/guava/maven-metadata.xml
Downloading: http://repository.apache.org/snapshots/com/google/guava/guava/maven-metadata.xml
Downloading: http://repo.maven.apache.org/maven2/com/google/guava/guava/maven-metadata.xml
Downloading: https://oss.sonatype.org/content/repositories/snapshots/com/google/guava/guava/maven-metadata.xml
Downloaded: http://repo.maven.apache.org/maven2/com/google/guava/guava/maven-metadata.xml (2 KB at 2.2 KB/sec)
[INFO]   
[INFO] --- maven-clean-plugin:2.5:clean (default-clean) @ vcloud ---
[INFO] Deleting /Users/Admin16/Documents/Stratos_4.1.0/Master-branch/stratos/dependencies/jclouds/apis/vcloud/1.8.1-stratos/target
[INFO] 
[INFO] --- maven-enforcer-plugin:1.1.1:enforce (enforce-banned-dependencies) @ vcloud ---
[INFO] 
[INFO] --- maven-enforcer-plugin:1.1.1:enforce (enforce-java) @ vcloud ---
[INFO] 
[INFO] --- maven-remote-resources-plugin:1.5:process (default) @ vcloud ---
[INFO] artifact net.schmizz:sshj: checking for updates from central
[INFO] artifact net.schmizz:sshj: checking for updates from jclouds-sona-snapshots-nexus
[INFO] artifact com.google.guava:guava: checking for updates from central
[INFO] 
[INFO] --- maven-resources-plugin:2.6:resources (default-resources) @ vcloud ---
[INFO] Using 'UTF-8' encoding to copy filtered resources.
[INFO] skip non existing resourceDirectory /Users/Admin16/Documents/Stratos_4.1.0/Master-branch/stratos/dependencies/jclouds/apis/vcloud/1.8.1-stratos/src/main/clojure
[INFO] Copying 1 resource
[INFO] Copying 3 resources
[INFO] 
[INFO] --- maven-compiler-plugin:3.1:compile (default-compile) @ vcloud ---
[INFO] Changes detected - recompiling the module!
[INFO] Compiling 183 source files to /Users/Admin16/Documents/Stratos_4.1.0/Master-branch/stratos/dependencies/jclouds/apis/vcloud/1.8.1-stratos/target/classes
[WARNING] /Users/Admin16/Documents/Stratos_4.1.0/Master-branch/stratos/dependencies/jclouds/apis/vcloud/1.8.1-stratos/src/main/java/org/jclouds/vcloud/http/filters/VCloudBasicAuthentication.java:[48,32] warning: [cast] redundant cast to org.jclouds.domain.Credentials
[WARNING] Note: /Users/Admin16/Documents/Stratos_4.1.0/Master-branch/stratos/dependencies/jclouds/apis/vcloud/1.8.1-stratos/src/main/java/org/jclouds/vcloud/functions/ParseLoginResponseFromHeaders.java uses or overrides a deprecated API.
[WARNING] Note: Recompile with -Xlint:deprecation for details.
[WARNING] Note: Some input files use unchecked or unsafe operations.
[WARNING] Note: Recompile with -Xlint:unchecked for details.
[INFO] 
[INFO] --- maven-resources-plugin:2.6:testResources (default-testResources) @ vcloud ---
[INFO] Not copying test resources
[INFO] 
[INFO] --- maven-compiler-plugin:3.1:testCompile (default-testCompile) @ vcloud ---
[INFO] Not compiling test sources
[INFO] 
[INFO] --- maven-surefire-plugin:2.17:test (default-test) @ vcloud ---
[INFO] Tests are skipped.
[INFO] 
[INFO] --- maven-bundle-plugin:2.3.7:bundle (default-bundle) @ vcloud ---
[INFO] 
[INFO] --- maven-site-plugin:3.3:attach-descriptor (attach-descriptor) @ vcloud ---
[INFO] 
[INFO] --- apache-rat-plugin:0.10:check (default) @ vcloud ---
[INFO] 51 implicit excludes (use -debug for more details).
[INFO] Exclude: **/src/test/resources/**/*.sh
[INFO] Exclude: **/src/test/resources/**/*.bat
[INFO] Exclude: **/src/test/resources/**/*.cmd
[INFO] Exclude: **/src/test/resources/**/*.txt
[INFO] Exclude: **/src/test/resources/**/*.gz
[INFO] Exclude: **/src/test/resources/**/*.xml
[INFO] Exclude: **/services/*LoggingModule
[INFO] Exclude: **/services/*ApiMetadata
[INFO] Exclude: **/services/*ProviderMetadata
[INFO] Exclude: **/LICENSE.txt
[INFO] Exclude: **/header.txt
[INFO] Exclude: **/NOTICE.txt
[INFO] Exclude: **/DISCLAIMER
[INFO] Exclude: **/BUILD.txt
[INFO] Exclude: **/CHANGES.txt
[INFO] Exclude: **/README.md
[INFO] Exclude: **/README.txt
[INFO] Exclude: **/DEPENDENCIES
[INFO] Exclude: **/CONTRIBUTING.md
[INFO] Exclude: **/*json
[INFO] Exclude: **/*readme
[INFO] Exclude: **/test
[INFO] Exclude: **/test.pub
[INFO] Exclude: **/target/**
[INFO] Exclude: **/test-output/**
[INFO] Exclude: **/bin/**
[INFO] Exclude: **/.settings/**
[INFO] Exclude: **/.classpath
[INFO] Exclude: **/.dir-locals.el
[INFO] Exclude: **/.project
[INFO] Exclude: **/.idea/**
[INFO] Exclude: **/*.iml
[INFO] Exclude: **/*.eml
[INFO] Exclude: **/*.ipr
[INFO] Exclude: **/*.iws
[INFO] Exclude: **/*.DS_STORE
[INFO] Exclude: **/TAGS
[INFO] Exclude: **/.metadata/**
[INFO] Exclude: **/atlassian-ide-plugin.xml
[INFO] Exclude: **/.DS_Store
[INFO] Exclude: .mailmap
[INFO] Exclude: .git/**
[INFO] Exclude: **/.gitignore
[INFO] Exclude: **/.gitattributes
[INFO] Exclude: .repository/**
[INFO] Exclude: gc.log
[INFO] 246 resources included (use -debug for more details)
Warning:  org.apache.xerces.jaxp.SAXParserImpl$JAXPSAXParser: Property 'http://www.oracle.com/xml/jaxp/properties/entityExpansionLimit' is not recognized.
Warning:  org.apache.xerces.parsers.SAXParser: Feature 'http://javax.xml.XMLConstants/feature/secure-processing' is not recognized.
Warning:  org.apache.xerces.parsers.SAXParser: Property 'http://www.oracle.com/xml/jaxp/properties/entityExpansionLimit' is not recognized.
[INFO] Rat check: Summary of files. Unapproved: 0 unknown: 0 generated: 0 approved: 246 licence.
[INFO] 
[INFO] --- maven-jar-plugin:2.4:test-jar (default) @ vcloud ---
[INFO] Skipping packaging of the test-jar
[INFO] 
[INFO] --- maven-surefire-plugin:2.17:test (integration) @ vcloud ---
[INFO] Tests are skipped.
[INFO] 
[INFO] --- maven-duplicate-finder-plugin:1.0.5:check (default) @ vcloud ---
[INFO] Checking compile classpath
[INFO] Checking runtime classpath
[INFO] Checking test classpath
[INFO] 
[INFO] --- maven-install-plugin:2.4:install (default-install) @ vcloud ---
[INFO] Installing /Users/Admin16/Documents/Stratos_4.1.0/Master-branch/stratos/dependencies/jclouds/apis/vcloud/1.8.1-stratos/target/vcloud-1.8.1-stratos.jar to /Users/Admin16/.m2/repository/org/apache/stratos/vcloud/1.8.1-stratos/vcloud-1.8.1-stratos.jar
[INFO] Installing /Users/Admin16/Documents/Stratos_4.1.0/Master-branch/stratos/dependencies/jclouds/apis/vcloud/1.8.1-stratos/pom.xml to /Users/Admin16/.m2/repository/org/apache/stratos/vcloud/1.8.1-stratos/vcloud-1.8.1-stratos.pom
[INFO] 
[INFO] --- maven-bundle-plugin:2.3.7:install (default-install) @ vcloud ---
[INFO] Local OBR update disabled (enable with -DobrRepository)
[INFO]                                                                         
[INFO] ------------------------------------------------------------------------
[INFO] Building jclouds openstack-neutron api 1.8.1-stratos
[INFO] ------------------------------------------------------------------------
[INFO] 
[INFO] --- maven-clean-plugin:2.5:clean (default-clean) @ openstack-neutron ---
[INFO] Deleting /Users/Admin16/Documents/Stratos_4.1.0/Master-branch/stratos/dependencies/jclouds/apis/openstack-neutron/1.8.1-stratos/target
[INFO] 
[INFO] --- maven-enforcer-plugin:1.1.1:enforce (enforce-banned-dependencies) @ openstack-neutron ---
[INFO] 
[INFO] --- maven-enforcer-plugin:1.1.1:enforce (enforce-java) @ openstack-neutron ---
[INFO] 
[INFO] --- maven-remote-resources-plugin:1.5:process (default) @ openstack-neutron ---
[INFO] 
[INFO] --- maven-resources-plugin:2.6:resources (default-resources) @ openstack-neutron ---
[INFO] Using 'UTF-8' encoding to copy filtered resources.
[INFO] skip non existing resourceDirectory /Users/Admin16/Documents/Stratos_4.1.0/Master-branch/stratos/dependencies/jclouds/apis/openstack-neutron/1.8.1-stratos/src/main/clojure
[INFO] Copying 1 resource
[INFO] Copying 3 resources
[INFO] 
[INFO] --- maven-compiler-plugin:3.1:compile (default-compile) @ openstack-neutron ---
[INFO] Changes detected - recompiling the module!
[INFO] Compiling 135 source files to /Users/Admin16/Documents/Stratos_4.1.0/Master-branch/stratos/dependencies/jclouds/apis/openstack-neutron/1.8.1-stratos/target/classes
[WARNING] Note: Some input files use or override a deprecated API.
[WARNING] Note: Recompile with -Xlint:deprecation for details.
[INFO] 
[INFO] --- maven-resources-plugin:2.6:testResources (default-testResources) @ openstack-neutron ---
[INFO] Not copying test resources
[INFO] 
[INFO] --- maven-compiler-plugin:3.1:testCompile (default-testCompile) @ openstack-neutron ---
[INFO] Not compiling test sources
[INFO] 
[INFO] --- maven-surefire-plugin:2.17:test (default-test) @ openstack-neutron ---
[INFO] Tests are skipped.
[INFO] 
[INFO] --- maven-bundle-plugin:2.3.7:bundle (default-bundle) @ openstack-neutron ---
[INFO] 
[INFO] --- maven-site-plugin:3.3:attach-descriptor (attach-descriptor) @ openstack-neutron ---
[INFO] 
[INFO] --- apache-rat-plugin:0.10:check (default) @ openstack-neutron ---
[INFO] 51 implicit excludes (use -debug for more details).
[INFO] Exclude: **/src/test/resources/**/*.sh
[INFO] Exclude: **/src/test/resources/**/*.bat
[INFO] Exclude: **/src/test/resources/**/*.cmd
[INFO] Exclude: **/src/test/resources/**/*.txt
[INFO] Exclude: **/src/test/resources/**/*.gz
[INFO] Exclude: **/src/test/resources/**/*.xml
[INFO] Exclude: **/services/*LoggingModule
[INFO] Exclude: **/services/*ApiMetadata
[INFO] Exclude: **/services/*ProviderMetadata
[INFO] Exclude: **/LICENSE.txt
[INFO] Exclude: **/header.txt
[INFO] Exclude: **/NOTICE.txt
[INFO] Exclude: **/DISCLAIMER
[INFO] Exclude: **/BUILD.txt
[INFO] Exclude: **/CHANGES.txt
[INFO] Exclude: **/README.md
[INFO] Exclude: **/README.txt
[INFO] Exclude: **/DEPENDENCIES
[INFO] Exclude: **/CONTRIBUTING.md
[INFO] Exclude: **/*json
[INFO] Exclude: **/*readme
[INFO] Exclude: **/test
[INFO] Exclude: **/test.pub
[INFO] Exclude: **/target/**
[INFO] Exclude: **/test-output/**
[INFO] Exclude: **/bin/**
[INFO] Exclude: **/.settings/**
[INFO] Exclude: **/.classpath
[INFO] Exclude: **/.dir-locals.el
[INFO] Exclude: **/.project
[INFO] Exclude: **/.idea/**
[INFO] Exclude: **/*.iml
[INFO] Exclude: **/*.eml
[INFO] Exclude: **/*.ipr
[INFO] Exclude: **/*.iws
[INFO] Exclude: **/*.DS_STORE
[INFO] Exclude: **/TAGS
[INFO] Exclude: **/.metadata/**
[INFO] Exclude: **/atlassian-ide-plugin.xml
[INFO] Exclude: **/.DS_Store
[INFO] Exclude: .mailmap
[INFO] Exclude: .git/**
[INFO] Exclude: **/.gitignore
[INFO] Exclude: **/.gitattributes
[INFO] Exclude: .repository/**
[INFO] Exclude: gc.log
[INFO] 175 resources included (use -debug for more details)
Warning:  org.apache.xerces.jaxp.SAXParserImpl$JAXPSAXParser: Property 'http://www.oracle.com/xml/jaxp/properties/entityExpansionLimit' is not recognized.
[INFO] Rat check: Summary of files. Unapproved: 0 unknown: 0 generated: 0 approved: 175 licence.
[INFO] 
[INFO] --- maven-jar-plugin:2.4:test-jar (default) @ openstack-neutron ---
[INFO] Skipping packaging of the test-jar
[INFO] 
[INFO] --- maven-surefire-plugin:2.17:test (integration) @ openstack-neutron ---
[INFO] Tests are skipped.
[INFO] 
[INFO] --- maven-duplicate-finder-plugin:1.0.5:check (default) @ openstack-neutron ---
[INFO] Checking compile classpath
[INFO] Checking runtime classpath
[INFO] Checking test classpath
[INFO] 
[INFO] --- maven-install-plugin:2.4:install (default-install) @ openstack-neutron ---
[INFO] Installing /Users/Admin16/Documents/Stratos_4.1.0/Master-branch/stratos/dependencies/jclouds/apis/openstack-neutron/1.8.1-stratos/target/openstack-neutron-1.8.1-stratos.jar to /Users/Admin16/.m2/repository/org/apache/stratos/openstack-neutron/1.8.1-stratos/openstack-neutron-1.8.1-stratos.jar
[INFO] Installing /Users/Admin16/Documents/Stratos_4.1.0/Master-branch/stratos/dependencies/jclouds/apis/openstack-neutron/1.8.1-stratos/pom.xml to /Users/Admin16/.m2/repository/org/apache/stratos/openstack-neutron/1.8.1-stratos/openstack-neutron-1.8.1-stratos.pom
[INFO] 
[INFO] --- maven-bundle-plugin:2.3.7:install (default-install) @ openstack-neutron ---
[INFO] Local OBR update disabled (enable with -DobrRepository)
[INFO]                                                                         
[INFO] ------------------------------------------------------------------------
[INFO] Building jclouds Google Compute Engine provider 1.8.1-stratos
[INFO] ------------------------------------------------------------------------
[INFO] 
[INFO] --- maven-clean-plugin:2.5:clean (default-clean) @ gce ---
[INFO] Deleting /Users/Admin16/Documents/Stratos_4.1.0/Master-branch/stratos/dependencies/jclouds/apis/gce/1.8.1-stratos/target
[INFO] 
[INFO] --- maven-enforcer-plugin:1.1.1:enforce (enforce-banned-dependencies) @ gce ---
[INFO] 
[INFO] --- maven-enforcer-plugin:1.1.1:enforce (enforce-java) @ gce ---
[INFO] 
[INFO] --- maven-remote-resources-plugin:1.5:process (default) @ gce ---
[INFO] 
[INFO] --- maven-resources-plugin:2.6:resources (default-resources) @ gce ---
[INFO] Using 'UTF-8' encoding to copy filtered resources.
[INFO] skip non existing resourceDirectory /Users/Admin16/Documents/Stratos_4.1.0/Master-branch/stratos/dependencies/jclouds/apis/gce/1.8.1-stratos/src/main/clojure
[INFO] Copying 1 resource
[INFO] Copying 3 resources
[INFO] 
[INFO] --- maven-compiler-plugin:3.1:compile (default-compile) @ gce ---
[INFO] Changes detected - recompiling the module!
[INFO] Compiling 128 source files to /Users/Admin16/Documents/Stratos_4.1.0/Master-branch/stratos/dependencies/jclouds/apis/gce/1.8.1-stratos/target/classes
[WARNING] Note: Some input files use or override a deprecated API.
[WARNING] Note: Recompile with -Xlint:deprecation for details.
[WARNING] Note: Some input files use unchecked or unsafe operations.
[WARNING] Note: Recompile with -Xlint:unchecked for details.
[INFO] 
[INFO] --- maven-resources-plugin:2.6:testResources (default-testResources) @ gce ---
[INFO] Not copying test resources
[INFO] 
[INFO] --- maven-compiler-plugin:3.1:testCompile (default-testCompile) @ gce ---
[INFO] Not compiling test sources
[INFO] 
[INFO] --- maven-surefire-plugin:2.17:test (default-test) @ gce ---
[INFO] Tests are skipped.
[INFO] 
[INFO] --- maven-bundle-plugin:2.3.7:bundle (default-bundle) @ gce ---
[INFO] 
[INFO] --- maven-site-plugin:3.3:attach-descriptor (attach-descriptor) @ gce ---
[INFO] 
[INFO] --- apache-rat-plugin:0.10:check (default) @ gce ---
[INFO] 51 implicit excludes (use -debug for more details).
[INFO] Exclude: **/src/test/resources/**/*.sh
[INFO] Exclude: **/src/test/resources/**/*.bat
[INFO] Exclude: **/src/test/resources/**/*.cmd
[INFO] Exclude: **/src/test/resources/**/*.txt
[INFO] Exclude: **/src/test/resources/**/*.gz
[INFO] Exclude: **/src/test/resources/**/*.xml
[INFO] Exclude: **/services/*LoggingModule
[INFO] Exclude: **/services/*ApiMetadata
[INFO] Exclude: **/services/*ProviderMetadata
[INFO] Exclude: **/LICENSE.txt
[INFO] Exclude: **/header.txt
[INFO] Exclude: **/NOTICE.txt
[INFO] Exclude: **/DISCLAIMER
[INFO] Exclude: **/BUILD.txt
[INFO] Exclude: **/CHANGES.txt
[INFO] Exclude: **/README.md
[INFO] Exclude: **/README.txt
[INFO] Exclude: **/DEPENDENCIES
[INFO] Exclude: **/CONTRIBUTING.md
[INFO] Exclude: **/*json
[INFO] Exclude: **/*readme
[INFO] Exclude: **/test
[INFO] Exclude: **/test.pub
[INFO] Exclude: **/target/**
[INFO] Exclude: **/test-output/**
[INFO] Exclude: **/bin/**
[INFO] Exclude: **/.settings/**
[INFO] Exclude: **/.classpath
[INFO] Exclude: **/.dir-locals.el
[INFO] Exclude: **/.project
[INFO] Exclude: **/.idea/**
[INFO] Exclude: **/*.iml
[INFO] Exclude: **/*.eml
[INFO] Exclude: **/*.ipr
[INFO] Exclude: **/*.iws
[INFO] Exclude: **/*.DS_STORE
[INFO] Exclude: **/TAGS
[INFO] Exclude: **/.metadata/**
[INFO] Exclude: **/atlassian-ide-plugin.xml
[INFO] Exclude: **/.DS_Store
[INFO] Exclude: .mailmap
[INFO] Exclude: .git/**
[INFO] Exclude: **/.gitignore
[INFO] Exclude: **/.gitattributes
[INFO] Exclude: .repository/**
[INFO] Exclude: gc.log
[INFO] 224 resources included (use -debug for more details)
Warning:  org.apache.xerces.jaxp.SAXParserImpl$JAXPSAXParser: Property 'http://www.oracle.com/xml/jaxp/properties/entityExpansionLimit' is not recognized.
[INFO] Rat check: Summary of files. Unapproved: 0 unknown: 0 generated: 0 approved: 223 licence.
[INFO] 
[INFO] --- maven-jar-plugin:2.4:test-jar (default) @ gce ---
[INFO] Skipping packaging of the test-jar
[INFO] 
[INFO] --- maven-surefire-plugin:2.17:test (integration) @ gce ---
[INFO] Tests are skipped.
[INFO] 
[INFO] --- maven-duplicate-finder-plugin:1.0.5:check (default) @ gce ---
[INFO] Checking compile classpath
[INFO] Checking runtime classpath
[INFO] Checking test classpath
[INFO] 
[INFO] --- maven-install-plugin:2.4:install (default-install) @ gce ---
[INFO] Installing /Users/Admin16/Documents/Stratos_4.1.0/Master-branch/stratos/dependencies/jclouds/apis/gce/1.8.1-stratos/target/gce-1.8.1-stratos.jar to /Users/Admin16/.m2/repository/org/apache/stratos/gce/1.8.1-stratos/gce-1.8.1-stratos.jar
[INFO] Installing /Users/Admin16/Documents/Stratos_4.1.0/Master-branch/stratos/dependencies/jclouds/apis/gce/1.8.1-stratos/pom.xml to /Users/Admin16/.m2/repository/org/apache/stratos/gce/1.8.1-stratos/gce-1.8.1-stratos.pom
[INFO] 
[INFO] --- maven-bundle-plugin:2.3.7:install (default-install) @ gce ---
[INFO] Local OBR update disabled (enable with -DobrRepository)
[INFO]                                                                         
[INFO] ------------------------------------------------------------------------
[INFO] Building jclouds Amazon EC2 provider 1.8.1-stratos
[INFO] ------------------------------------------------------------------------
[INFO] 
[INFO] --- maven-clean-plugin:2.5:clean (default-clean) @ aws-ec2 ---
[INFO] Deleting /Users/Admin16/Documents/Stratos_4.1.0/Master-branch/stratos/dependencies/jclouds/provider/aws-ec2/1.8.1-stratos/target
[INFO] 
[INFO] --- maven-enforcer-plugin:1.1.1:enforce (enforce-banned-dependencies) @ aws-ec2 ---
[INFO] 
[INFO] --- maven-enforcer-plugin:1.1.1:enforce (enforce-java) @ aws-ec2 ---
[INFO] 
[INFO] --- maven-remote-resources-plugin:1.5:process (default) @ aws-ec2 ---
[INFO] 
[INFO] --- maven-resources-plugin:2.6:resources (default-resources) @ aws-ec2 ---
[INFO] Using 'UTF-8' encoding to copy filtered resources.
[INFO] Copying 1 resource
[INFO] Copying 1 resource
[INFO] Copying 3 resources
[INFO] 
[INFO] --- maven-compiler-plugin:3.1:compile (default-compile) @ aws-ec2 ---
[INFO] Changes detected - recompiling the module!
[INFO] Compiling 76 source files to /Users/Admin16/Documents/Stratos_4.1.0/Master-branch/stratos/dependencies/jclouds/provider/aws-ec2/1.8.1-stratos/target/classes
[WARNING] Note: Some input files use or override a deprecated API.
[WARNING] Note: Recompile with -Xlint:deprecation for details.
[INFO] 
[INFO] --- maven-resources-plugin:2.6:testResources (default-testResources) @ aws-ec2 ---
[INFO] Not copying test resources
[INFO] 
[INFO] --- maven-compiler-plugin:3.1:testCompile (default-testCompile) @ aws-ec2 ---
[INFO] Not compiling test sources
[INFO] 
[INFO] --- maven-surefire-plugin:2.17:test (default-test) @ aws-ec2 ---
[INFO] Tests are skipped.
[INFO] 
[INFO] --- clojure-maven-plugin:1.3.10:test (test-clojure) @ aws-ec2 ---
[INFO] Test execution is skipped
[INFO] 
[INFO] --- maven-bundle-plugin:2.3.7:bundle (default-bundle) @ aws-ec2 ---
[INFO] 
[INFO] --- maven-site-plugin:3.3:attach-descriptor (attach-descriptor) @ aws-ec2 ---
[INFO] 
[INFO] --- apache-rat-plugin:0.10:check (default) @ aws-ec2 ---
[INFO] 51 implicit excludes (use -debug for more details).
[INFO] Exclude: **/src/test/resources/**/*.sh
[INFO] Exclude: **/src/test/resources/**/*.bat
[INFO] Exclude: **/src/test/resources/**/*.cmd
[INFO] Exclude: **/src/test/resources/**/*.txt
[INFO] Exclude: **/src/test/resources/**/*.gz
[INFO] Exclude: **/src/test/resources/**/*.xml
[INFO] Exclude: **/services/*LoggingModule
[INFO] Exclude: **/services/*ApiMetadata
[INFO] Exclude: **/services/*ProviderMetadata
[INFO] Exclude: **/LICENSE.txt
[INFO] Exclude: **/header.txt
[INFO] Exclude: **/NOTICE.txt
[INFO] Exclude: **/DISCLAIMER
[INFO] Exclude: **/BUILD.txt
[INFO] Exclude: **/CHANGES.txt
[INFO] Exclude: **/README.md
[INFO] Exclude: **/README.txt
[INFO] Exclude: **/DEPENDENCIES
[INFO] Exclude: **/CONTRIBUTING.md
[INFO] Exclude: **/*json
[INFO] Exclude: **/*readme
[INFO] Exclude: **/test
[INFO] Exclude: **/test.pub
[INFO] Exclude: **/target/**
[INFO] Exclude: **/test-output/**
[INFO] Exclude: **/bin/**
[INFO] Exclude: **/.settings/**
[INFO] Exclude: **/.classpath
[INFO] Exclude: **/.dir-locals.el
[INFO] Exclude: **/.project
[INFO] Exclude: **/.idea/**
[INFO] Exclude: **/*.iml
[INFO] Exclude: **/*.eml
[INFO] Exclude: **/*.ipr
[INFO] Exclude: **/*.iws
[INFO] Exclude: **/*.DS_STORE
[INFO] Exclude: **/TAGS
[INFO] Exclude: **/.metadata/**
[INFO] Exclude: **/atlassian-ide-plugin.xml
[INFO] Exclude: **/.DS_Store
[INFO] Exclude: .mailmap
[INFO] Exclude: .git/**
[INFO] Exclude: **/.gitignore
[INFO] Exclude: **/.gitattributes
[INFO] Exclude: .repository/**
[INFO] Exclude: gc.log
[INFO] 136 resources included (use -debug for more details)
Warning:  org.apache.xerces.jaxp.SAXParserImpl$JAXPSAXParser: Property 'http://www.oracle.com/xml/jaxp/properties/entityExpansionLimit' is not recognized.
[INFO] Rat check: Summary of files. Unapproved: 0 unknown: 0 generated: 0 approved: 136 licence.
[INFO] 
[INFO] --- maven-jar-plugin:2.4:test-jar (default) @ aws-ec2 ---
[INFO] Skipping packaging of the test-jar
[INFO] 
[INFO] --- maven-surefire-plugin:2.17:test (integration) @ aws-ec2 ---
[INFO] Tests are skipped.
[INFO] 
[INFO] --- maven-duplicate-finder-plugin:1.0.5:check (default) @ aws-ec2 ---
[INFO] Checking compile classpath
[INFO] Checking runtime classpath
[INFO] Checking test classpath
[INFO] 
[INFO] --- maven-install-plugin:2.4:install (default-install) @ aws-ec2 ---
[INFO] Installing /Users/Admin16/Documents/Stratos_4.1.0/Master-branch/stratos/dependencies/jclouds/provider/aws-ec2/1.8.1-stratos/target/aws-ec2-1.8.1-stratos.jar to /Users/Admin16/.m2/repository/org/apache/stratos/aws-ec2/1.8.1-stratos/aws-ec2-1.8.1-stratos.jar
[INFO] Installing /Users/Admin16/Documents/Stratos_4.1.0/Master-branch/stratos/dependencies/jclouds/provider/aws-ec2/1.8.1-stratos/pom.xml to /Users/Admin16/.m2/repository/org/apache/stratos/aws-ec2/1.8.1-stratos/aws-ec2-1.8.1-stratos.pom
[INFO] 
[INFO] --- maven-bundle-plugin:2.3.7:install (default-install) @ aws-ec2 ---
[INFO] Local OBR update disabled (enable with -DobrRepository)
[INFO]                                                                         
[INFO] ------------------------------------------------------------------------
[INFO] Building Apache Stratos 4.1.0-SNAPSHOT
[INFO] ------------------------------------------------------------------------
Downloading: http://dist.wso2.org/maven2/org/apache/maven/plugins/maven-project-info-reports-plugin/maven-metadata.xml
Downloading: http://dist.wso2.org/snapshots/maven2/org/apache/maven/plugins/maven-project-info-reports-plugin/maven-metadata.xml
[INFO]   
[INFO] --- maven-clean-plugin:2.5:clean (default-clean) @ stratos-parent ---
[INFO] Deleting /Users/Admin16/Documents/Stratos_4.1.0/Master-branch/stratos/target
[INFO] 
[INFO] --- maven-enforcer-plugin:1.3.1:enforce (enforce) @ stratos-parent ---
[INFO] 
[INFO] --- incremental-build-plugin:1.3:incremental-build (default) @ stratos-parent ---
[INFO] Verifying module descriptor ...
[INFO] Pom descriptor modification detected.
[INFO] Deleting /Users/Admin16/Documents/Stratos_4.1.0/Master-branch/stratos/target
[INFO] 
[INFO] --- maven-remote-resources-plugin:1.4:process (default) @ stratos-parent ---
[INFO] 
[INFO] --- maven-site-plugin:3.2:attach-descriptor (attach-descriptor) @ stratos-parent ---
[INFO] 
[INFO] --- maven-source-plugin:2.2.1:jar-no-fork (attach-sources) @ stratos-parent ---
[INFO] 
[INFO] --- maven-install-plugin:2.3.1:install (default-install) @ stratos-parent ---
[INFO] Installing /Users/Admin16/Documents/Stratos_4.1.0/Master-branch/stratos/pom.xml to /Users/Admin16/.m2/repository/org/apache/stratos/stratos-parent/4.1.0-SNAPSHOT/stratos-parent-4.1.0-SNAPSHOT.pom
[INFO]                                                                         
[INFO] ------------------------------------------------------------------------
[INFO] Building Apache Stratos - Dependent Projects 4.1.0-SNAPSHOT
[INFO] ------------------------------------------------------------------------
[INFO] 
[INFO] --- maven-clean-plugin:2.5:clean (default-clean) @ stratos-dependents ---
[INFO] Deleting /Users/Admin16/Documents/Stratos_4.1.0/Master-branch/stratos/dependencies/target
[INFO] 
[INFO] --- maven-enforcer-plugin:1.3.1:enforce (enforce) @ stratos-dependents ---
[INFO] 
[INFO] --- incremental-build-plugin:1.3:incremental-build (default) @ stratos-dependents ---
[INFO] Verifying module descriptor ...
[INFO] Pom descriptor modification detected.
[INFO] Deleting /Users/Admin16/Documents/Stratos_4.1.0/Master-branch/stratos/dependencies/target
[INFO] 
[INFO] --- maven-remote-resources-plugin:1.4:process (default) @ stratos-dependents ---
[INFO] 
[INFO] --- maven-site-plugin:3.2:attach-descriptor (attach-descriptor) @ stratos-dependents ---
[INFO] 
[INFO] --- maven-source-plugin:2.2.1:jar-no-fork (attach-sources) @ stratos-dependents ---
[INFO] 
[INFO] --- maven-install-plugin:2.3.1:install (default-install) @ stratos-dependents ---
[INFO] Installing /Users/Admin16/Documents/Stratos_4.1.0/Master-branch/stratos/dependencies/pom.xml to /Users/Admin16/.m2/repository/org/apache/stratos/stratos-dependents/4.1.0-SNAPSHOT/stratos-dependents-4.1.0-SNAPSHOT.pom
[INFO]                                                                         
[INFO] ------------------------------------------------------------------------
[INFO] Building WSO2 Carbon - UI 4.2.0-stratos
[INFO] ------------------------------------------------------------------------
[INFO] 
[INFO] --- maven-clean-plugin:2.5:clean (default-clean) @ org.wso2.carbon.ui ---
[INFO] Deleting /Users/Admin16/Documents/Stratos_4.1.0/Master-branch/stratos/dependencies/org.wso2.carbon.ui/target
[INFO] 
[INFO] --- maven-enforcer-plugin:1.3.1:enforce (enforce) @ org.wso2.carbon.ui ---
[INFO] 
[INFO] --- incremental-build-plugin:1.3:incremental-build (default) @ org.wso2.carbon.ui ---
[INFO] Verifying module descriptor ...
[INFO] Pom descriptor modification detected.
[INFO] Deleting /Users/Admin16/Documents/Stratos_4.1.0/Master-branch/stratos/dependencies/org.wso2.carbon.ui/target
[INFO] 
[INFO] --- maven-remote-resources-plugin:1.4:process (default) @ org.wso2.carbon.ui ---
[INFO] 
[INFO] --- maven-resources-plugin:2.6:resources (default-resources) @ org.wso2.carbon.ui ---
[INFO] Using 'UTF-8' encoding to copy filtered resources.
[INFO] Copying 710 resources
[INFO] Copying 3 resources
[INFO] 
[INFO] --- maven-compiler-plugin:2.5.1:compile (default-compile) @ org.wso2.carbon.ui ---
[INFO] Compiling 77 source files to /Users/Admin16/Documents/Stratos_4.1.0/Master-branch/stratos/dependencies/org.wso2.carbon.ui/target/classes
[INFO] 
[INFO] --- maven-scr-plugin:1.7.2:scr (generate-scr-scrdescriptor) @ org.wso2.carbon.ui ---
[WARNING] Class org.wso2.carbon.ui.internal.CarbonUIServiceComponent is using deprecated javadoc tags  at file:/Users/Admin16/Documents/Stratos_4.1.0/Master-branch/stratos/dependencies/org.wso2.carbon.ui/src/main/java/org/wso2/carbon/ui/internal/CarbonUIServiceComponent.java:87
[WARNING] It is highly recommended to fix these problems, as future versions might not support these features anymore.
[INFO] Generating 2 MetaType Descriptors to /Users/Admin16/Documents/Stratos_4.1.0/Master-branch/stratos/dependencies/org.wso2.carbon.ui/target/scr-plugin-generated/OSGI-INF/metatype/metatype.xml
[INFO] Writing abstract service descriptor /Users/Admin16/Documents/Stratos_4.1.0/Master-branch/stratos/dependencies/org.wso2.carbon.ui/target/scr-plugin-generated/OSGI-INF/scr-plugin/scrinfo.xml with 1 entries.
[INFO] Generating 1 Service Component Descriptors to /Users/Admin16/Documents/Stratos_4.1.0/Master-branch/stratos/dependencies/org.wso2.carbon.ui/target/scr-plugin-generated/OSGI-INF/serviceComponents.xml
[INFO] 
[INFO] --- maven-resources-plugin:2.6:testResources (default-testResources) @ org.wso2.carbon.ui ---
[INFO] Not copying test resources
[INFO] 
[INFO] --- maven-compiler-plugin:2.5.1:testCompile (default-testCompile) @ org.wso2.carbon.ui ---
[INFO] Not compiling test sources
[INFO] 
[INFO] --- maven-surefire-plugin:2.12.4:test (default-test) @ org.wso2.carbon.ui ---
[INFO] Tests are skipped.
[INFO] 
[INFO] --- maven-bundle-plugin:2.3.5:bundle (default-bundle) @ org.wso2.carbon.ui ---
[INFO] 
[INFO] --- maven-site-plugin:3.2:attach-descriptor (attach-descriptor) @ org.wso2.carbon.ui ---
[INFO] 
[INFO] --- maven-source-plugin:2.2.1:jar-no-fork (attach-sources) @ org.wso2.carbon.ui ---
[WARNING] NOT adding sources to artifacts with classifier as Maven only supports one classifier per artifact. Current artifact [org.apache.stratos:org.wso2.carbon.ui:bundle:4.2.0-stratos] has a [] classifier.
[INFO] 
[INFO] --- maven-install-plugin:2.3.1:install (default-install) @ org.wso2.carbon.ui ---
[INFO] Installing /Users/Admin16/Documents/Stratos_4.1.0/Master-branch/stratos/dependencies/org.wso2.carbon.ui/target/org.wso2.carbon.ui-4.2.0-stratos.jar to /Users/Admin16/.m2/repository/org/apache/stratos/org.wso2.carbon.ui/4.2.0-stratos/org.wso2.carbon.ui-4.2.0-stratos.jar
[INFO] Installing /Users/Admin16/Documents/Stratos_4.1.0/Master-branch/stratos/dependencies/org.wso2.carbon.ui/pom.xml to /Users/Admin16/.m2/repository/org/apache/stratos/org.wso2.carbon.ui/4.2.0-stratos/org.wso2.carbon.ui-4.2.0-stratos.pom
[INFO] 
[INFO] --- maven-bundle-plugin:2.3.5:install (default-install) @ org.wso2.carbon.ui ---
[INFO] Local OBR update disabled (enable with -DobrRepository)
[INFO]                                                                         
[INFO] ------------------------------------------------------------------------
[INFO] Building Apache Stratos - Service Stubs 4.1.0-SNAPSHOT
[INFO] ------------------------------------------------------------------------
[INFO] 
[INFO] --- maven-clean-plugin:2.5:clean (default-clean) @ stratos-service-stubs-parent ---
[INFO] Deleting /Users/Admin16/Documents/Stratos_4.1.0/Master-branch/stratos/service-stubs/target
[INFO] 
[INFO] --- maven-enforcer-plugin:1.3.1:enforce (enforce) @ stratos-service-stubs-parent ---
[INFO] 
[INFO] --- incremental-build-plugin:1.3:incremental-build (default) @ stratos-service-stubs-parent ---
[INFO] Verifying module descriptor ...
[INFO] Pom descriptor modification detected.
[INFO] Deleting /Users/Admin16/Documents/Stratos_4.1.0/Master-branch/stratos/service-stubs/target
[INFO] 
[INFO] --- maven-remote-resources-plugin:1.4:process (default) @ stratos-service-stubs-parent ---
[INFO] 
[INFO] --- maven-site-plugin:3.2:attach-descriptor (attach-descriptor) @ stratos-service-stubs-parent ---
[INFO] 
[INFO] --- maven-source-plugin:2.2.1:jar-no-fork (attach-sources) @ stratos-service-stubs-parent ---
[INFO] 
[INFO] --- maven-install-plugin:2.3.1:install (default-install) @ stratos-service-stubs-parent ---
[INFO] Installing /Users/Admin16/Documents/Stratos_4.1.0/Master-branch/stratos/service-stubs/pom.xml to /Users/Admin16/.m2/repository/org/apache/stratos/stratos-service-stubs-parent/4.1.0-SNAPSHOT/stratos-service-stubs-parent-4.1.0-SNAPSHOT.pom
[INFO]                                                                         
[INFO] ------------------------------------------------------------------------
[INFO] Building Apache Stratos - Cloud Controller Service Stub 4.1.0-SNAPSHOT
[INFO] ------------------------------------------------------------------------
[INFO] 
[INFO] --- maven-clean-plugin:2.5:clean (default-clean) @ org.apache.stratos.cloud.controller.service.stub ---
[INFO] Deleting /Users/Admin16/Documents/Stratos_4.1.0/Master-branch/stratos/service-stubs/org.apache.stratos.cloud.controller.service.stub/target
[INFO] 
[INFO] --- maven-enforcer-plugin:1.3.1:enforce (enforce) @ org.apache.stratos.cloud.controller.service.stub ---
[INFO] 
[INFO] --- incremental-build-plugin:1.3:incremental-build (default) @ org.apache.stratos.cloud.controller.service.stub ---
[INFO] Verifying module descriptor ...
[INFO] Pom descriptor modification detected.
[INFO] Deleting /Users/Admin16/Documents/Stratos_4.1.0/Master-branch/stratos/service-stubs/org.apache.stratos.cloud.controller.service.stub/target
[INFO] 
[INFO] --- build-helper-maven-plugin:1.7:add-source (add-source) @ org.apache.stratos.cloud.controller.service.stub ---
[INFO] Source directory: /Users/Admin16/Documents/Stratos_4.1.0/Master-branch/stratos/service-stubs/org.apache.stratos.cloud.controller.service.stub/target/generated-code/src added.
[INFO] 
[INFO] --- maven-remote-resources-plugin:1.4:process (default) @ org.apache.stratos.cloud.controller.service.stub ---
[INFO] 
[INFO] --- maven-resources-plugin:2.6:resources (default-resources) @ org.apache.stratos.cloud.controller.service.stub ---
[INFO] Using 'UTF-8' encoding to copy filtered resources.
[INFO] Copying 1 resource
[INFO] Copying 3 resources
[INFO] 
[INFO] --- maven-antrun-plugin:1.6:run (source-code-generation) @ org.apache.stratos.cloud.controller.service.stub ---
[WARNING] Parameter tasks is deprecated, use target instead
[INFO] Executing tasks

main:
     [java] Retrieving document at 'src/main/resources/CloudControllerService.wsdl'.
     [java] Mar 18, 2015 9:33:15 AM org.apache.axis2.schema.SchemaCompiler compile
     [java] WARNING: No schemaLocation for import of http://exception.controller.cloud.stratos.apache.org/xsd; compilation may fail
     [java] Mar 18, 2015 9:33:15 AM org.apache.axis2.schema.SchemaCompiler compile
     [java] WARNING: No schemaLocation for import of http://domain.controller.cloud.stratos.apache.org/xsd; compilation may fail
     [java] Mar 18, 2015 9:33:15 AM org.apache.axis2.schema.SchemaCompiler compile
     [java] WARNING: No schemaLocation for import of http://kubernetes.domain.controller.cloud.stratos.apache.org/xsd; compilation may fail
     [java] Mar 18, 2015 9:33:15 AM org.apache.axis2.schema.SchemaCompiler compile
     [java] WARNING: No schemaLocation for import of http://topology.domain.messaging.stratos.apache.org/xsd; compilation may fail
     [java] Mar 18, 2015 9:33:17 AM org.apache.axis2.schema.SchemaCompiler compile
     [java] WARNING: No schemaLocation for import of http://common.stratos.apache.org/xsd; compilation may fail
     [java] Mar 18, 2015 9:33:17 AM org.apache.axis2.schema.SchemaCompiler compile
     [java] WARNING: No schemaLocation for import of http://domain.common.stratos.apache.org/xsd; compilation may fail
     [java] Mar 18, 2015 9:33:17 AM org.apache.axis2.schema.SchemaCompiler findClassName
     [java] WARNING: Type {http://www.w3.org/2001/XMLSchema}Enum missing!
     [java] Mar 18, 2015 9:33:17 AM org.apache.axis2.schema.SchemaCompiler findClassName
     [java] WARNING: Type {http://www.w3.org/2001/XMLSchema}RuntimeException missing!
     [java] Mar 18, 2015 9:33:17 AM org.apache.axis2.schema.SchemaCompiler compile
     [java] WARNING: No schemaLocation for import of http://common.stratos.apache.org/xsd; compilation may fail
     [java] Mar 18, 2015 9:33:17 AM org.apache.axis2.schema.SchemaCompiler findClassName
     [java] WARNING: Type {http://www.w3.org/2001/XMLSchema}Enum missing!
     [java] Mar 18, 2015 9:33:17 AM org.apache.axis2.schema.SchemaCompiler compile
     [java] WARNING: No schemaLocation for import of http://common.stratos.apache.org/xsd; compilation may fail
     [java] Mar 18, 2015 9:33:17 AM org.apache.axis2.schema.SchemaCompiler compile
     [java] WARNING: No schemaLocation for import of http://common.stratos.apache.org/xsd; compilation may fail
     [java] Mar 18, 2015 9:33:17 AM org.apache.axis2.schema.SchemaCompiler compile
     [java] WARNING: No schemaLocation for import of http://domain.common.stratos.apache.org/xsd; compilation may fail
[INFO] Executed tasks
[INFO] 
[INFO] --- maven-compiler-plugin:2.5.1:compile (default-compile) @ org.apache.stratos.cloud.controller.service.stub ---
[INFO] Compiling 181 source files to /Users/Admin16/Documents/Stratos_4.1.0/Master-branch/stratos/service-stubs/org.apache.stratos.cloud.controller.service.stub/target/classes
[INFO] 
[INFO] --- maven-resources-plugin:2.6:testResources (default-testResources) @ org.apache.stratos.cloud.controller.service.stub ---
[INFO] Not copying test resources
[INFO] 
[INFO] --- maven-compiler-plugin:2.5.1:testCompile (default-testCompile) @ org.apache.stratos.cloud.controller.service.stub ---
[INFO] Not compiling test sources
[INFO] 
[INFO] --- maven-surefire-plugin:2.12.4:test (default-test) @ org.apache.stratos.cloud.controller.service.stub ---
[INFO] Tests are skipped.
[INFO] 
[INFO] --- maven-bundle-plugin:2.3.5:bundle (default-bundle) @ org.apache.stratos.cloud.controller.service.stub ---
[WARNING] Bundle org.apache.stratos:org.apache.stratos.cloud.controller.service.stub:bundle:4.1.0-SNAPSHOT : Instructions in Export-Package that are never used: org\.apache\.stratos\.cloud\.controller\.stub\.kubernetes\..*|org\.apache\.stratos\.cloud\.controller\.stub\.kubernetes
Classpath: Jar:.,Jar:axis2,Jar:wsdl4j,Jar:commons-logging,Jar:XmlSchema,Jar:XmlSchema,Jar:axiom,Jar:neethi,Jar:neethi,Jar:axiom-api,Jar:geronimo-activation_1.1_spec,Jar:geronimo-javamail_1.4_spec,Jar:jaxen,Jar:geronimo-stax-api_1.0_spec,Jar:axiom-impl,Jar:wsdl4j,Jar:wstx-asl,Jar:stax-api

[WARNING] Bundle org.apache.stratos:org.apache.stratos.cloud.controller.service.stub:bundle:4.1.0-SNAPSHOT : Superfluous export-package instructions: [org.apache.stratos.cloud.controller.stub.kubernetes.*]
[INFO] 
[INFO] --- maven-site-plugin:3.2:attach-descriptor (attach-descriptor) @ org.apache.stratos.cloud.controller.service.stub ---
[INFO] 
[INFO] --- maven-source-plugin:2.2.1:jar-no-fork (attach-sources) @ org.apache.stratos.cloud.controller.service.stub ---
[WARNING] NOT adding sources to artifacts with classifier as Maven only supports one classifier per artifact. Current artifact [org.apache.stratos:org.apache.stratos.cloud.controller.service.stub:bundle:4.1.0-SNAPSHOT] has a [] classifier.
[INFO] 
[INFO] --- maven-install-plugin:2.3.1:install (default-install) @ org.apache.stratos.cloud.controller.service.stub ---
[INFO] Installing /Users/Admin16/Documents/Stratos_4.1.0/Master-branch/stratos/service-stubs/org.apache.stratos.cloud.controller.service.stub/target/org.apache.stratos.cloud.controller.service.stub-4.1.0-SNAPSHOT.jar to /Users/Admin16/.m2/repository/org/apache/stratos/org.apache.stratos.cloud.controller.service.stub/4.1.0-SNAPSHOT/org.apache.stratos.cloud.controller.service.stub-4.1.0-SNAPSHOT.jar
[INFO] Installing /Users/Admin16/Documents/Stratos_4.1.0/Master-branch/stratos/service-stubs/org.apache.stratos.cloud.controller.service.stub/pom.xml to /Users/Admin16/.m2/repository/org/apache/stratos/org.apache.stratos.cloud.controller.service.stub/4.1.0-SNAPSHOT/org.apache.stratos.cloud.controller.service.stub-4.1.0-SNAPSHOT.pom
[INFO] 
[INFO] --- maven-bundle-plugin:2.3.5:install (default-install) @ org.apache.stratos.cloud.controller.service.stub ---
[INFO] Local OBR update disabled (enable with -DobrRepository)
[INFO]                                                                         
[INFO] ------------------------------------------------------------------------
[INFO] Building Apache Stratos - Manager Service Stub 4.1.0-SNAPSHOT
[INFO] ------------------------------------------------------------------------
[INFO] 
[INFO] --- maven-clean-plugin:2.5:clean (default-clean) @ org.apache.stratos.manager.service.stub ---
[INFO] Deleting /Users/Admin16/Documents/Stratos_4.1.0/Master-branch/stratos/service-stubs/org.apache.stratos.manager.service.stub/target
[INFO] 
[INFO] --- maven-enforcer-plugin:1.3.1:enforce (enforce) @ org.apache.stratos.manager.service.stub ---
[INFO] 
[INFO] --- incremental-build-plugin:1.3:incremental-build (default) @ org.apache.stratos.manager.service.stub ---
[INFO] Verifying module descriptor ...
[INFO] Pom descriptor modification detected.
[INFO] Deleting /Users/Admin16/Documents/Stratos_4.1.0/Master-branch/stratos/service-stubs/org.apache.stratos.manager.service.stub/target
[INFO] 
[INFO] --- build-helper-maven-plugin:1.7:add-source (add-source) @ org.apache.stratos.manager.service.stub ---
[INFO] Source directory: /Users/Admin16/Documents/Stratos_4.1.0/Master-branch/stratos/service-stubs/org.apache.stratos.manager.service.stub/target/generated-code/src added.
[INFO] 
[INFO] --- maven-remote-resources-plugin:1.4:process (default) @ org.apache.stratos.manager.service.stub ---
[INFO] 
[INFO] --- maven-resources-plugin:2.6:resources (default-resources) @ org.apache.stratos.manager.service.stub ---
[INFO] Using 'UTF-8' encoding to copy filtered resources.
[INFO] Copying 1 resource
[INFO] Copying 3 resources
[INFO] 
[INFO] --- maven-antrun-plugin:1.6:run (source-code-generation) @ org.apache.stratos.manager.service.stub ---
[WARNING] Parameter tasks is deprecated, use target instead
[INFO] Executing tasks

main:
     [java] Retrieving document at 'src/main/resources/StratosManagerService.wsdl'.
     [java] log4j:WARN No appenders could be found for logger (org.apache.axis2.description.WSDL11ToAllAxisServicesBuilder).
     [java] log4j:WARN Please initialize the log4j system properly.
[INFO] Executed tasks
[INFO] 
[INFO] --- maven-compiler-plugin:2.5.1:compile (default-compile) @ org.apache.stratos.manager.service.stub ---
[INFO] Compiling 40 source files to /Users/Admin16/Documents/Stratos_4.1.0/Master-branch/stratos/service-stubs/org.apache.stratos.manager.service.stub/target/classes
[INFO] 
[INFO] --- maven-resources-plugin:2.6:testResources (default-testResources) @ org.apache.stratos.manager.service.stub ---
[INFO] Not copying test resources
[INFO] 
[INFO] --- maven-compiler-plugin:2.5.1:testCompile (default-testCompile) @ org.apache.stratos.manager.service.stub ---
[INFO] Not compiling test sources
[INFO] 
[INFO] --- maven-surefire-plugin:2.12.4:test (default-test) @ org.apache.stratos.manager.service.stub ---
[INFO] Tests are skipped.
[INFO] 
[INFO] --- maven-bundle-plugin:2.3.5:bundle (default-bundle) @ org.apache.stratos.manager.service.stub ---
[WARNING] Bundle org.apache.stratos:org.apache.stratos.manager.service.stub:bundle:4.1.0-SNAPSHOT : Instructions in Export-Package that are never used: org\.apache\.stratos\.manager\.exception\..*|org\.apache\.stratos\.manager\.exception
                org\.apache\.stratos\.manager\.service\.stub\.domain\..*|org\.apache\.stratos\.manager\.service\.stub\.domain
Classpath: Jar:.,Jar:axis2,Jar:axis2-client,Jar:XmlSchema,Jar:geronimo-stax-api_1.0_spec,Jar:neethi,Jar:axis2-json,Jar:woden,Jar:org.wso2.securevault,Jar:axiom-api,Jar:geronimo-activation_1.1_spec,Jar:geronimo-javamail_1.4_spec,Jar:jaxen,Jar:geronimo-stax-api_1.0_spec,Jar:axiom-impl,Jar:wstx-asl,Jar:log4j,Jar:jline,Jar:junit,Jar:commons-cli,Jar:commons-lang,Jar:commons-io,Jar:commons-codec,Jar:httpcore,Jar:commons-fileupload,Jar:commons-codec,Jar:commons-logging,Jar:commons-httpclient,Jar:not-yet-commons-ssl,Jar:wsdl4j

[WARNING] Bundle org.apache.stratos:org.apache.stratos.manager.service.stub:bundle:4.1.0-SNAPSHOT : Superfluous export-package instructions: [org.apache.stratos.manager.service.stub.domain.*, org.apache.stratos.manager.exception.*]
[INFO] 
[INFO] --- maven-site-plugin:3.2:attach-descriptor (attach-descriptor) @ org.apache.stratos.manager.service.stub ---
[INFO] 
[INFO] --- maven-source-plugin:2.2.1:jar-no-fork (attach-sources) @ org.apache.stratos.manager.service.stub ---
[WARNING] NOT adding sources to artifacts with classifier as Maven only supports one classifier per artifact. Current artifact [org.apache.stratos:org.apache.stratos.manager.service.stub:bundle:4.1.0-SNAPSHOT] has a [] classifier.
[INFO] 
[INFO] --- maven-install-plugin:2.3.1:install (default-install) @ org.apache.stratos.manager.service.stub ---
[INFO] Installing /Users/Admin16/Documents/Stratos_4.1.0/Master-branch/stratos/service-stubs/org.apache.stratos.manager.service.stub/target/org.apache.stratos.manager.service.stub-4.1.0-SNAPSHOT.jar to /Users/Admin16/.m2/repository/org/apache/stratos/org.apache.stratos.manager.service.stub/4.1.0-SNAPSHOT/org.apache.stratos.manager.service.stub-4.1.0-SNAPSHOT.jar
[INFO] Installing /Users/Admin16/Documents/Stratos_4.1.0/Master-branch/stratos/service-stubs/org.apache.stratos.manager.service.stub/pom.xml to /Users/Admin16/.m2/repository/org/apache/stratos/org.apache.stratos.manager.service.stub/4.1.0-SNAPSHOT/org.apache.stratos.manager.service.stub-4.1.0-SNAPSHOT.pom
[INFO] 
[INFO] --- maven-bundle-plugin:2.3.5:install (default-install) @ org.apache.stratos.manager.service.stub ---
[INFO] Local OBR update disabled (enable with -DobrRepository)
[INFO]                                                                         
[INFO] ------------------------------------------------------------------------
[INFO] Building Apache Stratos - Common Stubs 4.1.0-SNAPSHOT
[INFO] ------------------------------------------------------------------------
[INFO] 
[INFO] --- maven-clean-plugin:2.5:clean (default-clean) @ org.apache.stratos.common.stub ---
[INFO] Deleting /Users/Admin16/Documents/Stratos_4.1.0/Master-branch/stratos/service-stubs/org.apache.stratos.common.stub/target
[INFO] 
[INFO] --- maven-enforcer-plugin:1.3.1:enforce (enforce) @ org.apache.stratos.common.stub ---
[INFO] 
[INFO] --- incremental-build-plugin:1.3:incremental-build (default) @ org.apache.stratos.common.stub ---
[INFO] Verifying module descriptor ...
[INFO] Pom descriptor modification detected.
[INFO] Deleting /Users/Admin16/Documents/Stratos_4.1.0/Master-branch/stratos/service-stubs/org.apache.stratos.common.stub/target
[INFO] 
[INFO] --- build-helper-maven-plugin:1.7:add-source (add-source) @ org.apache.stratos.common.stub ---
[INFO] Source directory: /Users/Admin16/Documents/Stratos_4.1.0/Master-branch/stratos/service-stubs/org.apache.stratos.common.stub/target/generated-code/src added.
[INFO] 
[INFO] --- maven-remote-resources-plugin:1.4:process (default) @ org.apache.stratos.common.stub ---
[INFO] 
[INFO] --- maven-resources-plugin:2.6:resources (default-resources) @ org.apache.stratos.common.stub ---
[INFO] Using 'UTF-8' encoding to copy filtered resources.
[INFO] Copying 1 resource
[INFO] Copying 3 resources
[INFO] 
[INFO] --- maven-antrun-plugin:1.6:run (source-code-generation) @ org.apache.stratos.common.stub ---
[WARNING] Parameter tasks is deprecated, use target instead
[INFO] Executing tasks

main:
     [java] Retrieving document at 'src/main/resources/PackageInfoServce.wsdl'.
     [java] Mar 18, 2015 9:33:30 AM org.apache.axis2.schema.SchemaCompiler compile
     [java] WARNING: No schemaLocation for import of http://packages.common.stratos.apache.org/xsd; compilation may fail
[INFO] Executed tasks
[INFO] 
[INFO] --- maven-compiler-plugin:2.5.1:compile (default-compile) @ org.apache.stratos.common.stub ---
[INFO] Compiling 10 source files to /Users/Admin16/Documents/Stratos_4.1.0/Master-branch/stratos/service-stubs/org.apache.stratos.common.stub/target/classes
[INFO] 
[INFO] --- maven-resources-plugin:2.6:testResources (default-testResources) @ org.apache.stratos.common.stub ---
[INFO] Not copying test resources
[INFO] 
[INFO] --- maven-compiler-plugin:2.5.1:testCompile (default-testCompile) @ org.apache.stratos.common.stub ---
[INFO] Not compiling test sources
[INFO] 
[INFO] --- maven-surefire-plugin:2.12.4:test (default-test) @ org.apache.stratos.common.stub ---
[INFO] Tests are skipped.
[INFO] 
[INFO] --- maven-bundle-plugin:2.3.5:bundle (default-bundle) @ org.apache.stratos.common.stub ---
[WARNING] Bundle org.apache.stratos:org.apache.stratos.common.stub:bundle:4.1.0-SNAPSHOT : Did not find matching referal for !org.apache.stratos.common.packages.stub.*
[INFO] 
[INFO] --- maven-site-plugin:3.2:attach-descriptor (attach-descriptor) @ org.apache.stratos.common.stub ---
[INFO] 
[INFO] --- maven-source-plugin:2.2.1:jar-no-fork (attach-sources) @ org.apache.stratos.common.stub ---
[WARNING] NOT adding sources to artifacts with classifier as Maven only supports one classifier per artifact. Current artifact [org.apache.stratos:org.apache.stratos.common.stub:bundle:4.1.0-SNAPSHOT] has a [] classifier.
[INFO] 
[INFO] --- maven-install-plugin:2.3.1:install (default-install) @ org.apache.stratos.common.stub ---
[INFO] Installing /Users/Admin16/Documents/Stratos_4.1.0/Master-branch/stratos/service-stubs/org.apache.stratos.common.stub/target/org.apache.stratos.common.stub-4.1.0-SNAPSHOT.jar to /Users/Admin16/.m2/repository/org/apache/stratos/org.apache.stratos.common.stub/4.1.0-SNAPSHOT/org.apache.stratos.common.stub-4.1.0-SNAPSHOT.jar
[INFO] Installing /Users/Admin16/Documents/Stratos_4.1.0/Master-branch/stratos/service-stubs/org.apache.stratos.common.stub/pom.xml to /Users/Admin16/.m2/repository/org/apache/stratos/org.apache.stratos.common.stub/4.1.0-SNAPSHOT/org.apache.stratos.common.stub-4.1.0-SNAPSHOT.pom
[INFO] 
[INFO] --- maven-bundle-plugin:2.3.5:install (default-install) @ org.apache.stratos.common.stub ---
[INFO] Local OBR update disabled (enable with -DobrRepository)
[INFO]                                                                         
[INFO] ------------------------------------------------------------------------
[INFO] Building Apache Stratos - Autoscaler Service Stub 4.1.0-SNAPSHOT
[INFO] ------------------------------------------------------------------------
[INFO] 
[INFO] --- maven-clean-plugin:2.5:clean (default-clean) @ org.apache.stratos.autoscaler.service.stub ---
[INFO] Deleting /Users/Admin16/Documents/Stratos_4.1.0/Master-branch/stratos/service-stubs/org.apache.stratos.autoscaler.service.stub/target
[INFO] 
[INFO] --- maven-enforcer-plugin:1.3.1:enforce (enforce) @ org.apache.stratos.autoscaler.service.stub ---
[INFO] 
[INFO] --- incremental-build-plugin:1.3:incremental-build (default) @ org.apache.stratos.autoscaler.service.stub ---
[INFO] Verifying module descriptor ...
[INFO] Pom descriptor modification detected.
[INFO] Deleting /Users/Admin16/Documents/Stratos_4.1.0/Master-branch/stratos/service-stubs/org.apache.stratos.autoscaler.service.stub/target
[INFO] 
[INFO] --- build-helper-maven-plugin:1.7:add-source (add-source) @ org.apache.stratos.autoscaler.service.stub ---
[INFO] Source directory: /Users/Admin16/Documents/Stratos_4.1.0/Master-branch/stratos/service-stubs/org.apache.stratos.autoscaler.service.stub/target/generated-code/src added.
[INFO] 
[INFO] --- maven-remote-resources-plugin:1.4:process (default) @ org.apache.stratos.autoscaler.service.stub ---
[INFO] 
[INFO] --- maven-resources-plugin:2.6:resources (default-resources) @ org.apache.stratos.autoscaler.service.stub ---
[INFO] Using 'UTF-8' encoding to copy filtered resources.
[INFO] Copying 1 resource
[INFO] Copying 3 resources
[INFO] 
[INFO] --- maven-antrun-plugin:1.6:run (source-code-generation) @ org.apache.stratos.autoscaler.service.stub ---
[WARNING] Parameter tasks is deprecated, use target instead
[INFO] Executing tasks

main:
     [java] Retrieving document at 'src/main/resources/AutoscalerService.wsdl'.
     [java] Mar 18, 2015 9:33:34 AM org.apache.axis2.schema.SchemaCompiler compile
     [java] WARNING: No schemaLocation for import of http://io.java/xsd; compilation may fail
     [java] Mar 18, 2015 9:33:34 AM org.apache.axis2.schema.SchemaCompiler compile
     [java] WARNING: No schemaLocation for import of http://common.stratos.apache.org/xsd; compilation may fail
     [java] Mar 18, 2015 9:33:34 AM org.apache.axis2.schema.SchemaCompiler compile
     [java] WARNING: No schemaLocation for import of http://deployment.policy.pojo.autoscaler.stratos.apache.org/xsd; compilation may fail
     [java] Mar 18, 2015 9:33:34 AM org.apache.axis2.schema.SchemaCompiler compile
     [java] WARNING: No schemaLocation for import of http://pojo.applications.autoscaler.stratos.apache.org/xsd; compilation may fail
     [java] Mar 18, 2015 9:33:34 AM org.apache.axis2.schema.SchemaCompiler compile
     [java] WARNING: No schemaLocation for import of http://application.exception.autoscaler.stratos.apache.org/xsd; compilation may fail
     [java] Mar 18, 2015 9:33:34 AM org.apache.axis2.schema.SchemaCompiler compile
     [java] WARNING: No schemaLocation for import of http://pojo.autoscaler.stratos.apache.org/xsd; compilation may fail
     [java] Mar 18, 2015 9:33:34 AM org.apache.axis2.schema.SchemaCompiler compile
     [java] WARNING: No schemaLocation for import of http://autoscale.policy.pojo.autoscaler.stratos.apache.org/xsd; compilation may fail
     [java] Mar 18, 2015 9:33:34 AM org.apache.axis2.schema.SchemaCompiler compile
     [java] WARNING: No schemaLocation for import of http://rmi.java/xsd; compilation may fail
     [java] Mar 18, 2015 9:33:34 AM org.apache.axis2.schema.SchemaCompiler compile
     [java] WARNING: No schemaLocation for import of http://policy.exception.autoscaler.stratos.apache.org/xsd; compilation may fail
     [java] Mar 18, 2015 9:33:34 AM org.apache.axis2.schema.SchemaCompiler compile
     [java] WARNING: No schemaLocation for import of http://exception.autoscaler.stratos.apache.org/xsd; compilation may fail
     [java] Mar 18, 2015 9:33:34 AM org.apache.axis2.schema.SchemaCompiler compile
     [java] WARNING: No schemaLocation for import of http://common.stratos.apache.org/xsd; compilation may fail
     [java] Mar 18, 2015 9:33:34 AM org.apache.axis2.schema.SchemaCompiler compile
     [java] WARNING: No schemaLocation for import of http://common.stratos.apache.org/xsd; compilation may fail
     [java] Mar 18, 2015 9:33:35 AM org.apache.axis2.schema.SchemaCompiler findClassName
     [java] WARNING: Type {http://www.w3.org/2001/XMLSchema}RuntimeException missing!
     [java] Mar 18, 2015 9:33:35 AM org.apache.axis2.schema.SchemaCompiler compile
     [java] WARNING: No schemaLocation for import of http://common.stratos.apache.org/xsd; compilation may fail
[INFO] Executed tasks
[INFO] 
[INFO] --- maven-compiler-plugin:2.5.1:compile (default-compile) @ org.apache.stratos.autoscaler.service.stub ---
[INFO] Compiling 86 source files to /Users/Admin16/Documents/Stratos_4.1.0/Master-branch/stratos/service-stubs/org.apache.stratos.autoscaler.service.stub/target/classes
[INFO] 
[INFO] --- maven-resources-plugin:2.6:testResources (default-testResources) @ org.apache.stratos.autoscaler.service.stub ---
[INFO] Not copying test resources
[INFO] 
[INFO] --- maven-compiler-plugin:2.5.1:testCompile (default-testCompile) @ org.apache.stratos.autoscaler.service.stub ---
[INFO] Not compiling test sources
[INFO] 
[INFO] --- maven-surefire-plugin:2.12.4:test (default-test) @ org.apache.stratos.autoscaler.service.stub ---
[INFO] Tests are skipped.
[INFO] 
[INFO] --- maven-bundle-plugin:2.3.5:bundle (default-bundle) @ org.apache.stratos.autoscaler.service.stub ---
[WARNING] Bundle org.apache.stratos:org.apache.stratos.autoscaler.service.stub:bundle:4.1.0-SNAPSHOT : Instructions in Export-Package that are never used: org\.apache\.stratos\.autoscaler\.stub\.deployment\.partition\..*|org\.apache\.stratos\.autoscaler\.stub\.deployment\.partition
                org\.apache\.stratos\.autoscaler\.stub\.api\..*|org\.apache\.stratos\.autoscaler\.stub\.api
Classpath: Jar:.,Jar:axis2,Jar:wsdl4j,Jar:commons-logging,Jar:XmlSchema,Jar:XmlSchema,Jar:axiom,Jar:neethi,Jar:neethi,Jar:axiom-api,Jar:geronimo-activation_1.1_spec,Jar:geronimo-javamail_1.4_spec,Jar:jaxen,Jar:geronimo-stax-api_1.0_spec,Jar:axiom-impl,Jar:wsdl4j,Jar:wstx-asl,Jar:stax-api

[WARNING] Bundle org.apache.stratos:org.apache.stratos.autoscaler.service.stub:bundle:4.1.0-SNAPSHOT : Superfluous export-package instructions: [org.apache.stratos.autoscaler.stub.api.*, org.apache.stratos.autoscaler.stub.deployment.partition.*]
[INFO] 
[INFO] --- maven-site-plugin:3.2:attach-descriptor (attach-descriptor) @ org.apache.stratos.autoscaler.service.stub ---
[INFO] 
[INFO] --- maven-source-plugin:2.2.1:jar-no-fork (attach-sources) @ org.apache.stratos.autoscaler.service.stub ---
[WARNING] NOT adding sources to artifacts with classifier as Maven only supports one classifier per artifact. Current artifact [org.apache.stratos:org.apache.stratos.autoscaler.service.stub:bundle:4.1.0-SNAPSHOT] has a [] classifier.
[INFO] 
[INFO] --- maven-install-plugin:2.3.1:install (default-install) @ org.apache.stratos.autoscaler.service.stub ---
[INFO] Installing /Users/Admin16/Documents/Stratos_4.1.0/Master-branch/stratos/service-stubs/org.apache.stratos.autoscaler.service.stub/target/org.apache.stratos.autoscaler.service.stub-4.1.0-SNAPSHOT.jar to /Users/Admin16/.m2/repository/org/apache/stratos/org.apache.stratos.autoscaler.service.stub/4.1.0-SNAPSHOT/org.apache.stratos.autoscaler.service.stub-4.1.0-SNAPSHOT.jar
[INFO] Installing /Users/Admin16/Documents/Stratos_4.1.0/Master-branch/stratos/service-stubs/org.apache.stratos.autoscaler.service.stub/pom.xml to /Users/Admin16/.m2/repository/org/apache/stratos/org.apache.stratos.autoscaler.service.stub/4.1.0-SNAPSHOT/org.apache.stratos.autoscaler.service.stub-4.1.0-SNAPSHOT.pom
[INFO] 
[INFO] --- maven-bundle-plugin:2.3.5:install (default-install) @ org.apache.stratos.autoscaler.service.stub ---
[INFO] Local OBR update disabled (enable with -DobrRepository)
[INFO]                                                                         
[INFO] ------------------------------------------------------------------------
[INFO] Building Apache Stratos - Components 4.1.0-SNAPSHOT
[INFO] ------------------------------------------------------------------------
[INFO] 
[INFO] --- maven-clean-plugin:2.5:clean (default-clean) @ stratos-components-parent ---
[INFO] Deleting /Users/Admin16/Documents/Stratos_4.1.0/Master-branch/stratos/components/target
[INFO] 
[INFO] --- maven-enforcer-plugin:1.3.1:enforce (enforce) @ stratos-components-parent ---
[INFO] 
[INFO] --- incremental-build-plugin:1.3:incremental-build (default) @ stratos-components-parent ---
[INFO] Verifying module descriptor ...
[INFO] Pom descriptor modification detected.
[INFO] Deleting /Users/Admin16/Documents/Stratos_4.1.0/Master-branch/stratos/components/target
[INFO] 
[INFO] --- maven-remote-resources-plugin:1.4:process (default) @ stratos-components-parent ---
[INFO] 
[INFO] --- maven-site-plugin:3.2:attach-descriptor (attach-descriptor) @ stratos-components-parent ---
[INFO] 
[INFO] --- maven-source-plugin:2.2.1:jar-no-fork (attach-sources) @ stratos-components-parent ---
[INFO] 
[INFO] --- maven-install-plugin:2.3.1:install (default-install) @ stratos-components-parent ---
[INFO] Installing /Users/Admin16/Documents/Stratos_4.1.0/Master-branch/stratos/components/pom.xml to /Users/Admin16/.m2/repository/org/apache/stratos/stratos-components-parent/4.1.0-SNAPSHOT/stratos-components-parent-4.1.0-SNAPSHOT.pom
[INFO]                                                                         
[INFO] ------------------------------------------------------------------------
[INFO] Building Apache Stratos - Common 4.1.0-SNAPSHOT
[INFO] ------------------------------------------------------------------------
[INFO] 
[INFO] --- maven-clean-plugin:2.5:clean (default-clean) @ org.apache.stratos.common ---
[INFO] Deleting /Users/Admin16/Documents/Stratos_4.1.0/Master-branch/stratos/components/org.apache.stratos.common/target
[INFO] 
[INFO] --- maven-enforcer-plugin:1.3.1:enforce (enforce) @ org.apache.stratos.common ---
[INFO] 
[INFO] --- incremental-build-plugin:1.3:incremental-build (default) @ org.apache.stratos.common ---
[INFO] Verifying module descriptor ...
[INFO] Pom descriptor modification detected.
[INFO] Deleting /Users/Admin16/Documents/Stratos_4.1.0/Master-branch/stratos/components/org.apache.stratos.common/target
[INFO] 
[INFO] --- maven-remote-resources-plugin:1.4:process (default) @ org.apache.stratos.common ---
[INFO] 
[INFO] --- maven-resources-plugin:2.6:resources (default-resources) @ org.apache.stratos.common ---
[INFO] Using 'UTF-8' encoding to copy filtered resources.
[INFO] Copying 1 resource
[INFO] Copying 3 resources
[INFO] 
[INFO] --- maven-compiler-plugin:2.5.1:compile (default-compile) @ org.apache.stratos.common ---
[INFO] Compiling 113 source files to /Users/Admin16/Documents/Stratos_4.1.0/Master-branch/stratos/components/org.apache.stratos.common/target/classes
[INFO] -------------------------------------------------------------
[ERROR] COMPILATION ERROR : 
[INFO] -------------------------------------------------------------
[ERROR] /Users/Admin16/Documents/Stratos_4.1.0/Master-branch/stratos/components/org.apache.stratos.common/src/main/java/org/apache/stratos/common/beans/UserInfoBean.java:[35,11] invalid method declaration; return type required
[ERROR] /Users/Admin16/Documents/Stratos_4.1.0/Master-branch/stratos/components/org.apache.stratos.common/src/main/java/org/apache/stratos/common/beans/UserInfoBean.java:[37,11] invalid method declaration; return type required
[INFO] 2 errors 
[INFO] -------------------------------------------------------------
[INFO] ------------------------------------------------------------------------
[INFO] Reactor Summary:
[INFO] 
[INFO] jclouds vcloud api ................................ SUCCESS [ 21.024 s]
[INFO] jclouds openstack-neutron api ..................... SUCCESS [  5.539 s]
[INFO] jclouds Google Compute Engine provider ............ SUCCESS [  2.871 s]
[INFO] jclouds Amazon EC2 provider ....................... SUCCESS [  1.665 s]
[INFO] Apache Stratos .................................... SUCCESS [  1.489 s]
[INFO] Apache Stratos - Dependent Projects ............... SUCCESS [  0.039 s]
[INFO] WSO2 Carbon - UI .................................. SUCCESS [  8.772 s]
[INFO] Apache Stratos - Service Stubs .................... SUCCESS [  0.044 s]
[INFO] Apache Stratos - Cloud Controller Service Stub .... SUCCESS [  9.469 s]
[INFO] Apache Stratos - Manager Service Stub ............. SUCCESS [  5.947 s]
[INFO] Apache Stratos - Common Stubs ..................... SUCCESS [  3.616 s]
[INFO] Apache Stratos - Autoscaler Service Stub .......... SUCCESS [  5.572 s]
[INFO] Apache Stratos - Components ....................... SUCCESS [  0.051 s]
[INFO] Apache Stratos - Common ........................... FAILURE [  2.292 s]
[INFO] Apache Stratos - Messaging Component .............. SKIPPED
[INFO] Apache Stratos - Metadata Client .................. SKIPPED
[INFO] Apache Stratos - Autoscaler ....................... SKIPPED
[INFO] Apache Stratos - Kubernetes API Java Client ....... SKIPPED
[INFO] Apache Stratos - Mock IaaS ........................ SKIPPED
[INFO] Apache Stratos - Mock IaaS API Client ............. SKIPPED
[INFO] Apache Stratos - Cloud Controller ................. SKIPPED
[INFO] Apache Stratos - Manager .......................... SKIPPED
[INFO] Apache Stratos - Deployment ....................... SKIPPED
[INFO] Apache Stratos - CLI .............................. SKIPPED
[INFO] Apache Stratos - Python Cartridge Agent ........... SKIPPED
[INFO] Apache Stratos - Cartridge Agent .................. SKIPPED
[INFO] Apache Stratos - Load Balancer - Common ........... SKIPPED
[INFO] Apache Stratos - Load Balancer .................... SKIPPED
[INFO] Apache Stratos - Load Balancer - Extension API .... SKIPPED
[INFO] Apache Stratos - TenantActivity ................... SKIPPED
[INFO] Apache Stratos - Tenant Activity - User Interface . SKIPPED
[INFO] Apache Stratos - Account Management ............... SKIPPED
[INFO] Apache Stratos - Account Managment - User Interface  SKIPPED
[INFO] Apache Stratos - Email Sender Component ........... SKIPPED
[INFO] Apache Stratos - Validate Domains ................. SKIPPED
[INFO] Apache Stratos - Validate Domains - User Interface  SKIPPED
[INFO] Apache Stratos - SSO redirector UI component ...... SKIPPED
[INFO] Apache Stratos - Keystore Generation and Management  SKIPPED
[INFO] Apache Stratos - Activation ....................... SKIPPED
[INFO] Apache Stratos - Logging View UI .................. SKIPPED
[INFO] Apache Stratos - RESTful admin service module ..... SKIPPED
[INFO] Apache Stratos - Cloud Manager UI styles .......... SKIPPED
[INFO] Apache Stratos - Custom Handlers .................. SKIPPED
[INFO] Apache Stratos - Metadata Service ................. SKIPPED
[INFO] Apache Stratos - Mock IaaS API .................... SKIPPED
[INFO] Apache Stratos - Extensions ....................... SKIPPED
[INFO] Apache Stratos - CEP Extensions ................... SKIPPED
[INFO] Apache Stratos - Load Balancer Extensions ......... SKIPPED
[INFO] Apache Stratos - HAProxy Extension ................ SKIPPED
[INFO] Apache Stratos - Features ......................... SKIPPED
[INFO] Apache Stratos - Load Balancer Features ........... SKIPPED
[INFO] Apache Stratos - Load Balancer - Management Feature  SKIPPED
[INFO] Apache Stratos - Load Balancer - Common Feature ... SKIPPED
[INFO] Apache Stratos - Autoscaler Features .............. SKIPPED
[INFO] Apache Stratos - Autoscaler Feature ............... SKIPPED
[INFO] Apache Stratos - Mock IaaS Features ............... SKIPPED
[INFO] Apache Stratos - Mock IaaS API Feature ............ SKIPPED
[INFO] Apache Stratos - Cloud Controller Features ........ SKIPPED
[INFO] Apache Stratos - Cloud Controller Feature ......... SKIPPED
[INFO] Apache Stratos - Manager Features Aggregator Module  SKIPPED
[INFO] Apache Stratos - Stratos Management Aggregator Module  SKIPPED
[INFO] Apache Stratos - Management Core Feature .......... SKIPPED
[INFO] Apache Stratos - Management Composite Feature ..... SKIPPED
[INFO] Apache Stratos - GApp Feature Aggregator Module ... SKIPPED
[INFO] Apache Stratos - GApp Server Feature .............. SKIPPED
[INFO] Apache Stratos - GApp UI Feature .................. SKIPPED
[INFO] Apache Stratos - GApp Composite Feature ........... SKIPPED
[INFO] Apache Stratos - Deployment Features .............. SKIPPED
[INFO] Apache Stratos - Status Monitor Aggregator Module . SKIPPED
[INFO] Apache Stratos - Status Monitor Server Feature .... SKIPPED
[INFO] Apache Stratos - Status Monitor UI Feature ........ SKIPPED
[INFO] Apache Stratos - Status Monitor Agent Feature ..... SKIPPED
[INFO] Apache Stratos - Status Monitor Feature ........... SKIPPED
[INFO] Apache Stratos - Tenant activity Feature Aggregator Module  SKIPPED
[INFO] Apache Stratos - Tenant Activity UI Feature ....... SKIPPED
[INFO] Apache Stratos - Tenant activity Server Feature ... SKIPPED
[INFO] Apache Stratos - Logging Management Aggregator Module  SKIPPED
[INFO] Apache Stratos - Logging Management Feature ....... SKIPPED
[INFO] Apache Stratos - RESTful admin services feature ... SKIPPED
[INFO] Apache Stratos - stratos manager admin theme ...... SKIPPED
[INFO] Apache Stratos - Meta Data Service feature ........ SKIPPED
[INFO] Apache Stratos - Metadata client Feature .......... SKIPPED
[INFO] Apache Stratos - Messaging Module ................. SKIPPED
[INFO] Apache Stratos - Messaging Feature ................ SKIPPED
[INFO] Apache Stratos - Common Features .................. SKIPPED
[INFO] Apache Stratos - Common Server Feature ............ SKIPPED
[INFO] Apache Stratos - Common UI Feature ................ SKIPPED
[INFO] Apache Stratos - Common Composite Feature ......... SKIPPED
[INFO] Apache Stratos - Custom Handlers Feature .......... SKIPPED
[INFO] Apache Stratos - Products ......................... SKIPPED
[INFO] Apache Stratos - Python Cartridge Agent Product ... SKIPPED
[INFO] Apache Stratos - Cartridge Agent Product .......... SKIPPED
[INFO] Apache Stratos - Cartridge Agent Distribution ..... SKIPPED
[INFO] Apache Stratos - CLI Product ...................... SKIPPED
[INFO] Apache Stratos - CLI .............................. SKIPPED
[INFO] Apache Stratos - Load Balancer Product ............ SKIPPED
[INFO] Apache Stratos - Load Balancer - P2 Profile Generation  SKIPPED
[INFO] Apache Stratos - Load Balancer - Distribution ..... SKIPPED
[INFO] Apache Stratos - Product .......................... SKIPPED
[INFO] Apache Stratos - Profile Generation ............... SKIPPED
[INFO] Apache Stratos - Distribution ..................... SKIPPED
[INFO] Apache Stratos - Integration Tests ................ SKIPPED
[INFO] Apache Stratos - Tools ............................ SKIPPED
[INFO] ------------------------------------------------------------------------
[INFO] BUILD FAILURE
[INFO] ------------------------------------------------------------------------
[INFO] Total time: 01:11 min
[INFO] Finished at: 2015-03-18T09:33:40+05:30
[INFO] Final Memory: 81M/2102M
[INFO] ------------------------------------------------------------------------
[ERROR] Failed to execute goal org.apache.maven.plugins:maven-compiler-plugin:2.5.1:compile (default-compile) on project org.apache.stratos.common: Compilation failure: Compilation failure:
[ERROR] /Users/Admin16/Documents/Stratos_4.1.0/Master-branch/stratos/components/org.apache.stratos.common/src/main/java/org/apache/stratos/common/beans/UserInfoBean.java:[35,11] invalid method declaration; return type required
[ERROR] /Users/Admin16/Documents/Stratos_4.1.0/Master-branch/stratos/components/org.apache.stratos.common/src/main/java/org/apache/stratos/common/beans/UserInfoBean.java:[37,11] invalid method declaration; return type required
[ERROR] -> [Help 1]
[ERROR] 
[ERROR] To see the full stack trace of the errors, re-run Maven with the -e switch.
[ERROR] Re-run Maven using the -X switch to enable full debug logging.
[ERROR] 
[ERROR] For more information about the errors and possible solutions, please read the following articles:
[ERROR] [Help 1] http://cwiki.apache.org/confluence/display/MAVEN/MojoFailureException
[ERROR] 
[ERROR] After correcting the problems, you can resume the build with the command
[ERROR]   mvn <goals> -rf :org.apache.stratos.common



Regards,
Mariangela


--

Mariangela Hills
Senior Technical Writer
WSO2, Inc.
lean.enterprise.middleware.