stratos-dev mailing list archives

Site index · List index
Message view « Date » · « Thread »
Top « Date » · « Thread »
From Apache Jenkins Server <jenk...@builds.apache.org>
Subject Build failed in Jenkins: Stratos-Master-Nightly-Build » Apache Stratos - CLI #187
Date Thu, 10 Jul 2014 02:32:45 GMT
See <https://builds.apache.org/job/Stratos-Master-Nightly-Build/org.apache.stratos$org.apache.stratos.cli/187/>

------------------------------------------
[...truncated 8028 lines...]
searchwindowsize: None
delaybeforesend: 0.05
delayafterclose: 0.1
delayafterterminate: 0.1

======================================================================
ERROR: test_interactive_mode_long_username_parameter_provided (__main__.TestInteractive)
----------------------------------------------------------------------
Traceback (most recent call last):
  File "test_interactive.py", line 99, in test_interactive_mode_long_username_parameter_provided
    child.expect   ('Successfully Authenticated.')
  File "<https://builds.apache.org/job/Stratos-Master-Nightly-Build/org.apache.stratos$org.apache.stratos.cli/ws/target/pexpect-3.2/pexpect/__init__.py",>
line 1418, in expect
    timeout, searchwindowsize)
  File "<https://builds.apache.org/job/Stratos-Master-Nightly-Build/org.apache.stratos$org.apache.stratos.cli/ws/target/pexpect-3.2/pexpect/__init__.py",>
line 1433, in expect_list
    timeout, searchwindowsize)
  File "<https://builds.apache.org/job/Stratos-Master-Nightly-Build/org.apache.stratos$org.apache.stratos.cli/ws/target/pexpect-3.2/pexpect/__init__.py",>
line 1535, in expect_loop
    raise TIMEOUT(str(err) + '\n' + str(self))
TIMEOUT: Timeout exceeded.
<pexpect.spawn object at 0x7fe95e510bd0>
version: 3.2
command: /home/hudson/tools/java/latest1.6/bin/java
args: ['/home/hudson/tools/java/latest1.6/bin/java', '-jar', '<https://builds.apache.org/job/Stratos-Master-Nightly-Build/org.apache.stratos$org.apache.stratos.cli/ws/target/org.apache.stratos.cli-4.0.0-SNAPSHOT.jar',>
'--username', 'xxx']
searcher: <pexpect.searcher_re object at 0x7fe95e510c90>
buffer (last 100 chars): '***\r\n'
before (last 100 chars): '***\r\n'
after: <class 'pexpect.TIMEOUT'>
match: None
match_index: None
exitstatus: None
flag_eof: False
pid: 8706
child_fd: 4
closed: False
timeout: 10
delimiter: <class 'pexpect.EOF'>
logfile: None
logfile_read: None
logfile_send: None
maxread: 2000
ignorecase: False
searchwindowsize: None
delaybeforesend: 0.05
delayafterclose: 0.1
delayafterterminate: 0.1

======================================================================
ERROR: test_interactive_mode_short_username_parameter_provided (__main__.TestInteractive)
----------------------------------------------------------------------
Traceback (most recent call last):
  File "test_interactive.py", line 87, in test_interactive_mode_short_username_parameter_provided
    child.expect   ('Successfully Authenticated.')
  File "<https://builds.apache.org/job/Stratos-Master-Nightly-Build/org.apache.stratos$org.apache.stratos.cli/ws/target/pexpect-3.2/pexpect/__init__.py",>
line 1418, in expect
    timeout, searchwindowsize)
  File "<https://builds.apache.org/job/Stratos-Master-Nightly-Build/org.apache.stratos$org.apache.stratos.cli/ws/target/pexpect-3.2/pexpect/__init__.py",>
line 1433, in expect_list
    timeout, searchwindowsize)
  File "<https://builds.apache.org/job/Stratos-Master-Nightly-Build/org.apache.stratos$org.apache.stratos.cli/ws/target/pexpect-3.2/pexpect/__init__.py",>
line 1535, in expect_loop
    raise TIMEOUT(str(err) + '\n' + str(self))
TIMEOUT: Timeout exceeded.
<pexpect.spawn object at 0x7fe95e510c10>
version: 3.2
command: /home/hudson/tools/java/latest1.6/bin/java
args: ['/home/hudson/tools/java/latest1.6/bin/java', '-jar', '<https://builds.apache.org/job/Stratos-Master-Nightly-Build/org.apache.stratos$org.apache.stratos.cli/ws/target/org.apache.stratos.cli-4.0.0-SNAPSHOT.jar',>
'-u', 'xxx']
searcher: <pexpect.searcher_re object at 0x7fe95e510c90>
buffer (last 100 chars): '***\r\n'
before (last 100 chars): '***\r\n'
after: <class 'pexpect.TIMEOUT'>
match: None
match_index: None
exitstatus: None
flag_eof: False
pid: 8800
child_fd: 4
closed: False
timeout: 10
delimiter: <class 'pexpect.EOF'>
logfile: None
logfile_read: None
logfile_send: None
maxread: 2000
ignorecase: False
searchwindowsize: None
delaybeforesend: 0.05
delayafterclose: 0.1
delayafterterminate: 0.1

======================================================================
ERROR: test_interactive_mode_standard_password_parameter_provided (__main__.TestInteractive)
----------------------------------------------------------------------
Traceback (most recent call last):
  File "test_interactive.py", line 124, in test_interactive_mode_standard_password_parameter_provided
    child.expect   ('Successfully Authenticated.')
  File "<https://builds.apache.org/job/Stratos-Master-Nightly-Build/org.apache.stratos$org.apache.stratos.cli/ws/target/pexpect-3.2/pexpect/__init__.py",>
line 1418, in expect
    timeout, searchwindowsize)
  File "<https://builds.apache.org/job/Stratos-Master-Nightly-Build/org.apache.stratos$org.apache.stratos.cli/ws/target/pexpect-3.2/pexpect/__init__.py",>
line 1433, in expect_list
    timeout, searchwindowsize)
  File "<https://builds.apache.org/job/Stratos-Master-Nightly-Build/org.apache.stratos$org.apache.stratos.cli/ws/target/pexpect-3.2/pexpect/__init__.py",>
line 1535, in expect_loop
    raise TIMEOUT(str(err) + '\n' + str(self))
TIMEOUT: Timeout exceeded.
<pexpect.spawn object at 0x7fe95e510bd0>
version: 3.2
command: /home/hudson/tools/java/latest1.6/bin/java
args: ['/home/hudson/tools/java/latest1.6/bin/java', '-jar', '<https://builds.apache.org/job/Stratos-Master-Nightly-Build/org.apache.stratos$org.apache.stratos.cli/ws/target/org.apache.stratos.cli-4.0.0-SNAPSHOT.jar',>
'-password', 'xxx']
searcher: <pexpect.searcher_re object at 0x7fe95da78090>
buffer (last 100 chars): '1234\r\n'
before (last 100 chars): '1234\r\n'
after: <class 'pexpect.TIMEOUT'>
match: None
match_index: None
exitstatus: None
flag_eof: False
pid: 8853
child_fd: 4
closed: False
timeout: 10
delimiter: <class 'pexpect.EOF'>
logfile: None
logfile_read: None
logfile_send: None
maxread: 2000
ignorecase: False
searchwindowsize: None
delaybeforesend: 0.05
delayafterclose: 0.1
delayafterterminate: 0.1

======================================================================
ERROR: test_interactive_mode_standard_username_parameter_provided (__main__.TestInteractive)
----------------------------------------------------------------------
Traceback (most recent call last):
  File "test_interactive.py", line 75, in test_interactive_mode_standard_username_parameter_provided
    child.expect   ('Successfully Authenticated.')
  File "<https://builds.apache.org/job/Stratos-Master-Nightly-Build/org.apache.stratos$org.apache.stratos.cli/ws/target/pexpect-3.2/pexpect/__init__.py",>
line 1418, in expect
    timeout, searchwindowsize)
  File "<https://builds.apache.org/job/Stratos-Master-Nightly-Build/org.apache.stratos$org.apache.stratos.cli/ws/target/pexpect-3.2/pexpect/__init__.py",>
line 1433, in expect_list
    timeout, searchwindowsize)
  File "<https://builds.apache.org/job/Stratos-Master-Nightly-Build/org.apache.stratos$org.apache.stratos.cli/ws/target/pexpect-3.2/pexpect/__init__.py",>
line 1535, in expect_loop
    raise TIMEOUT(str(err) + '\n' + str(self))
TIMEOUT: Timeout exceeded.
<pexpect.spawn object at 0x7fe95e510c10>
version: 3.2
command: /home/hudson/tools/java/latest1.6/bin/java
args: ['/home/hudson/tools/java/latest1.6/bin/java', '-jar', '<https://builds.apache.org/job/Stratos-Master-Nightly-Build/org.apache.stratos$org.apache.stratos.cli/ws/target/org.apache.stratos.cli-4.0.0-SNAPSHOT.jar',>
'-username', 'xxx']
searcher: <pexpect.searcher_re object at 0x7fe95e510c90>
buffer (last 100 chars): '***\r\n'
before (last 100 chars): '***\r\n'
after: <class 'pexpect.TIMEOUT'>
match: None
match_index: None
exitstatus: None
flag_eof: False
pid: 8902
child_fd: 4
closed: False
timeout: 10
delimiter: <class 'pexpect.EOF'>
logfile: None
logfile_read: None
logfile_send: None
maxread: 2000
ignorecase: False
searchwindowsize: None
delaybeforesend: 0.05
delayafterclose: 0.1
delayafterterminate: 0.1

======================================================================
ERROR: test_interactive_mode_username_and_password_sent_to_server (__main__.TestInteractive)
----------------------------------------------------------------------
Traceback (most recent call last):
  File "test_interactive.py", line 63, in test_interactive_mode_username_and_password_sent_to_server
    child.expect   ('Successfully Authenticated.')
  File "<https://builds.apache.org/job/Stratos-Master-Nightly-Build/org.apache.stratos$org.apache.stratos.cli/ws/target/pexpect-3.2/pexpect/__init__.py",>
line 1418, in expect
    timeout, searchwindowsize)
  File "<https://builds.apache.org/job/Stratos-Master-Nightly-Build/org.apache.stratos$org.apache.stratos.cli/ws/target/pexpect-3.2/pexpect/__init__.py",>
line 1433, in expect_list
    timeout, searchwindowsize)
  File "<https://builds.apache.org/job/Stratos-Master-Nightly-Build/org.apache.stratos$org.apache.stratos.cli/ws/target/pexpect-3.2/pexpect/__init__.py",>
line 1535, in expect_loop
    raise TIMEOUT(str(err) + '\n' + str(self))
TIMEOUT: Timeout exceeded.
<pexpect.spawn object at 0x7fe95e510bd0>
version: 3.2
command: /home/hudson/tools/java/latest1.6/bin/java
args: ['/home/hudson/tools/java/latest1.6/bin/java', '-jar', '<https://builds.apache.org/job/Stratos-Master-Nightly-Build/org.apache.stratos$org.apache.stratos.cli/ws/target/org.apache.stratos.cli-4.0.0-SNAPSHOT.jar']>
searcher: <pexpect.searcher_re object at 0x7fe95e510c90>
buffer (last 100 chars): '****\r\n'
before (last 100 chars): '****\r\n'
after: <class 'pexpect.TIMEOUT'>
match: None
match_index: None
exitstatus: None
flag_eof: False
pid: 8954
child_fd: 4
closed: False
timeout: 30
delimiter: <class 'pexpect.EOF'>
logfile: None
logfile_read: None
logfile_send: None
maxread: 2000
ignorecase: False
searchwindowsize: None
delaybeforesend: 0.05
delayafterclose: 0.1
delayafterterminate: 0.1

======================================================================
ERROR: test_interactive_mode_username_env_var_provided (__main__.TestInteractive)
----------------------------------------------------------------------
Traceback (most recent call last):
  File "test_interactive.py", line 113, in test_interactive_mode_username_env_var_provided
    child.expect   ('Successfully Authenticated.')
  File "<https://builds.apache.org/job/Stratos-Master-Nightly-Build/org.apache.stratos$org.apache.stratos.cli/ws/target/pexpect-3.2/pexpect/__init__.py",>
line 1418, in expect
    timeout, searchwindowsize)
  File "<https://builds.apache.org/job/Stratos-Master-Nightly-Build/org.apache.stratos$org.apache.stratos.cli/ws/target/pexpect-3.2/pexpect/__init__.py",>
line 1433, in expect_list
    timeout, searchwindowsize)
  File "<https://builds.apache.org/job/Stratos-Master-Nightly-Build/org.apache.stratos$org.apache.stratos.cli/ws/target/pexpect-3.2/pexpect/__init__.py",>
line 1535, in expect_loop
    raise TIMEOUT(str(err) + '\n' + str(self))
TIMEOUT: Timeout exceeded.
<pexpect.spawn object at 0x7fe95e510c90>
version: 3.2
command: /home/hudson/tools/java/latest1.6/bin/java
args: ['/home/hudson/tools/java/latest1.6/bin/java', '-jar', '<https://builds.apache.org/job/Stratos-Master-Nightly-Build/org.apache.stratos$org.apache.stratos.cli/ws/target/org.apache.stratos.cli-4.0.0-SNAPSHOT.jar']>
searcher: <pexpect.searcher_re object at 0x7fe95da78090>
buffer (last 100 chars): '***\r\n'
before (last 100 chars): '***\r\n'
after: <class 'pexpect.TIMEOUT'>
match: None
match_index: None
exitstatus: None
flag_eof: False
pid: 9090
child_fd: 4
closed: False
timeout: 10
delimiter: <class 'pexpect.EOF'>
logfile: None
logfile_read: None
logfile_send: None
maxread: 2000
ignorecase: False
searchwindowsize: None
delaybeforesend: 0.05
delayafterclose: 0.1
delayafterterminate: 0.1

----------------------------------------------------------------------
Ran 9 tests in 119.487s

FAILED (errors=9)

Mime
View raw message