stratos-dev mailing list archives

Site index · List index
Message view « Date » · « Thread »
Top « Date » · « Thread »
From Lahiru Sandaruwan <lahi...@wso2.com>
Subject Re: Build failure
Date Thu, 03 Apr 2014 06:31:12 GMT
I will look into this.

Thanks.



On Wed, Apr 2, 2014 at 11:28 PM, Dinesh Bandara <dineshb@wso2.com> wrote:

> Hi,
>
> Getting following error in jclouds Amazon EC2 provider 1.7.1
>
> Tests run: 300, Failures: 2, Errors: 0, Skipped: 0, Time elapsed: 6.578
> sec <<< FAILURE!
> testGetSecurityGroupsForTagAndOptions_reusesGroupByDefaultWhenNoPortsAreSpecifiedWhenDoesExistAndAcceptsUserSuppliedGroupIds(org.jclouds.aws.ec2.compute.strategy.CreateKeyPairPlacementAndSecurityGroupsAsNeededAndReturnRunOptionsTest)
> Time elapsed: 0.002 sec  <<< FAILURE!
> java.lang.AssertionError: Sets differ: expected [jclouds#group] but got []
>     at org.testng.Assert.fail(Assert.java:94)
>     at org.testng.Assert.assertEquals(Assert.java:710)
>     at org.testng.Assert.assertEquals(Assert.java:688)
>     at
> org.jclouds.aws.ec2.compute.strategy.CreateKeyPairPlacementAndSecurityGroupsAsNeededAndReturnRunOptionsTest.testGetSecurityGroupsForTagAndOptions_reusesGroupByDefaultWhenNoPortsAreSpecifiedWhenDoesExistAndAcceptsUserSuppliedGroupIds(CreateKeyPairPlacementAndSecurityGroupsAsNeededAndReturnRunOptionsTest.java:820)
>
> testGetSecurityGroupsForTagAndOptions_reusesGroupByDefaultWhenNoPortsAreSpecifiedWhenDoesExistAndAcceptsUserSuppliedGroups(org.jclouds.aws.ec2.compute.strategy.CreateKeyPairPlacementAndSecurityGroupsAsNeededAndReturnRunOptionsTest)
> Time elapsed: 0.002 sec  <<< FAILURE!
> java.lang.AssertionError: Sets differ: expected [jclouds#group, group1,
> group2] but got [group1, group2]
>     at org.testng.Assert.fail(Assert.java:94)
>     at org.testng.Assert.assertEquals(Assert.java:710)
>     at org.testng.Assert.assertEquals(Assert.java:688)
>     at
> org.jclouds.aws.ec2.compute.strategy.CreateKeyPairPlacementAndSecurityGroupsAsNeededAndReturnRunOptionsTest.testGetSecurityGroupsForTagAndOptions_reusesGroupByDefaultWhenNoPortsAreSpecifiedWhenDoesExistAndAcceptsUserSuppliedGroups(CreateKeyPairPlacementAndSecurityGroupsAsNeededAndReturnRunOptionsTest.java:784)
>
>
> Results :
>
> Failed tests:
> testGetSecurityGroupsForTagAndOptions_reusesGroupByDefaultWhenNoPortsAreSpecifiedWhenDoesExistAndAcceptsUserSuppliedGroupIds(org.jclouds.aws.ec2.compute.strategy.CreateKeyPairPlacementAndSecurityGroupsAsNeededAndReturnRunOptionsTest):
> Sets differ: expected [jclouds#group] but got []
>
> testGetSecurityGroupsForTagAndOptions_reusesGroupByDefaultWhenNoPortsAreSpecifiedWhenDoesExistAndAcceptsUserSuppliedGroups(org.jclouds.aws.ec2.compute.strategy.CreateKeyPairPlacementAndSecurityGroupsAsNeededAndReturnRunOptionsTest):
> Sets differ: expected [jclouds#group, group1, group2] but got [group1,
> group2]
>
> Tests run: 300, Failures: 2, Errors: 0, Skipped: 0
>
> Thanks
> --
> *Dinesh Bandara*
> Software Engineer
> WSO2 Inc.; http://wso2.com
> lean.enterprise.middleware
>
>


-- 
--
Lahiru Sandaruwan
Software Engineer,
Platform Technologies,
WSO2 Inc., http://wso2.com
lean.enterprise.middleware

email: lahirus@wso2.com cell: (+94) 773 325 954
blog: http://lahiruwrites.blogspot.com/
twitter: http://twitter.com/lahirus
linked-in: http://lk.linkedin.com/pub/lahiru-sandaruwan/16/153/146

Mime
View raw message