stratos-dev mailing list archives

Site index · List index
Message view « Date » · « Thread »
Top « Date » · « Thread »
From Isuru Perera <isu...@wso2.com>
Subject Re: Build failure
Date Thu, 03 Apr 2014 06:36:50 GMT
Nirmal,

Any idea?


On Thu, Apr 3, 2014 at 11:58 AM, Dinesh Bandara <dineshb@wso2.com> wrote:

> Hi,
>
> Getting following error in jclouds Amazon EC2 provider 1.7.1
>
> Tests run: 300, Failures: 2, Errors: 0, Skipped: 0, Time elapsed: 6.578
> sec <<< FAILURE!
> testGetSecurityGroupsForTagAndOptions_reusesGroupByDefaultWhenNoPortsAreSpecifiedWhenDoesExistAndAcceptsUserSuppliedGroupIds(org.jclouds.aws.ec2.compute.strategy.CreateKeyPairPlacementAndSecurityGroupsAsNeededAndReturnRunOptionsTest)
> Time elapsed: 0.002 sec  <<< FAILURE!
> java.lang.AssertionError: Sets differ: expected [jclouds#group] but got []
>     at org.testng.Assert.fail(Assert.java:94)
>     at org.testng.Assert.assertEquals(Assert.java:710)
>     at org.testng.Assert.assertEquals(Assert.java:688)
>     at
> org.jclouds.aws.ec2.compute.strategy.CreateKeyPairPlacementAndSecurityGroupsAsNeededAndReturnRunOptionsTest.testGetSecurityGroupsForTagAndOptions_reusesGroupByDefaultWhenNoPortsAreSpecifiedWhenDoesExistAndAcceptsUserSuppliedGroupIds(CreateKeyPairPlacementAndSecurityGroupsAsNeededAndReturnRunOptionsTest.java:820)
>
> testGetSecurityGroupsForTagAndOptions_reusesGroupByDefaultWhenNoPortsAreSpecifiedWhenDoesExistAndAcceptsUserSuppliedGroups(org.jclouds.aws.ec2.compute.strategy.CreateKeyPairPlacementAndSecurityGroupsAsNeededAndReturnRunOptionsTest)
> Time elapsed: 0.002 sec  <<< FAILURE!
> java.lang.AssertionError: Sets differ: expected [jclouds#group, group1,
> group2] but got [group1, group2]
>     at org.testng.Assert.fail(Assert.java:94)
>     at org.testng.Assert.assertEquals(Assert.java:710)
>     at org.testng.Assert.assertEquals(Assert.java:688)
>     at
> org.jclouds.aws.ec2.compute.strategy.CreateKeyPairPlacementAndSecurityGroupsAsNeededAndReturnRunOptionsTest.testGetSecurityGroupsForTagAndOptions_reusesGroupByDefaultWhenNoPortsAreSpecifiedWhenDoesExistAndAcceptsUserSuppliedGroups(CreateKeyPairPlacementAndSecurityGroupsAsNeededAndReturnRunOptionsTest.java:784)
>
>
> Results :
>
> Failed tests:
> testGetSecurityGroupsForTagAndOptions_reusesGroupByDefaultWhenNoPortsAreSpecifiedWhenDoesExistAndAcceptsUserSuppliedGroupIds(org.jclouds.aws.ec2.compute.strategy.CreateKeyPairPlacementAndSecurityGroupsAsNeededAndReturnRunOptionsTest):
> Sets differ: expected [jclouds#group] but got []
>
> testGetSecurityGroupsForTagAndOptions_reusesGroupByDefaultWhenNoPortsAreSpecifiedWhenDoesExistAndAcceptsUserSuppliedGroups(org.jclouds.aws.ec2.compute.strategy.CreateKeyPairPlacementAndSecurityGroupsAsNeededAndReturnRunOptionsTest):
> Sets differ: expected [jclouds#group, group1, group2] but got [group1,
> group2]
>
> Tests run: 300, Failures: 2, Errors: 0, Skipped: 0
>
> Thanks
> --
> *Dinesh Bandara*
> Software Engineer
> WSO2 Inc.; http://wso2.com
> lean.enterprise.middleware
>
>


-- 
Isuru Perera
Senior Software Engineer | WSO2, Inc. | http://wso2.com/
Lean . Enterprise . Middleware

about.me/chrishantha

Mime
View raw message