stdcxx-user mailing list archives

Site index · List index
Message view « Date » · « Thread »
Top « Date » · « Thread »
From "Doron Solomon" <>
Subject Compiling stdcxx using gcc 3.4.6 on Solaris 8
Date Mon, 10 Dec 2007 19:25:32 GMT

I'm having trouble compiling stdcxx using gcc 3.4.6 on Solaris 8.  It
seems like the same makefile is being called recursively, with a growing
argument list, which eventually dies.  I've included the log below.  Has
anyone experienced such a problem or know of a solution?


$ cd /vobs/3pptools/apache/stdcxx-4.2.0
$ gmake BUILDDIR=/vobs/3pptools/apache/stdcxx-4.2.0_11s BUILDTYPE=11s
creating BUILDDIR=/vobs/3pptools/apache/stdcxx-4.2.0_11s
generating /vobs/3pptools/apache/stdcxx-4.2.0_11s/ from
gmake[1]: Entering directory `/vobs/3pptools/apache/stdcxx-4.2.0_11s'
gmake[2]: Entering directory `/vobs/3pptools/apache/stdcxx-4.2.0_11s'
gmake[3]: Entering directory `/vobs/3pptools/apache/stdcxx-4.2.0_11s'
gmake[4]: Entering directory `/vobs/3pptools/apache/stdcxx-4.2.0_11s'
gmake[5]: Entering directory `/vobs/3pptools/apache/stdcxx-4.2.0_11s'
gmake[6]: Entering directory `/vobs/3pptools/apache/stdcxx-4.2.0_11s'
gmake[7]: Entering directory `/vobs/3pptools/apache/stdcxx-4.2.0_11s'
gmake[8]: Entering directory `/vobs/3pptools/apache/stdcxx-4.2.0_11s'
gmake[9]: Entering directory `/vobs/3pptools/apache/stdcxx-4.2.0_11s'
gmake[10]: Entering directory `/vobs/3pptools/apache/stdcxx-4.2.0_11s'
gmake[11]: Entering directory `/vobs/3pptools/apache/stdcxx-4.2.0_11s'
gmake[12]: Entering directory `/vobs/3pptools/apache/stdcxx-4.2.0_11s'
gmake[12]: execvp: gmake: Arg list too long
gmake[12]: *** [libstd] Error 127
gmake[12]: Leaving directory `/vobs/3pptools/apache/stdcxx-4.2.0_11s'
gmake[11]: *** [libstd] Error 2
gmake[11]: Leaving directory `/vobs/3pptools/apache/stdcxx-4.2.0_11s'
gmake[10]: *** [libstd] Error 2
gmake[10]: Leaving directory `/vobs/3pptools/apache/stdcxx-4.2.0_11s'
gmake[9]: *** [libstd] Error 2
gmake[9]: Leaving directory `/vobs/3pptools/apache/stdcxx-4.2.0_11s'
gmake[8]: *** [libstd] Error 2
gmake[8]: Leaving directory `/vobs/3pptools/apache/stdcxx-4.2.0_11s'
gmake[7]: *** [libstd] Error 2
gmake[7]: Leaving directory `/vobs/3pptools/apache/stdcxx-4.2.0_11s'
gmake[6]: *** [libstd] Error 2
gmake[6]: Leaving directory `/vobs/3pptools/apache/stdcxx-4.2.0_11s'
gmake[5]: *** [libstd] Error 2
gmake[5]: Leaving directory `/vobs/3pptools/apache/stdcxx-4.2.0_11s'
gmake[4]: *** [libstd] Error 2
gmake[4]: Leaving directory `/vobs/3pptools/apache/stdcxx-4.2.0_11s'
gmake[3]: *** [libstd] Error 2
gmake[3]: Leaving directory `/vobs/3pptools/apache/stdcxx-4.2.0_11s'
gmake[2]: *** [libstd] Error 2
gmake[2]: Leaving directory `/vobs/3pptools/apache/stdcxx-4.2.0_11s'
gmake[1]: *** [libstd] Error 2
gmake[1]: Leaving directory `/vobs/3pptools/apache/stdcxx-4.2.0_11s'
gmake: *** [libstd] Error 2

  • Unnamed multipart/alternative (inline, None, 0 bytes)
View raw message