stdcxx-dev mailing list archives

Site index · List index
Message view « Date » · « Thread »
Top « Date » · « Thread »
From "Martin Sebor (JIRA)" <j...@apache.org>
Subject [jira] Closed: (STDCXX-599) [EDG eccp 3.9/Solaris 9] error on mkstemp() in file.cpp
Date Tue, 16 Oct 2007 01:30:50 GMT

     [ https://issues.apache.org/jira/browse/STDCXX-599?page=com.atlassian.jira.plugin.system.issuetabpanels:all-tabpanel
]

Martin Sebor closed STDCXX-599.
-------------------------------

       Resolution: Fixed
    Fix Version/s: 4.2

Fix confirmed in a manual build. Closing.

> [EDG eccp 3.9/Solaris 9] error on mkstemp() in file.cpp
> -------------------------------------------------------
>
>                 Key: STDCXX-599
>                 URL: https://issues.apache.org/jira/browse/STDCXX-599
>             Project: C++ Standard Library
>          Issue Type: Bug
>          Components: Build
>    Affects Versions: trunk
>         Environment: EDG eccp 3.9 on Solaris 9
>            Reporter: Martin Sebor
>            Assignee: Martin Sebor
>             Fix For: 4.2
>
>
> The top of 4.2.0 fails to build with EDG eccp 3.9 on Solaris 9 with the error below:
> $ nice gmake BUILDTYPE=11s BUILDDIR=/build/sebor/stdcxx-4.2.0-eccp-3.9-11s CONFIG=eccp.config
> Bad string
> creating BUILDDIR=/build/sebor/stdcxx-4.2.0-eccp-3.9-11s
> generating /build/sebor/stdcxx-4.2.0-eccp-3.9-11s/makefile.in from /amd/homes/sebor/stdcxx-4.2.0/etc/config/eccp.config
> Bad string
> gmake[1]: Entering directory `/build/sebor/stdcxx-4.2.0-eccp-3.9-11s'
> gmake[2]: Entering directory `/build/sebor/stdcxx-4.2.0-eccp-3.9-11s/include'
> gmake config
> gmake[3]: Entering directory `/build/sebor/stdcxx-4.2.0-eccp-3.9-11s/include'
> configuring stdcxx 4.2.0 for eccp-3.9 on 
> checking if the compiler is sane                   ok (invoked with eccp)
> checking if the linker is sane                     ok (invoked with eccp)
> checking system architecture                       ILP32 big endian
> ...
> eccp -c -I/amd/homes/sebor/stdcxx-4.2.0/include/ansi -D_RWSTDDEBUG    -I/amd/homes/sebor/stdcxx-4.2.0/include
-I/build/sebor/stdcxx-4.2.0-eccp-3.9-11s/include  -A -x --template_directory=/build/sebor/stdcxx-4.2.0-eccp-3.9-11s/lib
-g   --display_error_number --remarks --diag_suppress 193,236,340,401,261,479,487,678,679,815
   /amd/homes/sebor/stdcxx-4.2.0/src/file.cpp
> "/amd/homes/sebor/stdcxx-4.2.0/src/file.cpp", line 265: error #20: identifier
>           "mkstemp" is undefined
>       fd = mkstemp (fnamebuf);
>            ^
> 1 error detected in the compilation of "/amd/homes/sebor/stdcxx-4.2.0/src/file.cpp".
> gmake[2]: *** [file.o] Error 2
> gmake[2]: Leaving directory `/build/sebor/stdcxx-4.2.0-eccp-3.9-11s/lib'
> gmake[1]: *** [lib] Error 2
> gmake[1]: Leaving directory `/build/sebor/stdcxx-4.2.0-eccp-3.9-11s'
> gmake: *** [libstd] Error 2

-- 
This message is automatically generated by JIRA.
-
You can reply to this email to add a comment to the issue online.


Mime
View raw message