stanbol-dev mailing list archives

Site index · List index
Message view « Date » · « Thread »
Top « Date » · « Thread »
From Apache Jenkins Server <jenk...@builds.apache.org>
Subject Build failed in Jenkins: stanbol-trunk-1.6 #1340
Date Tue, 09 Apr 2013 14:01:39 GMT
See <https://builds.apache.org/job/stanbol-trunk-1.6/1340/changes>

Changes:

[rwesten] STANBOL-1019 adapted start levels of solr.commns.** modules to be compatible with
the changes intoduced in STANBOL-1000

------------------------------------------
[...truncated 38945 lines...]
[JENKINS] Archiving disabled
[JENKINS] Archiving disabled
[JENKINS] Archiving disabled
[JENKINS] Archiving disabled
[JENKINS] Archiving disabled
[JENKINS] Archiving disabled
[JENKINS] Archiving disabled
[JENKINS] Archiving disabled
[JENKINS] Archiving disabled
[JENKINS] Archiving disabled
[JENKINS] Archiving disabled
[JENKINS] Archiving disabled
[JENKINS] Archiving disabled
[JENKINS] Archiving disabled
[JENKINS] Archiving disabled
[JENKINS] Archiving disabled
[JENKINS] Archiving disabled
[JENKINS] Archiving disabled
[JENKINS] Archiving disabled
[JENKINS] Archiving disabled
[JENKINS] Archiving disabled
[JENKINS] Archiving disabled
[JENKINS] Archiving disabled
[JENKINS] Archiving disabled
[JENKINS] Archiving disabled
[JENKINS] Archiving disabled
[JENKINS] Archiving disabled
[JENKINS] Archiving disabled
[JENKINS] Archiving disabled
[JENKINS] Archiving disabled
[JENKINS] Archiving disabled
[JENKINS] Archiving disabled
[JENKINS] Archiving disabled
[JENKINS] Archiving disabled
[JENKINS] Archiving disabled
[JENKINS] Archiving disabled
[JENKINS] Archiving disabled
[JENKINS] Archiving disabled
[JENKINS] Archiving disabled
[JENKINS] Archiving disabled
[JENKINS] Archiving disabled
[JENKINS] Archiving disabled
[JENKINS] Archiving disabled
[JENKINS] Archiving disabled
[JENKINS] Archiving disabled
[JENKINS] Archiving disabled
[JENKINS] Archiving disabled
[JENKINS] Archiving disabled
[JENKINS] Archiving disabled
[JENKINS] Archiving disabled
[JENKINS] Archiving disabled
[JENKINS] Archiving disabled
[JENKINS] Archiving disabled
[JENKINS] Archiving disabled
[JENKINS] Archiving disabled
[JENKINS] Archiving disabled
[JENKINS] Archiving disabled
[JENKINS] Archiving disabled
[JENKINS] Archiving disabled
[JENKINS] Archiving disabled
[JENKINS] Archiving disabled
[JENKINS] Archiving disabled
[JENKINS] Archiving disabled
[JENKINS] Archiving disabled
[JENKINS] Archiving disabled
[JENKINS] Archiving disabled
[JENKINS] Archiving disabled
[JENKINS] Archiving disabled
[JENKINS] Archiving disabled
[JENKINS] Archiving disabled
[JENKINS] Archiving disabled
[JENKINS] Archiving disabled
[JENKINS] Archiving disabled
[JENKINS] Archiving disabled
[JENKINS] Archiving disabled
[JENKINS] Archiving disabled
[JENKINS] Archiving disabled
[JENKINS] Archiving disabled
[JENKINS] Archiving disabled
[JENKINS] Archiving disabled
[JENKINS] Archiving disabled
[JENKINS] Archiving disabled
[JENKINS] Archiving disabled
[JENKINS] Archiving disabled
[JENKINS] Archiving disabled
[JENKINS] Archiving disabled
[JENKINS] Archiving disabled
[JENKINS] Archiving disabled
[JENKINS] Archiving disabled
[JENKINS] Archiving disabled
[JENKINS] Archiving disabled
[JENKINS] Archiving disabled
[JENKINS] Archiving disabled
[JENKINS] Archiving disabled
[JENKINS] Archiving disabled
[JENKINS] Archiving disabled
[JENKINS] Archiving disabled
[JENKINS] Archiving disabled
[JENKINS] Archiving disabled
[JENKINS] Archiving disabled
[JENKINS] Archiving disabled
[JENKINS] Archiving disabled
[JENKINS] Archiving disabled
[JENKINS] Archiving disabled
[JENKINS] Archiving disabled
[JENKINS] Archiving disabled
[JENKINS] Archiving disabled
[JENKINS] Archiving disabled
[JENKINS] Archiving disabled
[JENKINS] Archiving disabled
[JENKINS] Archiving disabled
[JENKINS] Archiving disabled
[JENKINS] Archiving disabled
[JENKINS] Archiving disabled
[JENKINS] Archiving disabled
[JENKINS] Archiving disabled
[JENKINS] Archiving disabled
[JENKINS] Archiving disabled
[JENKINS] Archiving disabled
[JENKINS] Archiving disabled
[JENKINS] Archiving disabled
[JENKINS] Archiving disabled
[JENKINS] Archiving disabled
[JENKINS] Archiving disabled
[JENKINS] Archiving disabled
[JENKINS] Archiving disabled
[JENKINS] Archiving disabled
[JENKINS] Archiving disabled
[JENKINS] Archiving disabled
[JENKINS] Archiving disabled
[JENKINS] Archiving disabled
[JENKINS] Archiving disabled
[JENKINS] Archiving disabled
[JENKINS] Archiving disabled
[JENKINS] Archiving disabled
[JENKINS] Archiving disabled
[JENKINS] Archiving disabled
[JENKINS] Archiving disabled
[JENKINS] Archiving disabled
[JENKINS] Archiving disabled
[JENKINS] Archiving disabled
[JENKINS] Archiving disabled
[JENKINS] Archiving disabled
[JENKINS] Archiving disabled
[JENKINS] Archiving disabled
[JENKINS] Archiving disabled
[JENKINS] Archiving disabled
[JENKINS] Archiving disabled
[JENKINS] Archiving disabled
[JENKINS] Archiving disabled
[JENKINS] Archiving disabled
[JENKINS] Archiving disabled
[JENKINS] Archiving disabled
[JENKINS] Archiving disabled
[JENKINS] Archiving disabled
[JENKINS] Archiving disabled
[JENKINS] Archiving disabled
[JENKINS] Archiving disabled
[JENKINS] Archiving disabled
[JENKINS] Archiving disabled
[JENKINS] Archiving disabled
[JENKINS] Archiving disabled
[JENKINS] Archiving disabled
[JENKINS] Archiving disabled
[JENKINS] Archiving disabled
[JENKINS] Archiving disabled
[JENKINS] Archiving disabled
[JENKINS] Archiving disabled
[JENKINS] Archiving disabled
[JENKINS] Archiving disabled
[JENKINS] Archiving disabled
[JENKINS] Archiving disabled
[JENKINS] Archiving disabled
Waiting for Jenkins to finish collecting data
mavenExecutionResult exceptions not empty
message : Failed to execute goal on project org.apache.stanbol.integration-tests: Could not
resolve dependencies for project org.apache.stanbol:org.apache.stanbol.integration-tests:jar:0.10.0-SNAPSHOT:
Failed to collect dependencies for [org.apache.stanbol:org.apache.stanbol.launchers.full:jar:0.10.0-SNAPSHOT
(compile), org.apache.stanbol:org.apache.stanbol.commons.web.base:jar:0.12.0-SNAPSHOT (compile),
org.apache.stanbol:org.apache.stanbol.commons.testing.stanbol:jar:0.12.0-SNAPSHOT (compile),
org.apache.stanbol:org.apache.stanbol.entityhub.test:jar:0.12.0-SNAPSHOT (compile), org.apache.stanbol:org.apache.stanbol.commons.indexedgraph:jar:0.12.0-SNAPSHOT
(compile), org.apache.stanbol:org.apache.stanbol.enhancer.servicesapi:jar:0.10.0 (compile),
org.apache.stanbol:org.apache.stanbol.commons.namespaceprefix.service:jar:0.12.0-SNAPSHOT
(compile), org.apache.stanbol:org.apache.stanbol.commons.namespaceprefix.provider.stanbol:jar:0.12.0-SNAPSHOT
(compile), org.apache.stanbol:org.apache.stanbol.commons.namespaceprefix.provider.prefixcc:jar:0.12.0-SNAPSHOT
(compile), commons-io:commons-io:jar:1.4 (compile), org.apache.commons:commons-compress:jar:1.4.1
(compile), org.apache.httpcomponents:httpcore-osgi:jar:4.2.1 (compile), org.apache.httpcomponents:httpmime:jar:4.2.1
(compile), junit:junit:jar:4.11 (test), org.apache.stanbol:org.apache.stanbol.commons.web.viewable:jar:0.12.0-SNAPSHOT
(compile), com.sun.jersey:jersey-server:jar:1.15 (compile), com.sun.jersey:jersey-core:jar:1.15
(compile), org.codehaus.jettison:jettison:jar:1.3 (compile), org.apache.clerezza:rdf.ontologies:jar:0.11-incubating
(compile), org.apache.clerezza:rdf.jena.serializer:jar:0.9-incubating (compile), org.apache.clerezza:rdf.jena.parser:jar:0.10-incubating
(compile), org.apache.clerezza:rdf.rdfjson:jar:0.4-SNAPSHOT (compile), org.slf4j:slf4j-log4j12:jar:1.6.1
(test), log4j:log4j:jar:1.2.16 (test)]
cause : Could not resolve dependencies for project org.apache.stanbol:org.apache.stanbol.integration-tests:jar:0.10.0-SNAPSHOT:
Failed to collect dependencies for [org.apache.stanbol:org.apache.stanbol.launchers.full:jar:0.10.0-SNAPSHOT
(compile), org.apache.stanbol:org.apache.stanbol.commons.web.base:jar:0.12.0-SNAPSHOT (compile),
org.apache.stanbol:org.apache.stanbol.commons.testing.stanbol:jar:0.12.0-SNAPSHOT (compile),
org.apache.stanbol:org.apache.stanbol.entityhub.test:jar:0.12.0-SNAPSHOT (compile), org.apache.stanbol:org.apache.stanbol.commons.indexedgraph:jar:0.12.0-SNAPSHOT
(compile), org.apache.stanbol:org.apache.stanbol.enhancer.servicesapi:jar:0.10.0 (compile),
org.apache.stanbol:org.apache.stanbol.commons.namespaceprefix.service:jar:0.12.0-SNAPSHOT
(compile), org.apache.stanbol:org.apache.stanbol.commons.namespaceprefix.provider.stanbol:jar:0.12.0-SNAPSHOT
(compile), org.apache.stanbol:org.apache.stanbol.commons.namespaceprefix.provider.prefixcc:jar:0.12.0-SNAPSHOT
(compile), commons-io:commons-io:jar:1.4 (compile), org.apache.commons:commons-compress:jar:1.4.1
(compile), org.apache.httpcomponents:httpcore-osgi:jar:4.2.1 (compile), org.apache.httpcomponents:httpmime:jar:4.2.1
(compile), junit:junit:jar:4.11 (test), org.apache.stanbol:org.apache.stanbol.commons.web.viewable:jar:0.12.0-SNAPSHOT
(compile), com.sun.jersey:jersey-server:jar:1.15 (compile), com.sun.jersey:jersey-core:jar:1.15
(compile), org.codehaus.jettison:jettison:jar:1.3 (compile), org.apache.clerezza:rdf.ontologies:jar:0.11-incubating
(compile), org.apache.clerezza:rdf.jena.serializer:jar:0.9-incubating (compile), org.apache.clerezza:rdf.jena.parser:jar:0.10-incubating
(compile), org.apache.clerezza:rdf.rdfjson:jar:0.4-SNAPSHOT (compile), org.slf4j:slf4j-log4j12:jar:1.6.1
(test), log4j:log4j:jar:1.2.16 (test)]
Stack trace : 
org.apache.maven.lifecycle.LifecycleExecutionException: Failed to execute goal on project
org.apache.stanbol.integration-tests: Could not resolve dependencies for project org.apache.stanbol:org.apache.stanbol.integration-tests:jar:0.10.0-SNAPSHOT:
Failed to collect dependencies for [org.apache.stanbol:org.apache.stanbol.launchers.full:jar:0.10.0-SNAPSHOT
(compile), org.apache.stanbol:org.apache.stanbol.commons.web.base:jar:0.12.0-SNAPSHOT (compile),
org.apache.stanbol:org.apache.stanbol.commons.testing.stanbol:jar:0.12.0-SNAPSHOT (compile),
org.apache.stanbol:org.apache.stanbol.entityhub.test:jar:0.12.0-SNAPSHOT (compile), org.apache.stanbol:org.apache.stanbol.commons.indexedgraph:jar:0.12.0-SNAPSHOT
(compile), org.apache.stanbol:org.apache.stanbol.enhancer.servicesapi:jar:0.10.0 (compile),
org.apache.stanbol:org.apache.stanbol.commons.namespaceprefix.service:jar:0.12.0-SNAPSHOT
(compile), org.apache.stanbol:org.apache.stanbol.commons.namespaceprefix.provider.stanbol:jar:0.12.0-SNAPSHOT
(compile), org.apache.stanbol:org.apache.stanbol.commons.namespaceprefix.provider.prefixcc:jar:0.12.0-SNAPSHOT
(compile), commons-io:commons-io:jar:1.4 (compile), org.apache.commons:commons-compress:jar:1.4.1
(compile), org.apache.httpcomponents:httpcore-osgi:jar:4.2.1 (compile), org.apache.httpcomponents:httpmime:jar:4.2.1
(compile), junit:junit:jar:4.11 (test), org.apache.stanbol:org.apache.stanbol.commons.web.viewable:jar:0.12.0-SNAPSHOT
(compile), com.sun.jersey:jersey-server:jar:1.15 (compile), com.sun.jersey:jersey-core:jar:1.15
(compile), org.codehaus.jettison:jettison:jar:1.3 (compile), org.apache.clerezza:rdf.ontologies:jar:0.11-incubating
(compile), org.apache.clerezza:rdf.jena.serializer:jar:0.9-incubating (compile), org.apache.clerezza:rdf.jena.parser:jar:0.10-incubating
(compile), org.apache.clerezza:rdf.rdfjson:jar:0.4-SNAPSHOT (compile), org.slf4j:slf4j-log4j12:jar:1.6.1
(test), log4j:log4j:jar:1.2.16 (test)]
	at org.apache.maven.lifecycle.internal.LifecycleDependencyResolver.getDependencies(LifecycleDependencyResolver.java:210)
	at org.apache.maven.lifecycle.internal.LifecycleDependencyResolver.resolveProjectDependencies(LifecycleDependencyResolver.java:117)
	at org.apache.maven.lifecycle.internal.MojoExecutor.ensureDependenciesAreResolved(MojoExecutor.java:258)
	at org.apache.maven.lifecycle.internal.MojoExecutor.execute(MojoExecutor.java:201)
	at org.apache.maven.lifecycle.internal.MojoExecutor.execute(MojoExecutor.java:153)
	at org.apache.maven.lifecycle.internal.MojoExecutor.execute(MojoExecutor.java:145)
	at org.apache.maven.lifecycle.internal.LifecycleModuleBuilder.buildProject(LifecycleModuleBuilder.java:84)
	at org.apache.maven.lifecycle.internal.LifecycleModuleBuilder.buildProject(LifecycleModuleBuilder.java:59)
	at org.apache.maven.lifecycle.internal.LifecycleStarter.singleThreadedBuild(LifecycleStarter.java:183)
	at org.apache.maven.lifecycle.internal.LifecycleStarter.execute(LifecycleStarter.java:161)
	at org.apache.maven.DefaultMaven.doExecute(DefaultMaven.java:320)
	at org.apache.maven.DefaultMaven.execute(DefaultMaven.java:156)
	at org.jvnet.hudson.maven3.launcher.Maven3Launcher.main(Maven3Launcher.java:79)
	at sun.reflect.NativeMethodAccessorImpl.invoke0(Native Method)
	at sun.reflect.NativeMethodAccessorImpl.invoke(NativeMethodAccessorImpl.java:39)
	at sun.reflect.DelegatingMethodAccessorImpl.invoke(DelegatingMethodAccessorImpl.java:25)
	at java.lang.reflect.Method.invoke(Method.java:597)
	at org.codehaus.plexus.classworlds.launcher.Launcher.launchStandard(Launcher.java:329)
	at org.codehaus.plexus.classworlds.launcher.Launcher.launch(Launcher.java:239)
	at org.jvnet.hudson.maven3.agent.Maven3Main.launch(Maven3Main.java:158)
	at hudson.maven.Maven3Builder.call(Maven3Builder.java:100)
	at hudson.maven.Maven3Builder.call(Maven3Builder.java:66)
	at hudson.remoting.UserRequest.perform(UserRequest.java:118)
	at hudson.remoting.UserRequest.perform(UserRequest.java:48)
	at hudson.remoting.Request$2.run(Request.java:326)
	at hudson.remoting.InterceptingExecutorService$1.call(InterceptingExecutorService.java:72)
	at java.util.concurrent.FutureTask$Sync.innerRun(FutureTask.java:303)
	at java.util.concurrent.FutureTask.run(FutureTask.java:138)
	at java.util.concurrent.ThreadPoolExecutor$Worker.runTask(ThreadPoolExecutor.java:886)
	at java.util.concurrent.ThreadPoolExecutor$Worker.run(ThreadPoolExecutor.java:908)
	at java.lang.Thread.run(Thread.java:662)
Caused by: org.apache.maven.project.DependencyResolutionException: Could not resolve dependencies
for project org.apache.stanbol:org.apache.stanbol.integration-tests:jar:0.10.0-SNAPSHOT: Failed
to collect dependencies for [org.apache.stanbol:org.apache.stanbol.launchers.full:jar:0.10.0-SNAPSHOT
(compile), org.apache.stanbol:org.apache.stanbol.commons.web.base:jar:0.12.0-SNAPSHOT (compile),
org.apache.stanbol:org.apache.stanbol.commons.testing.stanbol:jar:0.12.0-SNAPSHOT (compile),
org.apache.stanbol:org.apache.stanbol.entityhub.test:jar:0.12.0-SNAPSHOT (compile), org.apache.stanbol:org.apache.stanbol.commons.indexedgraph:jar:0.12.0-SNAPSHOT
(compile), org.apache.stanbol:org.apache.stanbol.enhancer.servicesapi:jar:0.10.0 (compile),
org.apache.stanbol:org.apache.stanbol.commons.namespaceprefix.service:jar:0.12.0-SNAPSHOT
(compile), org.apache.stanbol:org.apache.stanbol.commons.namespaceprefix.provider.stanbol:jar:0.12.0-SNAPSHOT
(compile), org.apache.stanbol:org.apache.stanbol.commons.namespaceprefix.provider.prefixcc:jar:0.12.0-SNAPSHOT
(compile), commons-io:commons-io:jar:1.4 (compile), org.apache.commons:commons-compress:jar:1.4.1
(compile), org.apache.httpcomponents:httpcore-osgi:jar:4.2.1 (compile), org.apache.httpcomponents:httpmime:jar:4.2.1
(compile), junit:junit:jar:4.11 (test), org.apache.stanbol:org.apache.stanbol.commons.web.viewable:jar:0.12.0-SNAPSHOT
(compile), com.sun.jersey:jersey-server:jar:1.15 (compile), com.sun.jersey:jersey-core:jar:1.15
(compile), org.codehaus.jettison:jettison:jar:1.3 (compile), org.apache.clerezza:rdf.ontologies:jar:0.11-incubating
(compile), org.apache.clerezza:rdf.jena.serializer:jar:0.9-incubating (compile), org.apache.clerezza:rdf.jena.parser:jar:0.10-incubating
(compile), org.apache.clerezza:rdf.rdfjson:jar:0.4-SNAPSHOT (compile), org.slf4j:slf4j-log4j12:jar:1.6.1
(test), log4j:log4j:jar:1.2.16 (test)]
	at org.apache.maven.project.DefaultProjectDependenciesResolver.resolve(DefaultProjectDependenciesResolver.java:158)
	at org.apache.maven.lifecycle.internal.LifecycleDependencyResolver.getDependencies(LifecycleDependencyResolver.java:185)
	... 30 more
Caused by: org.sonatype.aether.collection.DependencyCollectionException: Failed to collect
dependencies for [org.apache.stanbol:org.apache.stanbol.launchers.full:jar:0.10.0-SNAPSHOT
(compile), org.apache.stanbol:org.apache.stanbol.commons.web.base:jar:0.12.0-SNAPSHOT (compile),
org.apache.stanbol:org.apache.stanbol.commons.testing.stanbol:jar:0.12.0-SNAPSHOT (compile),
org.apache.stanbol:org.apache.stanbol.entityhub.test:jar:0.12.0-SNAPSHOT (compile), org.apache.stanbol:org.apache.stanbol.commons.indexedgraph:jar:0.12.0-SNAPSHOT
(compile), org.apache.stanbol:org.apache.stanbol.enhancer.servicesapi:jar:0.10.0 (compile),
org.apache.stanbol:org.apache.stanbol.commons.namespaceprefix.service:jar:0.12.0-SNAPSHOT
(compile), org.apache.stanbol:org.apache.stanbol.commons.namespaceprefix.provider.stanbol:jar:0.12.0-SNAPSHOT
(compile), org.apache.stanbol:org.apache.stanbol.commons.namespaceprefix.provider.prefixcc:jar:0.12.0-SNAPSHOT
(compile), commons-io:commons-io:jar:1.4 (compile), org.apache.commons:commons-compress:jar:1.4.1
(compile), org.apache.httpcomponents:httpcore-osgi:jar:4.2.1 (compile), org.apache.httpcomponents:httpmime:jar:4.2.1
(compile), junit:junit:jar:4.11 (test), org.apache.stanbol:org.apache.stanbol.commons.web.viewable:jar:0.12.0-SNAPSHOT
(compile), com.sun.jersey:jersey-server:jar:1.15 (compile), com.sun.jersey:jersey-core:jar:1.15
(compile), org.codehaus.jettison:jettison:jar:1.3 (compile), org.apache.clerezza:rdf.ontologies:jar:0.11-incubating
(compile), org.apache.clerezza:rdf.jena.serializer:jar:0.9-incubating (compile), org.apache.clerezza:rdf.jena.parser:jar:0.10-incubating
(compile), org.apache.clerezza:rdf.rdfjson:jar:0.4-SNAPSHOT (compile), org.slf4j:slf4j-log4j12:jar:1.6.1
(test), log4j:log4j:jar:1.2.16 (test)]
	at org.sonatype.aether.impl.internal.DefaultDependencyCollector.collectDependencies(DefaultDependencyCollector.java:258)
	at org.sonatype.aether.impl.internal.DefaultRepositorySystem.collectDependencies(DefaultRepositorySystem.java:308)
	at org.apache.maven.project.DefaultProjectDependenciesResolver.resolve(DefaultProjectDependenciesResolver.java:150)
	... 31 more
Caused by: org.sonatype.aether.resolution.ArtifactDescriptorException: Failed to read artifact
descriptor for org.apache.clerezza:rdf.rdfjson:jar:0.4-SNAPSHOT
	at org.apache.maven.repository.internal.DefaultArtifactDescriptorReader.loadPom(DefaultArtifactDescriptorReader.java:331)
	at org.apache.maven.repository.internal.DefaultArtifactDescriptorReader.readArtifactDescriptor(DefaultArtifactDescriptorReader.java:186)
	at org.sonatype.aether.impl.internal.DefaultDependencyCollector.process(DefaultDependencyCollector.java:412)
	at org.sonatype.aether.impl.internal.DefaultDependencyCollector.collectDependencies(DefaultDependencyCollector.java:240)
	... 33 more
Caused by: org.apache.maven.model.resolution.UnresolvableModelException: Could not find artifact
org.apache.clerezza:clerezza:pom:0.3-SNAPSHOT in Nexus (http://repository.apache.org/snapshots)
	at org.apache.maven.repository.internal.DefaultModelResolver.resolveModel(DefaultModelResolver.java:126)
	at org.apache.maven.model.building.DefaultModelBuilder.readParentExternally(DefaultModelBuilder.java:813)
	at org.apache.maven.model.building.DefaultModelBuilder.readParent(DefaultModelBuilder.java:664)
	at org.apache.maven.model.building.DefaultModelBuilder.build(DefaultModelBuilder.java:310)
	at org.apache.maven.model.building.DefaultModelBuilder.build(DefaultModelBuilder.java:232)
	at org.apache.maven.repository.internal.DefaultArtifactDescriptorReader.loadPom(DefaultArtifactDescriptorReader.java:322)
	... 36 more
Caused by: org.sonatype.aether.resolution.ArtifactResolutionException: Could not find artifact
org.apache.clerezza:clerezza:pom:0.3-SNAPSHOT in Nexus (http://repository.apache.org/snapshots)
	at org.sonatype.aether.impl.internal.DefaultArtifactResolver.resolve(DefaultArtifactResolver.java:538)
	at org.sonatype.aether.impl.internal.DefaultArtifactResolver.resolveArtifacts(DefaultArtifactResolver.java:216)
	at org.sonatype.aether.impl.internal.DefaultArtifactResolver.resolveArtifact(DefaultArtifactResolver.java:193)
	at org.apache.maven.repository.internal.DefaultModelResolver.resolveModel(DefaultModelResolver.java:122)
	... 41 more
Caused by: org.sonatype.aether.transfer.ArtifactNotFoundException: Could not find artifact
org.apache.clerezza:clerezza:pom:0.3-SNAPSHOT in Nexus (http://repository.apache.org/snapshots)
	at org.sonatype.aether.connector.wagon.WagonRepositoryConnector$4.wrap(WagonRepositoryConnector.java:947)
	at org.sonatype.aether.connector.wagon.WagonRepositoryConnector$4.wrap(WagonRepositoryConnector.java:941)
	at org.sonatype.aether.connector.wagon.WagonRepositoryConnector$GetTask.run(WagonRepositoryConnector.java:669)
	at org.sonatype.aether.util.concurrency.RunnableErrorForwarder$1.run(RunnableErrorForwarder.java:60)
	... 3 more
Sending e-mails to: dev@stanbol.apache.org
channel stopped
[locks-and-latches] Releasing all the locks
[locks-and-latches] All the locks released

Mime
View raw message