stanbol-dev mailing list archives

Site index · List index
Message view « Date » · « Thread »
Top « Date » · « Thread »
From Apache Jenkins Server <jenk...@builds.apache.org>
Subject Build failed in Jenkins: stanbol-trunk-1.6 #1091
Date Tue, 13 Nov 2012 00:40:19 GMT
See <https://builds.apache.org/job/stanbol-trunk-1.6/1091/changes>

Changes:

[rwesten] minor: Deactivated the check for the number of Enhancements for the Geonames engine
as geonames.org changes the fact that Oceania is returned as parent of New Zealand to often.

------------------------------------------
[...truncated 44561 lines...]
[INFO] skip non existing resourceDirectory <https://builds.apache.org/job/stanbol-trunk-1.6/ws/trunk/cmsadapter/jcr/src/test/resources>
[INFO] Copying 3 resources
[INFO] [compiler:testCompile {execution: default-testCompile}]
[INFO] No sources to compile
[INFO] [surefire:test {execution: default-test}]
[INFO] Surefire report directory: <https://builds.apache.org/job/stanbol-trunk-1.6/ws/trunk/cmsadapter/jcr/target/surefire-reports>

-------------------------------------------------------
 T E S T S
-------------------------------------------------------

Results :

Tests run: 0, Failures: 0, Errors: 0, Skipped: 0

[INFO] [bundle:bundle {execution: default-bundle}]
[INFO] Preparing source:jar
[WARNING] Removing: jar from forked lifecycle, to prevent recursive invocation.

[JENKINS] Archiving disabled - not archiving <https://builds.apache.org/job/stanbol-trunk-1.6/ws/trunk/cmsadapter/jcr/pom.xml>
[JENKINS] Archiving disabled - not archiving <https://builds.apache.org/job/stanbol-trunk-1.6/ws/trunk/cmsadapter/jcr/target/org.apache.stanbol.cmsadapter.jcr-0.10.0-SNAPSHOT.jar>
[INFO] [enforcer:enforce {execution: enforce-java}]
[JENKINS] Archiving disabled - not archiving <https://builds.apache.org/job/stanbol-trunk-1.6/ws/trunk/cmsadapter/jcr/pom.xml>
[JENKINS] Archiving disabled - not archiving <https://builds.apache.org/job/stanbol-trunk-1.6/ws/trunk/cmsadapter/jcr/target/org.apache.stanbol.cmsadapter.jcr-0.10.0-SNAPSHOT.jar>
[INFO] [source:jar {execution: attach-sources}]
[INFO] META-INF already added, skipping
[INFO] META-INF/NOTICE already added, skipping
[INFO] META-INF/DEPENDENCIES already added, skipping
[INFO] META-INF/LICENSE already added, skipping
[INFO] Building jar: <https://builds.apache.org/job/stanbol-trunk-1.6/ws/trunk/cmsadapter/jcr/target/org.apache.stanbol.cmsadapter.jcr-0.10.0-SNAPSHOT-sources.jar>
[INFO] META-INF already added, skipping
[INFO] META-INF/NOTICE already added, skipping
[INFO] META-INF/DEPENDENCIES already added, skipping
[INFO] META-INF/LICENSE already added, skipping
[INFO] [install:install {execution: default-install}]
[INFO] Installing <https://builds.apache.org/job/stanbol-trunk-1.6/ws/trunk/cmsadapter/jcr/target/org.apache.stanbol.cmsadapter.jcr-0.10.0-SNAPSHOT.jar>
to /home/jenkins/jenkins-slave/maven-repositories/0/org/apache/stanbol/org.apache.stanbol.cmsadapter.jcr/0.10.0-SNAPSHOT/org.apache.stanbol.cmsadapter.jcr-0.10.0-SNAPSHOT.jar
[INFO] Installing <https://builds.apache.org/job/stanbol-trunk-1.6/ws/trunk/cmsadapter/jcr/target/org.apache.stanbol.cmsadapter.jcr-0.10.0-SNAPSHOT-sources.jar>
to /home/jenkins/jenkins-slave/maven-repositories/0/org/apache/stanbol/org.apache.stanbol.cmsadapter.jcr/0.10.0-SNAPSHOT/org.apache.stanbol.cmsadapter.jcr-0.10.0-SNAPSHOT-sources.jar
[INFO] [bundle:install {execution: default-install}]
[INFO] Installing org/apache/stanbol/org.apache.stanbol.cmsadapter.jcr/0.10.0-SNAPSHOT/org.apache.stanbol.cmsadapter.jcr-0.10.0-SNAPSHOT.jar
[INFO] Writing OBR metadata
[JENKINS] Archiving disabled - not archiving <https://builds.apache.org/job/stanbol-trunk-1.6/ws/trunk/cmsadapter/jcr/pom.xml>
[JENKINS] Archiving disabled - not archiving <https://builds.apache.org/job/stanbol-trunk-1.6/ws/trunk/cmsadapter/jcr/target/org.apache.stanbol.cmsadapter.jcr-0.10.0-SNAPSHOT.jar>
[JENKINS] Archiving disabled - not archiving <https://builds.apache.org/job/stanbol-trunk-1.6/ws/trunk/cmsadapter/jcr/target/org.apache.stanbol.cmsadapter.jcr-0.10.0-SNAPSHOT-sources.jar>
[INFO] ------------------------------------------------------------------------
[INFO] Building Apache Stanbol CMS Adapter CMIS Bundle
[INFO]    task-segment: [clean, install]
[INFO] ------------------------------------------------------------------------
[INFO] [clean:clean {execution: default-clean}]
[INFO] Deleting <https://builds.apache.org/job/stanbol-trunk-1.6/ws/trunk/cmsadapter/cmis/target>
[INFO] artifact org.jvnet.staxex:stax-ex: checking for updates from jboss.public
[INFO] artifact org.jvnet.staxex:stax-ex: checking for updates from maven2-repository.dev.java.net
[INFO] artifact org.jvnet.staxex:stax-ex: checking for updates from central
[INFO] [enforcer:enforce {execution: enforce-java}]
[INFO] [remote-resources:process {execution: default}]
[debug] execute contextualize
[INFO] [resources:resources {execution: default-resources}]
[INFO] Using 'UTF-8' encoding to copy filtered resources.
[INFO] skip non existing resourceDirectory <https://builds.apache.org/job/stanbol-trunk-1.6/ws/trunk/cmsadapter/cmis/src/main/resources>
[INFO] Copying 3 resources
[INFO] [compiler:compile {execution: default-compile}]
[INFO] Compiling 10 source files to <https://builds.apache.org/job/stanbol-trunk-1.6/ws/trunk/cmsadapter/cmis/target/classes>
[INFO] [scr:scr {execution: generate-scr-scrdescriptor}]
[INFO] Writing abstract service descriptor <https://builds.apache.org/job/stanbol-trunk-1.6/ws/trunk/cmsadapter/cmis/target/scr-plugin-generated/OSGI-INF/scr-plugin/scrinfo.xml>
with 5 entries.
[INFO] Generating 5 Service Component Descriptors to <https://builds.apache.org/job/stanbol-trunk-1.6/ws/trunk/cmsadapter/cmis/target/scr-plugin-generated/OSGI-INF/serviceComponents.xml>
[debug] execute contextualize
[INFO] [resources:testResources {execution: default-testResources}]
[INFO] Using 'UTF-8' encoding to copy filtered resources.
[INFO] skip non existing resourceDirectory <https://builds.apache.org/job/stanbol-trunk-1.6/ws/trunk/cmsadapter/cmis/src/test/resources>
[INFO] Copying 3 resources
[INFO] [compiler:testCompile {execution: default-testCompile}]
[INFO] No sources to compile
[INFO] [surefire:test {execution: default-test}]
[INFO] Surefire report directory: <https://builds.apache.org/job/stanbol-trunk-1.6/ws/trunk/cmsadapter/cmis/target/surefire-reports>

-------------------------------------------------------
 T E S T S
-------------------------------------------------------

Results :

Tests run: 0, Failures: 0, Errors: 0, Skipped: 0
[JENKINS] Recording test results
[INFO] [bundle:bundle {execution: default-bundle}]
[INFO] Preparing source:jar
[WARNING] Removing: jar from forked lifecycle, to prevent recursive invocation.

[JENKINS] Archiving disabled - not archiving <https://builds.apache.org/job/stanbol-trunk-1.6/ws/trunk/cmsadapter/cmis/pom.xml>
[JENKINS] Archiving disabled - not archiving <https://builds.apache.org/job/stanbol-trunk-1.6/ws/trunk/cmsadapter/cmis/target/org.apache.stanbol.cmsadapter.cmis-0.10.0-SNAPSHOT.jar>
[INFO] [enforcer:enforce {execution: enforce-java}]
[JENKINS] Archiving disabled - not archiving <https://builds.apache.org/job/stanbol-trunk-1.6/ws/trunk/cmsadapter/cmis/pom.xml>
[JENKINS] Archiving disabled - not archiving <https://builds.apache.org/job/stanbol-trunk-1.6/ws/trunk/cmsadapter/cmis/target/org.apache.stanbol.cmsadapter.cmis-0.10.0-SNAPSHOT.jar>
[INFO] [source:jar {execution: attach-sources}]
[INFO] META-INF already added, skipping
[INFO] META-INF/NOTICE already added, skipping
[INFO] META-INF/DEPENDENCIES already added, skipping
[INFO] META-INF/LICENSE already added, skipping
[INFO] Building jar: <https://builds.apache.org/job/stanbol-trunk-1.6/ws/trunk/cmsadapter/cmis/target/org.apache.stanbol.cmsadapter.cmis-0.10.0-SNAPSHOT-sources.jar>
[INFO] META-INF already added, skipping
[INFO] META-INF/NOTICE already added, skipping
[INFO] META-INF/DEPENDENCIES already added, skipping
[INFO] META-INF/LICENSE already added, skipping
[INFO] [install:install {execution: default-install}]
[INFO] Installing <https://builds.apache.org/job/stanbol-trunk-1.6/ws/trunk/cmsadapter/cmis/target/org.apache.stanbol.cmsadapter.cmis-0.10.0-SNAPSHOT.jar>
to /home/jenkins/jenkins-slave/maven-repositories/0/org/apache/stanbol/org.apache.stanbol.cmsadapter.cmis/0.10.0-SNAPSHOT/org.apache.stanbol.cmsadapter.cmis-0.10.0-SNAPSHOT.jar
[INFO] Installing <https://builds.apache.org/job/stanbol-trunk-1.6/ws/trunk/cmsadapter/cmis/target/org.apache.stanbol.cmsadapter.cmis-0.10.0-SNAPSHOT-sources.jar>
to /home/jenkins/jenkins-slave/maven-repositories/0/org/apache/stanbol/org.apache.stanbol.cmsadapter.cmis/0.10.0-SNAPSHOT/org.apache.stanbol.cmsadapter.cmis-0.10.0-SNAPSHOT-sources.jar
[INFO] [bundle:install {execution: default-install}]
[INFO] Installing org/apache/stanbol/org.apache.stanbol.cmsadapter.cmis/0.10.0-SNAPSHOT/org.apache.stanbol.cmsadapter.cmis-0.10.0-SNAPSHOT.jar
[INFO] Writing OBR metadata
[JENKINS] Archiving disabled - not archiving <https://builds.apache.org/job/stanbol-trunk-1.6/ws/trunk/cmsadapter/cmis/pom.xml>
[JENKINS] Archiving disabled - not archiving <https://builds.apache.org/job/stanbol-trunk-1.6/ws/trunk/cmsadapter/cmis/target/org.apache.stanbol.cmsadapter.cmis-0.10.0-SNAPSHOT.jar>
[JENKINS] Archiving disabled - not archiving <https://builds.apache.org/job/stanbol-trunk-1.6/ws/trunk/cmsadapter/cmis/target/org.apache.stanbol.cmsadapter.cmis-0.10.0-SNAPSHOT-sources.jar>
[INFO] ------------------------------------------------------------------------
[INFO] Building Apache Stanbol CMS Adapter Web
[INFO]    task-segment: [clean, install]
[INFO] ------------------------------------------------------------------------
[JENKINS] Recording test results
[JENKINS] Archiving disabled - not archiving <https://builds.apache.org/job/stanbol-trunk-1.6/ws/trunk/cmsadapter/web/pom.xml>
[JENKINS] Archiving disabled - not archiving <https://builds.apache.org/job/stanbol-trunk-1.6/ws/trunk/cmsadapter/web/target/org.apache.stanbol.cmsadapter.web-0.10.0-SNAPSHOT.jar>
[INFO] [clean:clean {execution: default-clean}]
[INFO] Deleting <https://builds.apache.org/job/stanbol-trunk-1.6/ws/trunk/cmsadapter/web/target>
[INFO] [enforcer:enforce {execution: enforce-java}]
[INFO] [remote-resources:process {execution: default}]
[debug] execute contextualize
[INFO] [resources:resources {execution: default-resources}]
[INFO] Using 'UTF-8' encoding to copy filtered resources.
[INFO] Copying 5 resources
[INFO] Copying 3 resources
[INFO] [compiler:compile {execution: default-compile}]
[INFO] Compiling 11 source files to <https://builds.apache.org/job/stanbol-trunk-1.6/ws/trunk/cmsadapter/web/target/classes>
[INFO] [scr:scr {execution: generate-scr-scrdescriptor}]
[INFO] Generating 2 MetaType Descriptors to <https://builds.apache.org/job/stanbol-trunk-1.6/ws/trunk/cmsadapter/web/target/scr-plugin-generated/OSGI-INF/metatype/metatype.xml>
[INFO] Writing abstract service descriptor <https://builds.apache.org/job/stanbol-trunk-1.6/ws/trunk/cmsadapter/web/target/scr-plugin-generated/OSGI-INF/scr-plugin/scrinfo.xml>
with 1 entries.
[INFO] Generating 1 Service Component Descriptors to <https://builds.apache.org/job/stanbol-trunk-1.6/ws/trunk/cmsadapter/web/target/scr-plugin-generated/OSGI-INF/serviceComponents.xml>
[debug] execute contextualize
[INFO] [resources:testResources {execution: default-testResources}]
[INFO] Using 'UTF-8' encoding to copy filtered resources.
[INFO] skip non existing resourceDirectory <https://builds.apache.org/job/stanbol-trunk-1.6/ws/trunk/cmsadapter/web/src/test/resources>
[INFO] Copying 3 resources
[INFO] [compiler:testCompile {execution: default-testCompile}]
[INFO] No sources to compile
[INFO] [surefire:test {execution: default-test}]
[INFO] Surefire report directory: <https://builds.apache.org/job/stanbol-trunk-1.6/ws/trunk/cmsadapter/web/target/surefire-reports>

-------------------------------------------------------
 T E S T S
-------------------------------------------------------

Results :

Tests run: 0, Failures: 0, Errors: 0, Skipped: 0

[INFO] [bundle:bundle {execution: default-bundle}]
[INFO] Preparing source:jar
[WARNING] Removing: jar from forked lifecycle, to prevent recursive invocation.
[JENKINS] Archiving disabled - not archiving <https://builds.apache.org/job/stanbol-trunk-1.6/ws/trunk/cmsadapter/web/pom.xml[INFO]>
[enforcer:enforce {execution: enforce-java}]

[JENKINS] Archiving disabled - not archiving <https://builds.apache.org/job/stanbol-trunk-1.6/ws/trunk/cmsadapter/web/target/org.apache.stanbol.cmsadapter.web-0.10.0-SNAPSHOT.jar>
[JENKINS] Archiving disabled - not archiving <https://builds.apache.org/job/stanbol-trunk-1.6/ws/trunk/cmsadapter/web/pom.xml[INFO]>
[source:jar {execution: attach-sources}]
[INFO] org already added, skipping
[INFO] org/apache already added, skipping
[INFO] org/apache/stanbol already added, skipping
[INFO] org/apache/stanbol/cmsadapter already added, skipping
[INFO] org/apache/stanbol/cmsadapter/web already added, skipping
[INFO] META-INF already added, skipping
[INFO] META-INF/NOTICE already added, skipping
[INFO] META-INF/DEPENDENCIES already added, skipping
[INFO] META-INF/LICENSE already added, skipping
[INFO] Building jar: <https://builds.apache.org/job/stanbol-trunk-1.6/ws/trunk/cmsadapter/web/target/org.apache.stanbol.cmsadapter.web-0.10.0-SNAPSHOT-sources.jar>
[INFO] org already added, skipping
[INFO] org/apache already added, skipping
[INFO] org/apache/stanbol already added, skipping
[INFO] org/apache/stanbol/cmsadapter already added, skipping
[INFO] org/apache/stanbol/cmsadapter/web already added, skipping
[INFO] META-INF already added, skipping
[INFO] META-INF/NOTICE already added, skipping
[INFO] META-INF/DEPENDENCIES already added, skipping
[INFO] META-INF/LICENSE already added, skipping
[INFO] [install:install {execution: default-install}]
[INFO] Installing <https://builds.apache.org/job/stanbol-trunk-1.6/ws/trunk/cmsadapter/web/target/org.apache.stanbol.cmsadapter.web-0.10.0-SNAPSHOT.jar>
to /home/jenkins/jenkins-slave/maven-repositories/0/org/apache/stanbol/org.apache.stanbol.cmsadapter.web/0.10.0-SNAPSHOT/org.apache.stanbol.cmsadapter.web-0.10.0-SNAPSHOT.jar
[INFO] Installing <https://builds.apache.org/job/stanbol-trunk-1.6/ws/trunk/cmsadapter/web/target/org.apache.stanbol.cmsadapter.web-0.10.0-SNAPSHOT-sources.jar>
to /home/jenkins/jenkins-slave/maven-repositories/0/org/apache/stanbol/org.apache.stanbol.cmsadapter.web/0.10.0-SNAPSHOT/org.apache.stanbol.cmsadapter.web-0.10.0-SNAPSHOT-sources.jar
[INFO] [bundle:install {execution: default-install}]
[INFO] Installing org/apache/stanbol/org.apache.stanbol.cmsadapter.web/0.10.0-SNAPSHOT/org.apache.stanbol.cmsadapter.web-0.10.0-SNAPSHOT.jar
[INFO] Writing OBR metadata

[JENKINS] Archiving disabled - not archiving <https://builds.apache.org/job/stanbol-trunk-1.6/ws/trunk/cmsadapter/web/target/org.apache.stanbol.cmsadapter.web-0.10.0-SNAPSHOT.jar>
[JENKINS] Archiving disabled - not archiving <https://builds.apache.org/job/stanbol-trunk-1.6/ws/trunk/cmsadapter/web/target/org.apache.stanbol.cmsadapter.web-0.10.0-SNAPSHOT-sources.jar>
[INFO] ------------------------------------------------------------------------
[INFO] Building Apache Stanbol CMS Adapter Bundle List
[INFO]    task-segment: [clean, install]
[INFO] ------------------------------------------------------------------------
[JENKINS] Archiving disabled - not archiving <https://builds.apache.org/job/stanbol-trunk-1.6/ws/trunk/cmsadapter/bundlelist/pom.xml>
[INFO] [clean:clean {execution: default-clean}]
[INFO] Deleting <https://builds.apache.org/job/stanbol-trunk-1.6/ws/trunk/cmsadapter/bundlelist/target>
[INFO] [enforcer:enforce {execution: enforce-java}]
[INFO] [remote-resources:process {execution: default}]
[INFO] [launchpad:attach-partial-bundle-list {execution: default-attach-partial-bundle-list}]
[INFO] Attaching bundle list configuration
[INFO] Preparing source:jar
[WARNING] Removing: jar from forked lifecycle, to prevent recursive invocation.
[JENKINS] Archiving disabled - not archiving <https://builds.apache.org/job/stanbol-trunk-1.6/ws/trunk/cmsadapter/bundlelist/src/main/bundles/list.xml>
[JENKINS] Archiving disabled - not archiving <https://builds.apache.org/job/stanbol-trunk-1.6/ws/trunk/cmsadapter/bundlelist/pom.xml>
[INFO] [enforcer:enforce {execution: enforce-java}]
[JENKINS] Archiving disabled - not archiving <https://builds.apache.org/job/stanbol-trunk-1.6/ws/trunk/cmsadapter/bundlelist/src/main/bundles/list.xml>
Sending e-mails to: dev@stanbol.apache.org rupert.westenthaler@gmail.com
[locks-and-latches] Releasing all the locks
[locks-and-latches] All the locks released
ERROR: Failed to parse POMs
hudson.remoting.ChannelClosedException: channel is already closed
	at hudson.remoting.Channel.send(Channel.java:493)
	at hudson.remoting.Request.call(Request.java:129)
	at hudson.remoting.Channel.call(Channel.java:664)
	at hudson.remoting.RemoteInvocationHandler.invoke(RemoteInvocationHandler.java:158)
	at $Proxy38.isAlive(Unknown Source)
	at hudson.Launcher$RemoteLauncher$ProcImpl.isAlive(Launcher.java:866)
	at hudson.maven.ProcessCache$MavenProcess.call(ProcessCache.java:161)
	at hudson.maven.MavenModuleSetBuild$MavenModuleSetBuildExecution.doRun(MavenModuleSetBuild.java:791)
	at hudson.model.AbstractBuild$AbstractBuildExecution.run(AbstractBuild.java:499)
	at hudson.model.Run.execute(Run.java:1502)
	at hudson.maven.MavenModuleSetBuild.run(MavenModuleSetBuild.java:477)
	at hudson.model.ResourceController.execute(ResourceController.java:88)
	at hudson.model.Executor.run(Executor.java:236)
Caused by: java.io.IOException: Unexpected termination of the channel
	at hudson.remoting.SynchronousCommandTransport$ReaderThread.run(SynchronousCommandTransport.java:50)
Caused by: java.io.EOFException
	at java.io.ObjectInputStream$BlockDataInputStream.peekByte(ObjectInputStream.java:2571)
	at java.io.ObjectInputStream.readObject0(ObjectInputStream.java:1315)
	at java.io.ObjectInputStream.readObject(ObjectInputStream.java:369)
	at hudson.remoting.Command.readFrom(Command.java:90)
	at hudson.remoting.ClassicCommandTransport.read(ClassicCommandTransport.java:59)
	at hudson.remoting.SynchronousCommandTransport$ReaderThread.run(SynchronousCommandTransport.java:48)
FATAL: channel is already closed
hudson.remoting.ChannelClosedException: channel is already closed
	at hudson.remoting.Channel.send(Channel.java:493)
	at hudson.remoting.Request.call(Request.java:129)
	at hudson.remoting.Channel.call(Channel.java:664)
	at hudson.Launcher$RemoteLauncher.kill(Launcher.java:823)
	at hudson.model.AbstractBuild$AbstractBuildExecution.run(AbstractBuild.java:522)
	at hudson.model.Run.execute(Run.java:1502)
	at hudson.maven.MavenModuleSetBuild.run(MavenModuleSetBuild.java:477)
	at hudson.model.ResourceController.execute(ResourceController.java:88)
	at hudson.model.Executor.run(Executor.java:236)
Caused by: java.io.IOException: Unexpected termination of the channel
	at hudson.remoting.SynchronousCommandTransport$ReaderThread.run(SynchronousCommandTransport.java:50)
Caused by: java.io.EOFException
	at java.io.ObjectInputStream$BlockDataInputStream.peekByte(ObjectInputStream.java:2571)
	at java.io.ObjectInputStream.readObject0(ObjectInputStream.java:1315)
	at java.io.ObjectInputStream.readObject(ObjectInputStream.java:369)
	at hudson.remoting.Command.readFrom(Command.java:90)
	at hudson.remoting.ClassicCommandTransport.read(ClassicCommandTransport.java:59)
	at hudson.remoting.SynchronousCommandTransport$ReaderThread.run(SynchronousCommandTransport.java:48)

Mime
View raw message