stanbol-dev mailing list archives

Site index · List index
Message view « Date » · « Thread »
Top « Date » · « Thread »
From Apache Jenkins Server <jenk...@builds.apache.org>
Subject Build failed in Jenkins: stanbol-trunk-1.6 #790
Date Tue, 06 Mar 2012 16:04:34 GMT
See <https://builds.apache.org/job/stanbol-trunk-1.6/790/changes>

Changes:

[fchrist] STANBOL-272 STANBOL-493 Fixed Reasoners POMs which contained dependencies not defined
in parent POM, obsolete dedendencies, missing license information in THIRD-PARTY.properties
files, missing RAT excludes and README plus corresponding NOTICE and LICENSE files

------------------------------------------
Started by an SCM change
Building remotely on ubuntu5 in workspace <https://builds.apache.org/job/stanbol-trunk-1.6/ws/>
Updating http://svn.apache.org/repos/asf/incubator/stanbol/trunk
U         reasoners/owllink/src/license/THIRD-PARTY.properties
A         reasoners/owllink/src/main/appended-resources
A         reasoners/owllink/src/main/appended-resources/META-INF
A         reasoners/owllink/src/main/appended-resources/META-INF/NOTICE
A         reasoners/owllink/src/main/resources/maven/repo/README.txt
D         reasoners/owllink/src/main/resources/maven/repo/owl-link/owl-link/1.0.2
U         reasoners/owllink/pom.xml
U         reasoners/test/src/license/THIRD-PARTY.properties
U         reasoners/test/pom.xml
U         reasoners/manager/src/license/THIRD-PARTY.properties
U         reasoners/manager/pom.xml
U         reasoners/pom.xml
U         reasoners/owlapi/pom.xml
A         reasoners/jena/src/test/resources/README
U         reasoners/jena/src/license/THIRD-PARTY.properties
A         reasoners/jena/src/main/appended-resources
A         reasoners/jena/src/main/appended-resources/META-INF
A         reasoners/jena/src/main/appended-resources/META-INF/NOTICE
A         reasoners/jena/src/main/appended-resources/META-INF/LICENSE
U         reasoners/jena/pom.xml
U         reasoners/servicesapi/src/license/THIRD-PARTY.properties
U         reasoners/servicesapi/pom.xml
A         reasoners/web/src/main/appended-resources
A         reasoners/web/src/main/appended-resources/META-INF
A         reasoners/web/src/main/appended-resources/META-INF/NOTICE
A         reasoners/web/src/main/appended-resources/META-INF/LICENSE
U         reasoners/web/pom.xml
U         contenthub/web/pom.xml
At revision 1297543
[locks-and-latches] Checking to see if we really have the locks
[locks-and-latches] Have all the locks, build can start
Parsing POMs
[locks-and-latches] Releasing all the locks
[locks-and-latches] All the locks released
ERROR: Failed to parse POMs
hudson.util.IOException2: remote file operation failed: <https://builds.apache.org/job/stanbol-trunk-1.6/ws/trunk>
at hudson.remoting.Channel@4fd38e73:ubuntu5
	at hudson.FilePath.act(FilePath.java:784)
	at hudson.FilePath.act(FilePath.java:770)
	at hudson.maven.MavenModuleSetBuild$RunnerImpl.parsePoms(MavenModuleSetBuild.java:914)
	at hudson.maven.MavenModuleSetBuild$RunnerImpl.doRun(MavenModuleSetBuild.java:658)
	at hudson.model.AbstractBuild$AbstractRunner.run(AbstractBuild.java:473)
	at hudson.model.Run.run(Run.java:1408)
	at hudson.maven.MavenModuleSetBuild.run(MavenModuleSetBuild.java:481)
	at hudson.model.ResourceController.execute(ResourceController.java:88)
	at hudson.model.Executor.run(Executor.java:238)
Caused by: hudson.remoting.ProxyException: hudson.maven.MavenModuleSetBuild$MavenExecutionException:
org.apache.maven.project.ProjectBuildingException: Some problems were encountered while processing
the POMs:
[ERROR] 'dependencies.dependency.version' for org.apache.james:apache-mime4j:jar is missing.
@ line 69, column 17
[ERROR] 'dependencies.dependency.version' for org.apache.httpcomponents:httpclient:jar is
missing. @ line 74, column 17
[ERROR] 'dependencies.dependency.version' for org.apache.httpcomponents:httpcore:jar is missing.
@ line 79, column 17

	at hudson.maven.MavenModuleSetBuild$PomParser.invoke(MavenModuleSetBuild.java:1274)
	at hudson.maven.MavenModuleSetBuild$PomParser.invoke(MavenModuleSetBuild.java:1049)
	at hudson.FilePath$FileCallableWrapper.call(FilePath.java:2099)
	at hudson.remoting.UserRequest.perform(UserRequest.java:118)
	at hudson.remoting.UserRequest.perform(UserRequest.java:48)
	at hudson.remoting.Request$2.run(Request.java:287)
	at hudson.remoting.InterceptingExecutorService$1.call(InterceptingExecutorService.java:72)
	at java.util.concurrent.FutureTask$Sync.innerRun(FutureTask.java:334)
	at java.util.concurrent.FutureTask.run(FutureTask.java:166)
	at java.util.concurrent.ThreadPoolExecutor.runWorker(ThreadPoolExecutor.java:1110)
	at java.util.concurrent.ThreadPoolExecutor$Worker.run(ThreadPoolExecutor.java:603)
	at java.lang.Thread.run(Thread.java:636)
Caused by: hudson.remoting.ProxyException: org.apache.maven.project.ProjectBuildingException:
Some problems were encountered while processing the POMs:
[ERROR] 'dependencies.dependency.version' for org.apache.james:apache-mime4j:jar is missing.
@ line 69, column 17
[ERROR] 'dependencies.dependency.version' for org.apache.httpcomponents:httpclient:jar is
missing. @ line 74, column 17
[ERROR] 'dependencies.dependency.version' for org.apache.httpcomponents:httpcore:jar is missing.
@ line 79, column 17

	at org.apache.maven.project.DefaultProjectBuilder.build(DefaultProjectBuilder.java:363)
	at hudson.maven.MavenEmbedder.buildProjects(MavenEmbedder.java:361)
	at hudson.maven.MavenEmbedder.readProjects(MavenEmbedder.java:331)
	at hudson.maven.MavenEmbedder.readProject(MavenEmbedder.java:322)
	at hudson.maven.MavenModuleSetBuild$PomParser.readChilds(MavenModuleSetBuild.java:1328)
	at hudson.maven.MavenModuleSetBuild$PomParser.readChilds(MavenModuleSetBuild.java:1331)
	at hudson.maven.MavenModuleSetBuild$PomParser.invoke(MavenModuleSetBuild.java:1235)
	... 11 more


Mime
View raw message