stanbol-dev mailing list archives

Site index · List index
Message view « Date » · « Thread »
Top « Date » · « Thread »
From Enrico Daga <enricod...@gmail.com>
Subject Problems compiling integration-tests
Date Thu, 09 Jun 2011 14:14:15 GMT
Hi all,
I'm trying to recompile the whole Stanbol from a clean maven
repository, but I get the following problem:

Results :

Failed tests:
  testDefaultConsolePaths(org.apache.stanbol.enhancer.it.OsgiConsoleTest)
  testDefaultConfig(org.apache.stanbol.enhancer.it.DefaultConfigTest)
  testBenchmark(org.apache.stanbol.enhancer.it.BenchmarkTest)
  testSimpleEnhancement(org.apache.stanbol.enhancer.it.StatelessEngineTest)
  testOutputFormats(org.apache.stanbol.enhancer.it.StatelessEngineTest)
  testInvalidFormat(org.apache.stanbol.enhancer.it.StatelessEngineTest)

Tests run: 7, Failures: 6, Errors: 0, Skipped: 0

[INFO] ------------------------------------------------------------------------
[ERROR] BUILD FAILURE
[INFO] ------------------------------------------------------------------------

I've seen reports, follows a snippet:

Tests run: 1, Failures: 1, Errors: 0, Skipped: 0, Time elapsed: 0.128
sec <<< FAILURE!
testDefaultConfig(org.apache.stanbol.enhancer.it.DefaultConfigTest)
Time elapsed: 0.126 sec  <<< FAILURE!
java.lang.AssertionError: Timeout in previous check of enhancement
engines, cannot run tests
        at org.junit.Assert.fail(Assert.java:91)
        at org.apache.stanbol.enhancer.it.EnhancerTestBase.checkEnginesReady(EnhancerTestBase.java:52)
        at sun.reflect.NativeMethodAccessorImpl.invoke0(Native Method)
        at sun.reflect.NativeMethodAccessorImpl.invoke(NativeMethodAccessorImpl.java:39)
    [...]

It looks a problem on the responsiveness of the web server used for tests.
I have tried three times but always happened.

hints?

Enrico

-- 
Enrico Daga

--
http://www.enridaga.net
skype: enri-pan

Mime
View raw message