stanbol-dev mailing list archives

Site index · List index
Message view « Date » · « Thread »
Top « Date » · « Thread »
From Apache Jenkins Server <jenk...@builds.apache.org>
Subject Build failed in Jenkins: stanbol-trunk-1.6 #221
Date Wed, 08 Jun 2011 08:44:53 GMT
See <https://builds.apache.org/job/stanbol-trunk-1.6/221/changes>

Changes:

[wkasper] Stanbol-213: Enable use of text extracts contained in metadata

[wkasper] Stanbol-210: Removed dependencies on LGPL libs
Replaced MP3 extractor based on jaudiotagger by one based on mp3agic (MIT license)
Updated extractorregistry

[wkasper] Stanbol-210: Remove dependencies on LGPL libs

------------------------------------------
[...truncated 12674 lines...]
[INFO] [bundle:bundle {execution: default-bundle}]
[INFO] Preparing source:jar
[WARNING] Removing: jar from forked lifecycle, to prevent recursive invocation.
[JENKINS] Archiving <https://builds.apache.org/job/stanbol-trunk-1.6/ws/trunk/enhancer/engines/opennlp-ner/pom.xml>
to /home/hudson/hudson/jobs/stanbol-trunk-1.6/modules/org.apache.stanbol$org.apache.stanbol.enhancer.engines.opennlp.ner/builds/2011-06-08_08-17-49/archive/org.apache.stanbol/org.apache.stanbol.enhancer.engines.opennlp.ner/0.9-SNAPSHOT/org.apache.stanbol.enhancer.engines.opennlp.ner-0.9-SNAPSHOT.pom
[JENKINS] Archiving <https://builds.apache.org/job/stanbol-trunk-1.6/ws/trunk/enhancer/engines/opennlp-ner/target/org.apache.stanbol.enhancer.engines.opennlp.ner-0.9-SNAPSHOT.jar>
to /home/hudson/hudson/jobs/stanbol-trunk-1.6/modules/org.apache.stanbol$org.apache.stanbol.enhancer.engines.opennlp.ner/builds/2011-06-08_08-17-49/archive/org.apache.stanbol/org.apache.stanbol.enhancer.engines.opennlp.ner/0.9-SNAPSHOT/org.apache.stanbol.enhancer.engines.opennlp.ner-0.9-SNAPSHOT.jar
[INFO] [enforcer:enforce {execution: enforce-java}]
[INFO] [source:jar {execution: attach-sources}]
[INFO] OSGI-INF already added, skipping
[INFO] OSGI-INF/metatype already added, skipping
[INFO] Building jar: <https://builds.apache.org/job/stanbol-trunk-1.6/ws/trunk/enhancer/engines/opennlp-ner/target/org.apache.stanbol.enhancer.engines.opennlp.ner-0.9-SNAPSHOT-sources.jar>
[INFO] OSGI-INF already added, skipping
[INFO] OSGI-INF/metatype already added, skipping
[INFO] [install:install {execution: default-install}]
[INFO] Installing <https://builds.apache.org/job/stanbol-trunk-1.6/ws/trunk/enhancer/engines/opennlp-ner/target/org.apache.stanbol.enhancer.engines.opennlp.ner-0.9-SNAPSHOT.jar>
to /home/hudson/.m2/repository/org/apache/stanbol/org.apache.stanbol.enhancer.engines.opennlp.ner/0.9-SNAPSHOT/org.apache.stanbol.enhancer.engines.opennlp.ner-0.9-SNAPSHOT.jar
[INFO] Installing <https://builds.apache.org/job/stanbol-trunk-1.6/ws/trunk/enhancer/engines/opennlp-ner/target/org.apache.stanbol.enhancer.engines.opennlp.ner-0.9-SNAPSHOT-sources.jar>
to /home/hudson/.m2/repository/org/apache/stanbol/org.apache.stanbol.enhancer.engines.opennlp.ner/0.9-SNAPSHOT/org.apache.stanbol.enhancer.engines.opennlp.ner-0.9-SNAPSHOT-sources.jar
[INFO] [bundle:install {execution: default-install}]
[INFO] Parsing file:/home/hudson/.m2/repository/repository.xml
[Fatal Error] repository.xml:3:1: Premature end of file.
org.xml.sax.SAXParseException: Premature end of file.
	at com.sun.org.apache.xerces.internal.parsers.DOMParser.parse(DOMParser.java:249)
	at com.sun.org.apache.xerces.internal.jaxp.DocumentBuilderImpl.parse(DocumentBuilderImpl.java:284)
	at javax.xml.parsers.DocumentBuilder.parse(DocumentBuilder.java:208)
	at org.apache.felix.obrplugin.ObrUpdate.parseFile(ObrUpdate.java:347)
	at org.apache.felix.obrplugin.ObrUpdate.parseRepositoryXml(ObrUpdate.java:324)
	at org.apache.felix.obrplugin.ObrInstall.execute(ObrInstall.java:140)
	at org.apache.maven.plugin.DefaultPluginManager.executeMojo(DefaultPluginManager.java:490)
	at hudson.maven.agent.PluginManagerInterceptor.executeMojo(PluginManagerInterceptor.java:182)
	at org.apache.maven.lifecycle.DefaultLifecycleExecutor.executeGoals(DefaultLifecycleExecutor.java:694)
	at org.apache.maven.lifecycle.DefaultLifecycleExecutor.executeGoalWithLifecycle(DefaultLifecycleExecutor.java:556)
	at org.apache.maven.lifecycle.DefaultLifecycleExecutor.executeGoal(DefaultLifecycleExecutor.java:535)
	at org.apache.maven.lifecycle.DefaultLifecycleExecutor.executeGoalAndHandleFailures(DefaultLifecycleExecutor.java:387)
	at org.apache.maven.lifecycle.DefaultLifecycleExecutor.executeTaskSegments(DefaultLifecycleExecutor.java:348)
	at org.apache.maven.lifecycle.DefaultLifecycleExecutor.execute(DefaultLifecycleExecutor.java:180)
	at org.apache.maven.lifecycle.LifecycleExecutorInterceptor.execute(LifecycleExecutorInterceptor.java:65)
	at org.apache.maven.DefaultMaven.doExecute(DefaultMaven.java:328)
	at org.apache.maven.DefaultMaven.execute(DefaultMaven.java:138)
	at org.apache.maven.cli.MavenCli.main(MavenCli.java:362)
	at sun.reflect.NativeMethodAccessorImpl.invoke0(Native Method)
	at sun.reflect.NativeMethodAccessorImpl.invoke(NativeMethodAccessorImpl.java:39)
	at sun.reflect.DelegatingMethodAccessorImpl.invoke(DelegatingMethodAccessorImpl.java:25)
	at java.lang.reflect.Method.invoke(Method.java:597)
	at org.codehaus.classworlds.Launcher.launchEnhanced(Launcher.java:315)
	at org.codehaus.classworlds.Launcher.launch(Launcher.java:255)
	at hudson.maven.agent.Main.launch(Main.java:185)
	at hudson.maven.MavenBuilder.call(MavenBuilder.java:164)
	at hudson.maven.MavenModuleSetBuild$Builder.call(MavenModuleSetBuild.java:987)
	at hudson.maven.MavenModuleSetBuild$Builder.call(MavenModuleSetBuild.java:918)
	at hudson.remoting.UserRequest.perform(UserRequest.java:118)
	at hudson.remoting.UserRequest.perform(UserRequest.java:48)
	at hudson.remoting.Request$2.run(Request.java:270)
	at java.util.concurrent.Executors$RunnableAdapter.call(Executors.java:441)
	at java.util.concurrent.FutureTask$Sync.innerRun(FutureTask.java:303)
	at java.util.concurrent.FutureTask.run(FutureTask.java:138)
	at java.util.concurrent.ThreadPoolExecutor$Worker.runTask(ThreadPoolExecutor.java:886)
	at java.util.concurrent.ThreadPoolExecutor$Worker.run(ThreadPoolExecutor.java:908)
	at java.lang.Thread.run(Thread.java:619)
[INFO] Writing OBR metadata
[JENKINS] Archiving <https://builds.apache.org/job/stanbol-trunk-1.6/ws/trunk/enhancer/engines/opennlp-ner/target/org.apache.stanbol.enhancer.engines.opennlp.ner-0.9-SNAPSHOT-sources.jar>
to /home/hudson/hudson/jobs/stanbol-trunk-1.6/modules/org.apache.stanbol$org.apache.stanbol.enhancer.engines.opennlp.ner/builds/2011-06-08_08-17-49/archive/org.apache.stanbol/org.apache.stanbol.enhancer.engines.opennlp.ner/0.9-SNAPSHOT/org.apache.stanbol.enhancer.engines.opennlp.ner-0.9-SNAPSHOT-sources.jar
[INFO] ------------------------------------------------------------------------
[INFO] Building Apache Stanbol Enhancer Enhancement Engine : Language Identifier
[INFO]    task-segment: [clean, install]
[INFO] ------------------------------------------------------------------------
[INFO] [clean:clean {execution: default-clean}]
[INFO] Deleting <https://builds.apache.org/job/stanbol-trunk-1.6/ws/trunk/enhancer/engines/langid/target>
[INFO] [enforcer:enforce {execution: enforce-java}]
[INFO] [resources:resources {execution: default-resources}]
[INFO] Using 'UTF-8' encoding to copy filtered resources.
[INFO] Copying 1 resource
[INFO] [compiler:compile {execution: default-compile}]
[INFO] Compiling 1 source file to <https://builds.apache.org/job/stanbol-trunk-1.6/ws/trunk/enhancer/engines/langid/target/classes>
[INFO] [scr:scr {execution: generate-scr-scrdescriptor}]
[INFO] Generating 2 MetaType Descriptors to <https://builds.apache.org/job/stanbol-trunk-1.6/ws/trunk/enhancer/engines/langid/target/scr-plugin-generated/OSGI-INF/metatype/metatype.xml>
[INFO] Writing abstract service descriptor <https://builds.apache.org/job/stanbol-trunk-1.6/ws/trunk/enhancer/engines/langid/target/scr-plugin-generated/OSGI-INF/scr-plugin/scrinfo.xml>
with 1 entries.
[INFO] Generating 1 Service Component Descriptors to <https://builds.apache.org/job/stanbol-trunk-1.6/ws/trunk/enhancer/engines/langid/target/scr-plugin-generated/OSGI-INF/serviceComponents.xml>
[INFO] [resources:testResources {execution: default-testResources}]
[INFO] Using 'UTF-8' encoding to copy filtered resources.
[INFO] Copying 1 resource
[INFO] [compiler:testCompile {execution: default-testCompile}]
[INFO] Compiling 1 source file to <https://builds.apache.org/job/stanbol-trunk-1.6/ws/trunk/enhancer/engines/langid/target/test-classes>
[INFO] [surefire:test {execution: default-test}]
[INFO] Surefire report directory: <https://builds.apache.org/job/stanbol-trunk-1.6/ws/trunk/enhancer/engines/langid/target/surefire-reports>

-------------------------------------------------------
 T E S T S
-------------------------------------------------------
Running org.apache.stanbol.enhancer.engines.langid.core.TextCatTest
Tests run: 1, Failures: 0, Errors: 0, Skipped: 0, Time elapsed: 1.193 sec

Results :

Tests run: 1, Failures: 0, Errors: 0, Skipped: 0

[JENKINS] Recording test results
[INFO] [bundle:bundle {execution: default-bundle}]
[INFO] Preparing source:jar
[WARNING] Removing: jar from forked lifecycle, to prevent recursive invocation.
[JENKINS] Archiving <https://builds.apache.org/job/stanbol-trunk-1.6/ws/trunk/enhancer/engines/langid/pom.xml>
to /home/hudson/hudson/jobs/stanbol-trunk-1.6/modules/org.apache.stanbol$org.apache.stanbol.enhancer.engines.langid/builds/2011-06-08_08-17-49/archive/org.apache.stanbol/org.apache.stanbol.enhancer.engines.langid/0.9-SNAPSHOT/org.apache.stanbol.enhancer.engines.langid-0.9-SNAPSHOT.pom
[JENKINS] Archiving <https://builds.apache.org/job/stanbol-trunk-1.6/ws/trunk/enhancer/engines/langid/target/org.apache.stanbol.enhancer.engines.langid-0.9-SNAPSHOT.jar>
to /home/hudson/hudson/jobs/stanbol-trunk-1.6/modules/org.apache.stanbol$org.apache.stanbol.enhancer.engines.langid/builds/2011-06-08_08-17-49/archive/org.apache.stanbol/org.apache.stanbol.enhancer.engines.langid/0.9-SNAPSHOT/org.apache.stanbol.enhancer.engines.langid-0.9-SNAPSHOT.jar
[INFO] [enforcer:enforce {execution: enforce-java}]
[INFO] [source:jar {execution: attach-sources}]
[INFO] Building jar: <https://builds.apache.org/job/stanbol-trunk-1.6/ws/trunk/enhancer/engines/langid/target/org.apache.stanbol.enhancer.engines.langid-0.9-SNAPSHOT-sources.jar>
[INFO] [install:install {execution: default-install}]
[INFO] Installing <https://builds.apache.org/job/stanbol-trunk-1.6/ws/trunk/enhancer/engines/langid/target/org.apache.stanbol.enhancer.engines.langid-0.9-SNAPSHOT.jar>
to /home/hudson/.m2/repository/org/apache/stanbol/org.apache.stanbol.enhancer.engines.langid/0.9-SNAPSHOT/org.apache.stanbol.enhancer.engines.langid-0.9-SNAPSHOT.jar
[INFO] Installing <https://builds.apache.org/job/stanbol-trunk-1.6/ws/trunk/enhancer/engines/langid/target/org.apache.stanbol.enhancer.engines.langid-0.9-SNAPSHOT-sources.jar>
to /home/hudson/.m2/repository/org/apache/stanbol/org.apache.stanbol.enhancer.engines.langid/0.9-SNAPSHOT/org.apache.stanbol.enhancer.engines.langid-0.9-SNAPSHOT-sources.jar
[INFO] [bundle:install {execution: default-install}]
[INFO] Parsing file:/home/hudson/.m2/repository/repository.xml
[Fatal Error] repository.xml:3:1: Premature end of file.
org.xml.sax.SAXParseException: Premature end of file.
	at com.sun.org.apache.xerces.internal.parsers.DOMParser.parse(DOMParser.java:249)
	at com.sun.org.apache.xerces.internal.jaxp.DocumentBuilderImpl.parse(DocumentBuilderImpl.java:284)
	at javax.xml.parsers.DocumentBuilder.parse(DocumentBuilder.java:208)
	at org.apache.felix.obrplugin.ObrUpdate.parseFile(ObrUpdate.java:347)
	at org.apache.felix.obrplugin.ObrUpdate.parseRepositoryXml(ObrUpdate.java:324)
	at org.apache.felix.obrplugin.ObrInstall.execute(ObrInstall.java:140)
	at org.apache.maven.plugin.DefaultPluginManager.executeMojo(DefaultPluginManager.java:490)
	at hudson.maven.agent.PluginManagerInterceptor.executeMojo(PluginManagerInterceptor.java:182)
	at org.apache.maven.lifecycle.DefaultLifecycleExecutor.executeGoals(DefaultLifecycleExecutor.java:694)
	at org.apache.maven.lifecycle.DefaultLifecycleExecutor.executeGoalWithLifecycle(DefaultLifecycleExecutor.java:556)
	at org.apache.maven.lifecycle.DefaultLifecycleExecutor.executeGoal(DefaultLifecycleExecutor.java:535)
	at org.apache.maven.lifecycle.DefaultLifecycleExecutor.executeGoalAndHandleFailures(DefaultLifecycleExecutor.java:387)
	at org.apache.maven.lifecycle.DefaultLifecycleExecutor.executeTaskSegments(DefaultLifecycleExecutor.java:348)
	at org.apache.maven.lifecycle.DefaultLifecycleExecutor.execute(DefaultLifecycleExecutor.java:180)
	at org.apache.maven.lifecycle.LifecycleExecutorInterceptor.execute(LifecycleExecutorInterceptor.java:65)
	at org.apache.maven.DefaultMaven.doExecute(DefaultMaven.java:328)
	at org.apache.maven.DefaultMaven.execute(DefaultMaven.java:138)
	at org.apache.maven.cli.MavenCli.main(MavenCli.java:362)
	at sun.reflect.NativeMethodAccessorImpl.invoke0(Native Method)
	at sun.reflect.NativeMethodAccessorImpl.invoke(NativeMethodAccessorImpl.java:39)
	at sun.reflect.DelegatingMethodAccessorImpl.invoke(DelegatingMethodAccessorImpl.java:25)
	at java.lang.reflect.Method.invoke(Method.java:597)
	at org.codehaus.classworlds.Launcher.launchEnhanced(Launcher.java:315)
	at org.codehaus.classworlds.Launcher.launch(Launcher.java:255)
	at hudson.maven.agent.Main.launch(Main.java:185)
	at hudson.maven.MavenBuilder.call(MavenBuilder.java:164)
	at hudson.maven.MavenModuleSetBuild$Builder.call(MavenModuleSetBuild.java:987)
	at hudson.maven.MavenModuleSetBuild$Builder.call(MavenModuleSetBuild.java:918)
	at hudson.remoting.UserRequest.perform(UserRequest.java:118)
	at hudson.remoting.UserRequest.perform(UserRequest.java:48)
	at hudson.remoting.Request$2.run(Request.java:270)
	at java.util.concurrent.Executors$RunnableAdapter.call(Executors.java:441)
	at java.util.concurrent.FutureTask$Sync.innerRun(FutureTask.java:303)
	at java.util.concurrent.FutureTask.run(FutureTask.java:138)
	at java.util.concurrent.ThreadPoolExecutor$Worker.runTask(ThreadPoolExecutor.java:886)
	at java.util.concurrent.ThreadPoolExecutor$Worker.run(ThreadPoolExecutor.java:908)
	at java.lang.Thread.run(Thread.java:619)
[INFO] Writing OBR metadata
[JENKINS] Archiving <https://builds.apache.org/job/stanbol-trunk-1.6/ws/trunk/enhancer/engines/langid/target/org.apache.stanbol.enhancer.engines.langid-0.9-SNAPSHOT-sources.jar>
to /home/hudson/hudson/jobs/stanbol-trunk-1.6/modules/org.apache.stanbol$org.apache.stanbol.enhancer.engines.langid/builds/2011-06-08_08-17-49/archive/org.apache.stanbol/org.apache.stanbol.enhancer.engines.langid/0.9-SNAPSHOT/org.apache.stanbol.enhancer.engines.langid-0.9-SNAPSHOT-sources.jar
[INFO] ------------------------------------------------------------------------
[INFO] Building Apache Stanbol Enhancer Enhancement Engine : Metaxa Metadata and Text Extractor
[INFO]    task-segment: [clean, install]
[INFO] ------------------------------------------------------------------------
[INFO] [clean:clean {execution: default-clean}]
[INFO] Deleting <https://builds.apache.org/job/stanbol-trunk-1.6/ws/trunk/enhancer/engines/metaxa/target>
[INFO] snapshot net.modularity:modularity-parent:1.0.7-SNAPSHOT: checking for updates from
modularity-snapshots
[INFO] snapshot net.modularity:modularity-parent:1.0.7-SNAPSHOT: checking for updates from
apache
[INFO] snapshot net.modularity:modularity-parent:1.0.7-SNAPSHOT: checking for updates from
java.net
[INFO] snapshot net.modularity:modularity-parent:1.0.7-SNAPSHOT: checking for updates from
repository-codehaus
[INFO] snapshot net.modularity:modularity-parent:1.0.7-SNAPSHOT: checking for updates from
nuxeo-vendor-release
[INFO] snapshot net.modularity:modularity-parent:1.0.7-SNAPSHOT: checking for updates from
clojars.org
[INFO] snapshot net.modularity:modularity-parent:1.0.7-SNAPSHOT: checking for updates from
aduna-opensource.snapshots
[INFO] snapshot net.modularity:modularity-parent:1.0.7-SNAPSHOT: checking for updates from
semweb4j.snapshots
Downloading: http://m2.modularity.net.au/snapshots/net/modularity/modularity-parent/1.0.7-SNAPSHOT/modularity-parent-1.0.7-SNAPSHOT.pom
Downloading: http://repo.aduna-software.org/maven2/releases/mp3agic/mp3agic/0.6/mp3agic-0.6.pom
[INFO] Unable to find resource 'mp3agic:mp3agic:pom:0.6' in repository aduna-opensource.releases
(http://repo.aduna-software.org/maven2/releases)
Downloading: http://aperture.sourceforge.net/maven//mp3agic/mp3agic/0.6/mp3agic-0.6.pom
[INFO] Unable to find resource 'mp3agic:mp3agic:pom:0.6' in repository aperture-repo (http://aperture.sourceforge.net/maven/)
Downloading: http://www.dfki.de/~kasper/IKS/maven/mp3agic/mp3agic/0.6/mp3agic-0.6.pom
[WARNING] Unable to get resource 'mp3agic:mp3agic:pom:0.6' from repository dfki-lt-repo (http://www.dfki.de/~kasper/IKS/maven):
Authorization failed: Access denied to: http://www.dfki.de/~kasper/IKS/maven/mp3agic/mp3agic/0.6/mp3agic-0.6.pom
Downloading: http://repository.apache.org/snapshots//mp3agic/mp3agic/0.6/mp3agic-0.6.pom
[INFO] Unable to find resource 'mp3agic:mp3agic:pom:0.6' in repository apache (http://repository.apache.org/snapshots/)
Downloading: http://download.java.net/maven/2/mp3agic/mp3agic/0.6/mp3agic-0.6.pom
[INFO] Unable to find resource 'mp3agic:mp3agic:pom:0.6' in repository java.net (http://download.java.net/maven/2)
Downloading: http://repository.codehaus.org/mp3agic/mp3agic/0.6/mp3agic-0.6.pom
[INFO] Unable to find resource 'mp3agic:mp3agic:pom:0.6' in repository repository-codehaus
(http://repository.codehaus.org)
Downloading: https://maven.nuxeo.org/nexus/content/repositories/vendor-releases/mp3agic/mp3agic/0.6/mp3agic-0.6.pom
[INFO] Unable to find resource 'mp3agic:mp3agic:pom:0.6' in repository nuxeo-vendor-release
(https://maven.nuxeo.org/nexus/content/repositories/vendor-releases)
Downloading: http://clojars.org/repo/mp3agic/mp3agic/0.6/mp3agic-0.6.pom
[INFO] Unable to find resource 'mp3agic:mp3agic:pom:0.6' in repository clojars.org (http://clojars.org/repo)
Downloading: http://repo1.maven.org/maven2/mp3agic/mp3agic/0.6/mp3agic-0.6.pom
[INFO] Unable to find resource 'mp3agic:mp3agic:pom:0.6' in repository central (http://repo1.maven.org/maven2)
Downloading: http://repo.aduna-software.org/maven2/releases/mp3agic/mp3agic/0.6/mp3agic-0.6.jar
[INFO] Unable to find resource 'mp3agic:mp3agic:jar:0.6' in repository aduna-opensource.releases
(http://repo.aduna-software.org/maven2/releases)
Downloading: http://aperture.sourceforge.net/maven//mp3agic/mp3agic/0.6/mp3agic-0.6.jar
[INFO] Unable to find resource 'mp3agic:mp3agic:jar:0.6' in repository aperture-repo (http://aperture.sourceforge.net/maven/)
Downloading: http://www.dfki.de/~kasper/IKS/maven/mp3agic/mp3agic/0.6/mp3agic-0.6.jar
[WARNING] Unable to get resource 'mp3agic:mp3agic:jar:0.6' from repository dfki-lt-repo (http://www.dfki.de/~kasper/IKS/maven):
Authorization failed: Access denied to: http://www.dfki.de/~kasper/IKS/maven/mp3agic/mp3agic/0.6/mp3agic-0.6.jar
Downloading: http://repository.apache.org/snapshots//mp3agic/mp3agic/0.6/mp3agic-0.6.jar
[INFO] Unable to find resource 'mp3agic:mp3agic:jar:0.6' in repository apache (http://repository.apache.org/snapshots/)
Downloading: http://download.java.net/maven/2/mp3agic/mp3agic/0.6/mp3agic-0.6.jar
[INFO] Unable to find resource 'mp3agic:mp3agic:jar:0.6' in repository java.net (http://download.java.net/maven/2)
Downloading: http://repository.codehaus.org/mp3agic/mp3agic/0.6/mp3agic-0.6.jar
[INFO] Unable to find resource 'mp3agic:mp3agic:jar:0.6' in repository repository-codehaus
(http://repository.codehaus.org)
Downloading: https://maven.nuxeo.org/nexus/content/repositories/vendor-releases/mp3agic/mp3agic/0.6/mp3agic-0.6.jar
[INFO] Unable to find resource 'mp3agic:mp3agic:jar:0.6' in repository nuxeo-vendor-release
(https://maven.nuxeo.org/nexus/content/repositories/vendor-releases)
Downloading: http://clojars.org/repo/mp3agic/mp3agic/0.6/mp3agic-0.6.jar
[INFO] Unable to find resource 'mp3agic:mp3agic:jar:0.6' in repository clojars.org (http://clojars.org/repo)
Downloading: http://repo1.maven.org/maven2/mp3agic/mp3agic/0.6/mp3agic-0.6.jar
[INFO] Unable to find resource 'mp3agic:mp3agic:jar:0.6' in repository central (http://repo1.maven.org/maven2)
[JENKINS] Archiving <https://builds.apache.org/job/stanbol-trunk-1.6/ws/trunk/enhancer/engines/metaxa/pom.xml>
to /home/hudson/hudson/jobs/stanbol-trunk-1.6/modules/org.apache.stanbol$org.apache.stanbol.enhancer.engines.metaxa/builds/2011-06-08_08-17-49/archive/org.apache.stanbol/org.apache.stanbol.enhancer.engines.metaxa/0.9-SNAPSHOT/org.apache.stanbol.enhancer.engines.metaxa-0.9-SNAPSHOT.pom
[INFO] ------------------------------------------------------------------------
[ERROR] BUILD ERROR
[INFO] ------------------------------------------------------------------------
[INFO] Failed to resolve artifact.

Missing:
----------
1) mp3agic:mp3agic:jar:0.6

  Try downloading the file manually from the project website.

  Then, install it using the command: 
      mvn install:install-file -DgroupId=mp3agic -DartifactId=mp3agic -Dversion=0.6 -Dpackaging=jar
-Dfile=/path/to/file

  Alternatively, if you host your own repository you can deploy the file there: 
      mvn deploy:deploy-file -DgroupId=mp3agic -DartifactId=mp3agic -Dversion=0.6 -Dpackaging=jar
-Dfile=/path/to/file -Durl=[url] -DrepositoryId=[id]

  Path to dependency: 
  	1) org.apache.stanbol:org.apache.stanbol.enhancer.engines.metaxa:bundle:0.9-SNAPSHOT
  	2) mp3agic:mp3agic:jar:0.6

----------
1 required artifact is missing.

for artifact: 
  org.apache.stanbol:org.apache.stanbol.enhancer.engines.metaxa:bundle:0.9-SNAPSHOT

from the specified remote repositories:
  dfki-lt-repo (http://www.dfki.de/~kasper/IKS/maven),
  aperture-repo (http://aperture.sourceforge.net/maven/),
  central (http://repo1.maven.org/maven2),
  java.net (http://download.java.net/maven/2),
  clojars.org (http://clojars.org/repo),
  aduna-opensource.releases (http://repo.aduna-software.org/maven2/releases),
  nuxeo-vendor-release (https://maven.nuxeo.org/nexus/content/repositories/vendor-releases),
  apache (http://repository.apache.org/snapshots/),
  repository-codehaus (http://repository.codehaus.org)



[INFO] ------------------------------------------------------------------------
[INFO] For more information, run Maven with the -e switch
[INFO] ------------------------------------------------------------------------
[INFO] Total time: 25 minutes 54 seconds
[INFO] Finished at: Wed Jun 08 08:44:50 UTC 2011
[INFO] Final Memory: 144M/342M
[INFO] ------------------------------------------------------------------------
channel stopped
[locks-and-latches] Releasing all the locks
[locks-and-latches] All the locks released


Mime
View raw message