solr-builds mailing list archives

Site index · List index
Message view « Date » · « Thread »
Top « Date » · « Thread »
From Apache Jenkins Server <jenk...@builds.apache.org>
Subject [JENKINS] Solr » Solr-Check-cloud2refimpl - Build # 2054 - Still Failing!
Date Sat, 08 May 2021 23:15:12 GMT
Build: https://ci-builds.apache.org/job/Solr/job/Solr-Check-cloud2refimpl/2054/

3 tests failed.
FAILED:  org.apache.solr.search.TestStressUserVersions.classMethod

Error Message:
com.carrotsearch.randomizedtesting.ThreadLeakError: 1 thread leaked from SUITE scope at org.apache.solr.search.TestStressUserVersions: 
   1) Thread[id=9364, name=testExecutor-TGRP-TestStressUserVersions-8207, state=RUNNABLE, group=TGRP-TestStressUserVersions]
        at java.base@11.0.9/jdk.internal.misc.Unsafe.unpark(Native Method)
        at java.base@11.0.9/java.util.concurrent.locks.LockSupport.unpark(LockSupport.java:160)
        at java.base@11.0.9/java.util.concurrent.locks.AbstractQueuedSynchronizer.unparkSuccessor(AbstractQueuedSynchronizer.java:709)
        at java.base@11.0.9/java.util.concurrent.locks.AbstractQueuedSynchronizer.release(AbstractQueuedSynchronizer.java:1305)
        at java.base@11.0.9/java.util.concurrent.locks.ReentrantLock.unlock(ReentrantLock.java:439)
        at java.base@11.0.9/java.util.concurrent.ThreadPoolExecutor.tryTerminate(ThreadPoolExecutor.java:726)
        at java.base@11.0.9/java.util.concurrent.ThreadPoolExecutor.processWorkerExit(ThreadPoolExecutor.java:994)
        at java.base@11.0.9/java.util.concurrent.ThreadPoolExecutor.runWorker(ThreadPoolExecutor.java:1142)
        at java.base@11.0.9/java.util.concurrent.ThreadPoolExecutor$Worker.run(ThreadPoolExecutor.java:628)
        at app//org.apache.solr.common.ParWorkExecutor$ParWorkThreadFactory$1.run(ParWorkExecutor.java:117)

Stack Trace:
com.carrotsearch.randomizedtesting.ThreadLeakError: 1 thread leaked from SUITE scope at org.apache.solr.search.TestStressUserVersions: 
   1) Thread[id=9364, name=testExecutor-TGRP-TestStressUserVersions-8207, state=RUNNABLE, group=TGRP-TestStressUserVersions]
        at java.base@11.0.9/jdk.internal.misc.Unsafe.unpark(Native Method)
        at java.base@11.0.9/java.util.concurrent.locks.LockSupport.unpark(LockSupport.java:160)
        at java.base@11.0.9/java.util.concurrent.locks.AbstractQueuedSynchronizer.unparkSuccessor(AbstractQueuedSynchronizer.java:709)
        at java.base@11.0.9/java.util.concurrent.locks.AbstractQueuedSynchronizer.release(AbstractQueuedSynchronizer.java:1305)
        at java.base@11.0.9/java.util.concurrent.locks.ReentrantLock.unlock(ReentrantLock.java:439)
        at java.base@11.0.9/java.util.concurrent.ThreadPoolExecutor.tryTerminate(ThreadPoolExecutor.java:726)
        at java.base@11.0.9/java.util.concurrent.ThreadPoolExecutor.processWorkerExit(ThreadPoolExecutor.java:994)
        at java.base@11.0.9/java.util.concurrent.ThreadPoolExecutor.runWorker(ThreadPoolExecutor.java:1142)
        at java.base@11.0.9/java.util.concurrent.ThreadPoolExecutor$Worker.run(ThreadPoolExecutor.java:628)
        at app//org.apache.solr.common.ParWorkExecutor$ParWorkThreadFactory$1.run(ParWorkExecutor.java:117)
	at __randomizedtesting.SeedInfo.seed([E137CE8890D84FFE]:0)


FAILED:  org.apache.solr.client.solrj.impl.CloudHttp2SolrClientTest.testVersionsAreReturned

Error Message:
java.lang.AssertionError: Version on add must match _version_ field expected:<0> but was:<1699233688358748160>

Stack Trace:
java.lang.AssertionError: Version on add must match _version_ field expected:<0> but was:<1699233688358748160>
	at __randomizedtesting.SeedInfo.seed([E137CE8890D84FFE:19F137BD03C1D736]:0)
	at org.junit.Assert.fail(Assert.java:89)
	at org.junit.Assert.failNotEquals(Assert.java:835)
	at org.junit.Assert.assertEquals(Assert.java:120)
	at org.apache.solr.client.solrj.impl.CloudHttp2SolrClientTest.testVersionsAreReturned(CloudHttp2SolrClientTest.java:823)
	at java.base/jdk.internal.reflect.NativeMethodAccessorImpl.invoke0(Native Method)
	at java.base/jdk.internal.reflect.NativeMethodAccessorImpl.invoke(NativeMethodAccessorImpl.java:62)
	at java.base/jdk.internal.reflect.DelegatingMethodAccessorImpl.invoke(DelegatingMethodAccessorImpl.java:43)
	at java.base/java.lang.reflect.Method.invoke(Method.java:566)
	at com.carrotsearch.randomizedtesting.RandomizedRunner.invoke(RandomizedRunner.java:1754)
	at com.carrotsearch.randomizedtesting.RandomizedRunner$8.evaluate(RandomizedRunner.java:942)
	at com.carrotsearch.randomizedtesting.RandomizedRunner$9.evaluate(RandomizedRunner.java:978)
	at com.carrotsearch.randomizedtesting.RandomizedRunner$10.evaluate(RandomizedRunner.java:992)
	at org.junit.rules.ExpectedException$ExpectedExceptionStatement.evaluate(ExpectedException.java:258)
	at org.apache.solr.SolrTestCase$TestRuleSetupTeardownChained$1.evaluate(SolrTestCase.java:918)
	at org.apache.solr.SolrTestCase$TestRuleThreadAndTestName$TestStatement.evaluate(SolrTestCase.java:876)
	at com.carrotsearch.randomizedtesting.rules.StatementAdapter.evaluate(StatementAdapter.java:36)
	at com.carrotsearch.randomizedtesting.rules.SystemPropertiesRestoreRule$1.evaluate(SystemPropertiesRestoreRule.java:57)
	at org.junit.rules.RunRules.evaluate(RunRules.java:20)
	at com.carrotsearch.randomizedtesting.rules.StatementAdapter.evaluate(StatementAdapter.java:36)
	at com.carrotsearch.randomizedtesting.ThreadLeakControl$StatementRunner.run(ThreadLeakControl.java:370)
	at com.carrotsearch.randomizedtesting.ThreadLeakControl.forkTimeoutingTask(ThreadLeakControl.java:819)
	at com.carrotsearch.randomizedtesting.ThreadLeakControl$3.evaluate(ThreadLeakControl.java:470)
	at com.carrotsearch.randomizedtesting.RandomizedRunner.runSingleTest(RandomizedRunner.java:951)
	at com.carrotsearch.randomizedtesting.RandomizedRunner$5.evaluate(RandomizedRunner.java:836)
	at com.carrotsearch.randomizedtesting.RandomizedRunner$6.evaluate(RandomizedRunner.java:887)
	at com.carrotsearch.randomizedtesting.RandomizedRunner$7.evaluate(RandomizedRunner.java:898)
	at com.carrotsearch.randomizedtesting.rules.StatementAdapter.evaluate(StatementAdapter.java:36)
	at org.apache.solr.AbstractBeforeAfterRule$1.evaluate(AbstractBeforeAfterRule.java:45)
	at com.carrotsearch.randomizedtesting.rules.StatementAdapter.evaluate(StatementAdapter.java:36)
	at com.carrotsearch.randomizedtesting.rules.StatementAdapter.evaluate(StatementAdapter.java:36)
	at org.apache.lucene.util.TestRuleMarkFailure$1.evaluate(TestRuleMarkFailure.java:47)
	at com.carrotsearch.randomizedtesting.rules.SystemPropertiesRestoreRule$1.evaluate(SystemPropertiesRestoreRule.java:57)
	at org.junit.rules.RunRules.evaluate(RunRules.java:20)
	at com.carrotsearch.randomizedtesting.rules.StatementAdapter.evaluate(StatementAdapter.java:36)
	at com.carrotsearch.randomizedtesting.ThreadLeakControl$StatementRunner.run(ThreadLeakControl.java:370)
	at com.carrotsearch.randomizedtesting.ThreadLeakControl.forkTimeoutingTask(ThreadLeakControl.java:819)
	at com.carrotsearch.randomizedtesting.ThreadLeakControl$2.evaluate(ThreadLeakControl.java:406)
	at com.carrotsearch.randomizedtesting.RandomizedRunner.runSuite(RandomizedRunner.java:712)
	at com.carrotsearch.randomizedtesting.RandomizedRunner.access$200(RandomizedRunner.java:138)
	at com.carrotsearch.randomizedtesting.RandomizedRunner$2.run(RandomizedRunner.java:633)


FAILED:  org.apache.solr.client.solrj.impl.TestCloudSolrClientConnections.testAlreadyClosedClusterStateProvider

Error Message:
junit.framework.AssertionFailedError: Expected exception AlreadyClosedException but no exception was thrown

Stack Trace:
junit.framework.AssertionFailedError: Expected exception AlreadyClosedException but no exception was thrown
	at __randomizedtesting.SeedInfo.seed([E137CE8890D84FFE:A118B93A0BAF1CFB]:0)
	at org.apache.lucene.util.LuceneTestCase.expectThrows(LuceneTestCase.java:2763)
	at org.apache.lucene.util.LuceneTestCase.expectThrows(LuceneTestCase.java:2753)
	at org.apache.solr.client.solrj.impl.TestCloudSolrClientConnections.checkAndCloseProvider(TestCloudSolrClientConnections.java:90)
	at org.apache.solr.client.solrj.impl.TestCloudSolrClientConnections.testAlreadyClosedClusterStateProvider(TestCloudSolrClientConnections.java:55)
	at java.base/jdk.internal.reflect.NativeMethodAccessorImpl.invoke0(Native Method)
	at java.base/jdk.internal.reflect.NativeMethodAccessorImpl.invoke(NativeMethodAccessorImpl.java:62)
	at java.base/jdk.internal.reflect.DelegatingMethodAccessorImpl.invoke(DelegatingMethodAccessorImpl.java:43)
	at java.base/java.lang.reflect.Method.invoke(Method.java:566)
	at com.carrotsearch.randomizedtesting.RandomizedRunner.invoke(RandomizedRunner.java:1754)
	at com.carrotsearch.randomizedtesting.RandomizedRunner$8.evaluate(RandomizedRunner.java:942)
	at com.carrotsearch.randomizedtesting.RandomizedRunner$9.evaluate(RandomizedRunner.java:978)
	at com.carrotsearch.randomizedtesting.RandomizedRunner$10.evaluate(RandomizedRunner.java:992)
	at org.apache.solr.SolrTestCase$TestRuleSetupTeardownChained$1.evaluate(SolrTestCase.java:918)
	at org.apache.solr.SolrTestCase$TestRuleThreadAndTestName$TestStatement.evaluate(SolrTestCase.java:876)
	at com.carrotsearch.randomizedtesting.rules.StatementAdapter.evaluate(StatementAdapter.java:36)
	at com.carrotsearch.randomizedtesting.rules.SystemPropertiesRestoreRule$1.evaluate(SystemPropertiesRestoreRule.java:57)
	at org.junit.rules.RunRules.evaluate(RunRules.java:20)
	at com.carrotsearch.randomizedtesting.rules.StatementAdapter.evaluate(StatementAdapter.java:36)
	at com.carrotsearch.randomizedtesting.ThreadLeakControl$StatementRunner.run(ThreadLeakControl.java:370)
	at com.carrotsearch.randomizedtesting.ThreadLeakControl.forkTimeoutingTask(ThreadLeakControl.java:819)
	at com.carrotsearch.randomizedtesting.ThreadLeakControl$3.evaluate(ThreadLeakControl.java:470)
	at com.carrotsearch.randomizedtesting.RandomizedRunner.runSingleTest(RandomizedRunner.java:951)
	at com.carrotsearch.randomizedtesting.RandomizedRunner$5.evaluate(RandomizedRunner.java:836)
	at com.carrotsearch.randomizedtesting.RandomizedRunner$6.evaluate(RandomizedRunner.java:887)
	at com.carrotsearch.randomizedtesting.RandomizedRunner$7.evaluate(RandomizedRunner.java:898)
	at com.carrotsearch.randomizedtesting.rules.StatementAdapter.evaluate(StatementAdapter.java:36)
	at org.apache.solr.AbstractBeforeAfterRule$1.evaluate(AbstractBeforeAfterRule.java:45)
	at com.carrotsearch.randomizedtesting.rules.StatementAdapter.evaluate(StatementAdapter.java:36)
	at com.carrotsearch.randomizedtesting.rules.StatementAdapter.evaluate(StatementAdapter.java:36)
	at org.apache.lucene.util.TestRuleMarkFailure$1.evaluate(TestRuleMarkFailure.java:47)
	at com.carrotsearch.randomizedtesting.rules.SystemPropertiesRestoreRule$1.evaluate(SystemPropertiesRestoreRule.java:57)
	at org.junit.rules.RunRules.evaluate(RunRules.java:20)
	at com.carrotsearch.randomizedtesting.rules.StatementAdapter.evaluate(StatementAdapter.java:36)
	at com.carrotsearch.randomizedtesting.ThreadLeakControl$StatementRunner.run(ThreadLeakControl.java:370)
	at com.carrotsearch.randomizedtesting.ThreadLeakControl.forkTimeoutingTask(ThreadLeakControl.java:819)
	at com.carrotsearch.randomizedtesting.ThreadLeakControl$2.evaluate(ThreadLeakControl.java:406)
	at com.carrotsearch.randomizedtesting.RandomizedRunner.runSuite(RandomizedRunner.java:712)
	at com.carrotsearch.randomizedtesting.RandomizedRunner.access$200(RandomizedRunner.java:138)
	at com.carrotsearch.randomizedtesting.RandomizedRunner$2.run(RandomizedRunner.java:633)




Build Log:
[...truncated 16509 lines...]
asciidoctor: ERROR: indexing-nested-documents.adoc: line 205: include file not found: /home/jenkins/jenkins-slave/workspace/Solr/Solr-Check-cloud2refimpl/solr/solrj/src/test/org/apache/solr/client/ref_guide_examples/IndexingNestedDocuments.java
asciidoctor: ERROR: indexing-nested-documents.adoc: line 372: include file not found: /home/jenkins/jenkins-slave/workspace/Solr/Solr-Check-cloud2refimpl/solr/solrj/src/test/org/apache/solr/client/ref_guide_examples/IndexingNestedDocuments.java
asciidoctor: WARNING: using-solrj.adoc: line 119: tag 'solrj-cloudsolrclient-baseurl' not found in include file: /home/jenkins/jenkins-slave/workspace/Solr/Solr-Check-cloud2refimpl/solr/solrj/src/test/org/apache/solr/client/ref_guide_examples/UsingSolrJRefGuideExamplesTest.java
asciidoctor: WARNING: using-solrj.adoc: line 127: tag 'solrj-cloudsolrclient-zookeepernoroot' not found in include file: /home/jenkins/jenkins-slave/workspace/Solr/Solr-Check-cloud2refimpl/solr/solrj/src/test/org/apache/solr/client/ref_guide_examples/UsingSolrJRefGuideExamplesTest.java
asciidoctor: WARNING: using-solrj.adoc: line 132: tag 'solrj-cloudsolrclient-zookeeperroot' not found in include file: /home/jenkins/jenkins-slave/workspace/Solr/Solr-Check-cloud2refimpl/solr/solrj/src/test/org/apache/solr/client/ref_guide_examples/UsingSolrJRefGuideExamplesTest.java
                    done in 27.282 seconds.
 Auto-regeneration: disabled. Use --watch to enable.

> Task :solr:solr-ref-guide:buildSite
Processed 2441 links (1757 relative) to 3507 anchors in 243 files

> Task :solr:solr-ref-guide:check
> Task :solr:webapp:check
> Task :lucene:analysis:common:check
> Task :lucene:analysis:icu:check
> Task :lucene:analysis:kuromoji:check
> Task :lucene:analysis:morfologik:check
> Task :lucene:analysis:nori:check
> Task :lucene:analysis:opennlp:check
> Task :lucene:analysis:phonetic:check
> Task :lucene:analysis:smartcn:check
> Task :lucene:analysis:stempel:check
> Task :solr:contrib:analysis-extras:check
> Task :solr:contrib:jaegertracer-configurator:check
> Task :solr:contrib:langid:check

ERROR: The following test(s) have failed:
  - org.apache.solr.client.solrj.impl.CloudHttp2SolrClientTest.testVersionsAreReturned (:solr:solrj)
    Test output: /home/jenkins/jenkins-slave/workspace/Solr/Solr-Check-cloud2refimpl/solr/solrj/build/test-results/test/outputs/OUTPUT-org.apache.solr.client.solrj.impl.CloudHttp2SolrClientTest.txt
    Reproduce with: gradlew :solr:solrj:test --tests "org.apache.solr.client.solrj.impl.CloudHttp2SolrClientTest" -Ptests.jvms=4 -Ptests.haltonfailure=false -Ptests.jvmargs=-XX:TieredStopAtLevel=1 -Ptests.seed=E137CE8890D84FFE -Ptests.multiplier=2 -Ptests.badapples=false -Ptests.file.encoding=ISO-8859-1

  - org.apache.solr.client.solrj.impl.TestCloudSolrClientConnections.testAlreadyClosedClusterStateProvider (:solr:solrj)
    Test output: /home/jenkins/jenkins-slave/workspace/Solr/Solr-Check-cloud2refimpl/solr/solrj/build/test-results/test/outputs/OUTPUT-org.apache.solr.client.solrj.impl.TestCloudSolrClientConnections.txt
    Reproduce with: gradlew :solr:solrj:test --tests "org.apache.solr.client.solrj.impl.TestCloudSolrClientConnections" -Ptests.jvms=4 -Ptests.haltonfailure=false -Ptests.jvmargs=-XX:TieredStopAtLevel=1 -Ptests.seed=E137CE8890D84FFE -Ptests.multiplier=2 -Ptests.badapples=false -Ptests.file.encoding=ISO-8859-1

  - org.apache.solr.search.TestStressUserVersions.classMethod (:solr:core)
    Test output: /home/jenkins/jenkins-slave/workspace/Solr/Solr-Check-cloud2refimpl/solr/core/build/test-results/test/outputs/OUTPUT-org.apache.solr.search.TestStressUserVersions.txt
    Reproduce with: gradlew :solr:core:test --tests "org.apache.solr.search.TestStressUserVersions" -Ptests.jvms=4 -Ptests.haltonfailure=false -Ptests.jvmargs=-XX:TieredStopAtLevel=1 -Ptests.seed=E137CE8890D84FFE -Ptests.multiplier=2 -Ptests.badapples=false -Ptests.file.encoding=ISO-8859-1


FAILURE: Build completed with 50 failures.

1: Task failed with an exception.
-----------
* What went wrong:
Execution failed for task ':checkUnusedConstraints'.
> There are unused pins in your versions.props: 
  [commons-beanutils:commons-beanutils, com.fasterxml.woodstox:woodstox-core:6.2.3, org.lz4:lz4-java:1.7.1, org.awaitility:awaitility:4.0.3]
  
  Rerun with --fix to remove them.

* Try:
Run with --stacktrace option to get the stack trace. Run with --info or --debug option to get more log output. Run with --scan to get full insights.
==============================================================================

2: Task failed with an exception.
-----------
* Where:
Script '/home/jenkins/jenkins-slave/workspace/Solr/Solr-Check-cloud2refimpl/gradle/validation/validate-source-patterns.gradle' line: 324

* What went wrong:
Execution failed for task ':validateSourcePatterns'.
> Found 3 violations in source files (nocommit).

* Try:
Run with --stacktrace option to get the stack trace. Run with --info or --debug option to get more log output. Run with --scan to get full insights.
==============================================================================

3: Task failed with an exception.
-----------
* Where:
Script '/home/jenkins/jenkins-slave/workspace/Solr/Solr-Check-cloud2refimpl/gradle/validation/versions-props-sorted.gradle' line: 30

* What went wrong:
Execution failed for task ':versionsPropsAreSorted'.
> /home/jenkins/jenkins-slave/workspace/Solr/Solr-Check-cloud2refimpl/versions.props file is not sorted lexicographically. I wrote a sorted file to /home/jenkins/jenkins-slave/workspace/Solr/Solr-Check-cloud2refimpl/build/versions.props - please review and commit.

* Try:
Run with --stacktrace option to get the stack trace. Run with --info or --debug option to get more log output. Run with --scan to get full insights.
==============================================================================

4: Task failed with an exception.
-----------
* Where:
Script '/home/jenkins/jenkins-slave/workspace/Solr/Solr-Check-cloud2refimpl/gradle/validation/jar-checks.gradle' line: 197

* What went wrong:
Execution failed for task ':lucene:benchmark:validateJarChecksums'.
> Dependency checksum validation failed:
    - Dependency checksum missing ('xerces:xercesImpl:2.12.1'), expected it at: /home/jenkins/jenkins-slave/workspace/Solr/Solr-Check-cloud2refimpl/lucene/licenses/xercesImpl-2.12.1.jar.sha1

* Try:
Run with --stacktrace option to get the stack trace. Run with --info or --debug option to get more log output. Run with --scan to get full insights.
==============================================================================

5: Task failed with an exception.
-----------
* Where:
Script '/home/jenkins/jenkins-slave/workspace/Solr/Solr-Check-cloud2refimpl/gradle/validation/jar-checks.gradle' line: 197

* What went wrong:
Execution failed for task ':lucene:expressions:validateJarChecksums'.
> Dependency checksum validation failed:
    - Dependency checksum missing ('org.ow2.asm:asm-commons:9.0'), expected it at: /home/jenkins/jenkins-slave/workspace/Solr/Solr-Check-cloud2refimpl/lucene/licenses/asm-commons-9.0.jar.sha1
    - Dependency checksum missing ('org.ow2.asm:asm:9.0'), expected it at: /home/jenkins/jenkins-slave/workspace/Solr/Solr-Check-cloud2refimpl/lucene/licenses/asm-9.0.jar.sha1

* Try:
Run with --stacktrace option to get the stack trace. Run with --info or --debug option to get more log output. Run with --scan to get full insights.
==============================================================================

6: Task failed with an exception.
-----------
* Where:
Script '/home/jenkins/jenkins-slave/workspace/Solr/Solr-Check-cloud2refimpl/gradle/validation/jar-checks.gradle' line: 197

* What went wrong:
Execution failed for task ':lucene:facet:validateJarChecksums'.
> Dependency checksum validation failed:
    - Dependency checksum missing ('com.carrotsearch:hppc:0.8.2'), expected it at: /home/jenkins/jenkins-slave/workspace/Solr/Solr-Check-cloud2refimpl/lucene/licenses/hppc-0.8.2.jar.sha1

* Try:
Run with --stacktrace option to get the stack trace. Run with --info or --debug option to get more log output. Run with --scan to get full insights.
==============================================================================

7: Task failed with an exception.
-----------
* Where:
Script '/home/jenkins/jenkins-slave/workspace/Solr/Solr-Check-cloud2refimpl/gradle/validation/jar-checks.gradle' line: 197

* What went wrong:
Execution failed for task ':lucene:luke:validateJarChecksums'.
> Dependency checksum validation failed:
    - Dependency checksum missing ('org.apache.logging.log4j:log4j-api:2.14.0'), expected it at: /home/jenkins/jenkins-slave/workspace/Solr/Solr-Check-cloud2refimpl/lucene/licenses/log4j-api-2.14.0.jar.sha1
    - Dependency checksum missing ('org.apache.logging.log4j:log4j-core:2.14.0'), expected it at: /home/jenkins/jenkins-slave/workspace/Solr/Solr-Check-cloud2refimpl/lucene/licenses/log4j-core-2.14.0.jar.sha1

* Try:
Run with --stacktrace option to get the stack trace. Run with --info or --debug option to get more log output. Run with --scan to get full insights.
==============================================================================

8: Task failed with an exception.
-----------
* Where:
Script '/home/jenkins/jenkins-slave/workspace/Solr/Solr-Check-cloud2refimpl/gradle/validation/jar-checks.gradle' line: 197

* What went wrong:
Execution failed for task ':lucene:replicator:validateJarChecksums'.
> Dependency checksum validation failed:
    - Dependency checksum missing ('org.apache.httpcomponents:httpclient:4.5.12'), expected it at: /home/jenkins/jenkins-slave/workspace/Solr/Solr-Check-cloud2refimpl/lucene/licenses/httpclient-4.5.12.jar.sha1
    - Dependency checksum missing ('org.apache.httpcomponents:httpcore:4.4.13'), expected it at: /home/jenkins/jenkins-slave/workspace/Solr/Solr-Check-cloud2refimpl/lucene/licenses/httpcore-4.4.13.jar.sha1
    - Dependency checksum missing ('org.eclipse.jetty:jetty-continuation:9.4.36.v20210114'), expected it at: /home/jenkins/jenkins-slave/workspace/Solr/Solr-Check-cloud2refimpl/lucene/licenses/jetty-continuation-9.4.36.v20210114.jar.sha1
    - Dependency checksum missing ('org.eclipse.jetty:jetty-http:9.4.36.v20210114'), expected it at: /home/jenkins/jenkins-slave/workspace/Solr/Solr-Check-cloud2refimpl/lucene/licenses/jetty-http-9.4.36.v20210114.jar.sha1
    - Dependency checksum missing ('org.eclipse.jetty:jetty-io:9.4.36.v20210114'), expected it at: /home/jenkins/jenkins-slave/workspace/Solr/Solr-Check-cloud2refimpl/lucene/licenses/jetty-io-9.4.36.v20210114.jar.sha1
    - Dependency checksum missing ('org.eclipse.jetty:jetty-server:9.4.36.v20210114'), expected it at: /home/jenkins/jenkins-slave/workspace/Solr/Solr-Check-cloud2refimpl/lucene/licenses/jetty-server-9.4.36.v20210114.jar.sha1
    - Dependency checksum missing ('org.eclipse.jetty:jetty-servlet:9.4.36.v20210114'), expected it at: /home/jenkins/jenkins-slave/workspace/Solr/Solr-Check-cloud2refimpl/lucene/licenses/jetty-servlet-9.4.36.v20210114.jar.sha1
    - Dependency checksum missing ('org.eclipse.jetty:jetty-util-ajax:9.4.36.v20210114'), expected it at: /home/jenkins/jenkins-slave/workspace/Solr/Solr-Check-cloud2refimpl/lucene/licenses/jetty-util-ajax-9.4.36.v20210114.jar.sha1
    - Dependency checksum missing ('org.eclipse.jetty:jetty-util:9.4.36.v20210114'), expected it at: /home/jenkins/jenkins-slave/workspace/Solr/Solr-Check-cloud2refimpl/lucene/licenses/jetty-util-9.4.36.v20210114.jar.sha1

* Try:
Run with --stacktrace option to get the stack trace. Run with --info or --debug option to get more log output. Run with --scan to get full insights.
==============================================================================

9: Task failed with an exception.
-----------
* Where:
Script '/home/jenkins/jenkins-slave/workspace/Solr/Solr-Check-cloud2refimpl/gradle/validation/jar-checks.gradle' line: 197

* What went wrong:
Execution failed for task ':lucene:test-framework:validateJarChecksums'.
> Dependency checksum validation failed:
    - Dependency checksum missing ('junit:junit:4.13.1'), expected it at: /home/jenkins/jenkins-slave/workspace/Solr/Solr-Check-cloud2refimpl/lucene/licenses/junit-4.13.1.jar.sha1
    - Dependency checksum missing ('org.hamcrest:hamcrest-core:2.2'), expected it at: /home/jenkins/jenkins-slave/workspace/Solr/Solr-Check-cloud2refimpl/lucene/licenses/hamcrest-core-2.2.jar.sha1
    - Dependency checksum missing ('org.hamcrest:hamcrest:2.2'), expected it at: /home/jenkins/jenkins-slave/workspace/Solr/Solr-Check-cloud2refimpl/lucene/licenses/hamcrest-2.2.jar.sha1

* Try:
Run with --stacktrace option to get the stack trace. Run with --info or --debug option to get more log output. Run with --scan to get full insights.
==============================================================================

10: Task failed with an exception.
-----------
* Where:
Script '/home/jenkins/jenkins-slave/workspace/Solr/Solr-Check-cloud2refimpl/gradle/validation/jar-checks.gradle' line: 264

* What went wrong:
Execution failed for task ':lucene:test-framework:validateJarLicenses'.
> Certain license/ notice files are missing:
    - License file missing ('org.hamcrest:hamcrest:2.2'), expected it at: /home/jenkins/jenkins-slave/workspace/Solr/Solr-Check-cloud2refimpl/lucene/licenses/hamcrest-LICENSE-[type].txt, where [type] can be any of [ASL, BSD, BSD_LIKE, CDDL, CPL, EPL, MIT, MPL, PD, SUN, COMPOUND].

* Try:
Run with --stacktrace option to get the stack trace. Run with --info or --debug option to get more log output. Run with --scan to get full insights.
==============================================================================

11: Task failed with an exception.
-----------
* Where:
Script '/home/jenkins/jenkins-slave/workspace/Solr/Solr-Check-cloud2refimpl/gradle/validation/jar-checks.gradle' line: 197

* What went wrong:
Execution failed for task ':solr:core:validateJarChecksums'.
> Dependency checksum validation failed:
    - Dependency checksum missing ('com.carrotsearch:hppc:0.8.2'), expected it at: /home/jenkins/jenkins-slave/workspace/Solr/Solr-Check-cloud2refimpl/solr/licenses/hppc-0.8.2.jar.sha1
    - Dependency checksum missing ('com.fasterxml.jackson.core:jackson-annotations:2.12.1'), expected it at: /home/jenkins/jenkins-slave/workspace/Solr/Solr-Check-cloud2refimpl/solr/licenses/jackson-annotations-2.12.1.jar.sha1
    - Dependency checksum missing ('com.fasterxml.jackson.core:jackson-core:2.12.1'), expected it at: /home/jenkins/jenkins-slave/workspace/Solr/Solr-Check-cloud2refimpl/solr/licenses/jackson-core-2.12.1.jar.sha1
    - Dependency checksum missing ('com.fasterxml.jackson.core:jackson-databind:2.12.1'), expected it at: /home/jenkins/jenkins-slave/workspace/Solr/Solr-Check-cloud2refimpl/solr/licenses/jackson-databind-2.12.1.jar.sha1
    - Dependency checksum missing ('com.fasterxml.jackson.dataformat:jackson-dataformat-smile:2.12.1'), expected it at: /home/jenkins/jenkins-slave/workspace/Solr/Solr-Check-cloud2refimpl/solr/licenses/jackson-dataformat-smile-2.12.1.jar.sha1
    - Dependency checksum missing ('com.fasterxml.staxmate:staxmate:2.4.0'), expected it at: /home/jenkins/jenkins-slave/workspace/Solr/Solr-Check-cloud2refimpl/solr/licenses/staxmate-2.4.0.jar.sha1
    - Dependency checksum missing ('com.fasterxml.woodstox:woodstox-core:6.2.3'), expected it at: /home/jenkins/jenkins-slave/workspace/Solr/Solr-Check-cloud2refimpl/solr/licenses/woodstox-core-6.2.3.jar.sha1
    - Dependency checksum missing ('com.fasterxml:aalto-xml:1.2.2'), expected it at: /home/jenkins/jenkins-slave/workspace/Solr/Solr-Check-cloud2refimpl/solr/licenses/aalto-xml-1.2.2.jar.sha1
    - Dependency checksum missing ('com.github.ben-manes.caffeine:caffeine:2.8.8'), expected it at: /home/jenkins/jenkins-slave/workspace/Solr/Solr-Check-cloud2refimpl/solr/licenses/caffeine-2.8.8.jar.sha1
    - Dependency checksum missing ('com.google.guava:failureaccess:1.0.1'), expected it at: /home/jenkins/jenkins-slave/workspace/Solr/Solr-Check-cloud2refimpl/solr/licenses/failureaccess-1.0.1.jar.sha1
    - Dependency checksum missing ('com.google.guava:guava:29.0-jre'), expected it at: /home/jenkins/jenkins-slave/workspace/Solr/Solr-Check-cloud2refimpl/solr/licenses/guava-29.0-jre.jar.sha1
    - Dependency checksum missing ('com.google.guava:listenablefuture:9999.0-empty-to-avoid-conflict-with-guava'), expected it at: /home/jenkins/jenkins-slave/workspace/Solr/Solr-Check-cloud2refimpl/solr/licenses/listenablefuture-9999.0-empty-to-avoid-conflict-with-guava.jar.sha1
    - Dependency checksum missing ('com.vlkan.log4j2:log4j2-logstash-layout:1.0.5'), expected it at: /home/jenkins/jenkins-slave/workspace/Solr/Solr-Check-cloud2refimpl/solr/licenses/log4j2-logstash-layout-1.0.5.jar.sha1
    - Dependency checksum missing ('net.sf.saxon:Saxon-HE:10.3'), expected it at: /home/jenkins/jenkins-slave/workspace/Solr/Solr-Check-cloud2refimpl/solr/licenses/Saxon-HE-10.3.jar.sha1
    - Dependency checksum missing ('org.apache.commons:commons-lang3:3.11'), expected it at: /home/jenkins/jenkins-slave/workspace/Solr/Solr-Check-cloud2refimpl/solr/licenses/commons-lang3-3.11.jar.sha1
    - Dependency checksum missing ('org.apache.logging.log4j:log4j-1.2-api:2.14.0'), expected it at: /home/jenkins/jenkins-slave/workspace/Solr/Solr-Check-cloud2refimpl/solr/licenses/log4j-1.2-api-2.14.0.jar.sha1
    - Dependency checksum missing ('org.apache.logging.log4j:log4j-api:2.14.0'), expected it at: /home/jenkins/jenkins-slave/workspace/Solr/Solr-Check-cloud2refimpl/solr/licenses/log4j-api-2.14.0.jar.sha1
    - Dependency checksum missing ('org.apache.logging.log4j:log4j-core:2.14.0'), expected it at: /home/jenkins/jenkins-slave/workspace/Solr/Solr-Check-cloud2refimpl/solr/licenses/log4j-core-2.14.0.jar.sha1
    - Dependency checksum missing ('org.apache.logging.log4j:log4j-slf4j-impl:2.14.0'), expected it at: /home/jenkins/jenkins-slave/workspace/Solr/Solr-Check-cloud2refimpl/solr/licenses/log4j-slf4j-impl-2.14.0.jar.sha1
    - Dependency checksum missing ('org.codehaus.woodstox:stax2-api:4.2.1'), expected it at: /home/jenkins/jenkins-slave/workspace/Solr/Solr-Check-cloud2refimpl/solr/licenses/stax2-api-4.2.1.jar.sha1
    - Dependency checksum missing ('org.eclipse.jetty:jetty-util:9.4.36.v20210114'), expected it at: /home/jenkins/jenkins-slave/workspace/Solr/Solr-Check-cloud2refimpl/solr/licenses/jetty-util-9.4.36.v20210114.jar.sha1
    - Dependency checksum missing ('org.ow2.asm:asm-analysis:9.0'), expected it at: /home/jenkins/jenkins-slave/workspace/Solr/Solr-Check-cloud2refimpl/solr/licenses/asm-analysis-9.0.jar.sha1
    - Dependency checksum missing ('org.ow2.asm:asm-commons:9.0'), expected it at: /home/jenkins/jenkins-slave/workspace/Solr/Solr-Check-cloud2refimpl/solr/licenses/asm-commons-9.0.jar.sha1
    - Dependency checksum missing ('org.ow2.asm:asm-tree:9.0'), expected it at: /home/jenkins/jenkins-slave/workspace/Solr/Solr-Check-cloud2refimpl/solr/licenses/asm-tree-9.0.jar.sha1
    - Dependency checksum missing ('org.ow2.asm:asm:9.0'), expected it at: /home/jenkins/jenkins-slave/workspace/Solr/Solr-Check-cloud2refimpl/solr/licenses/asm-9.0.jar.sha1
    - Dependency checksum missing ('xerces:xercesImpl:2.12.1'), expected it at: /home/jenkins/jenkins-slave/workspace/Solr/Solr-Check-cloud2refimpl/solr/licenses/xercesImpl-2.12.1.jar.sha1
    - Dependency checksum missing ('xml-apis:xml-apis:1.4.01'), expected it at: /home/jenkins/jenkins-slave/workspace/Solr/Solr-Check-cloud2refimpl/solr/licenses/xml-apis-1.4.01.jar.sha1

* Try:
Run with --stacktrace option to get the stack trace. Run with --info or --debug option to get more log output. Run with --scan to get full insights.
==============================================================================

12: Task failed with an exception.
-----------
* Where:
Script '/home/jenkins/jenkins-slave/workspace/Solr/Solr-Check-cloud2refimpl/gradle/validation/jar-checks.gradle' line: 264

* What went wrong:
Execution failed for task ':solr:core:validateJarLicenses'.
> Certain license/ notice files are missing:
    - License file missing ('com.fasterxml.staxmate:staxmate:2.4.0'), expected it at: /home/jenkins/jenkins-slave/workspace/Solr/Solr-Check-cloud2refimpl/solr/licenses/staxmate-LICENSE-[type].txt, where [type] can be any of [ASL, BSD, BSD_LIKE, CDDL, CPL, EPL, MIT, MPL, PD, SUN, COMPOUND].
    - License file missing ('com.fasterxml.woodstox:woodstox-core:6.2.3'), expected it at: /home/jenkins/jenkins-slave/workspace/Solr/Solr-Check-cloud2refimpl/solr/licenses/woodstox-core-LICENSE-[type].txt or /home/jenkins/jenkins-slave/workspace/Solr/Solr-Check-cloud2refimpl/solr/licenses/woodstox-LICENSE-[type].txt, where [type] can be any of [ASL, BSD, BSD_LIKE, CDDL, CPL, EPL, MIT, MPL, PD, SUN, COMPOUND].
    - License file missing ('com.fasterxml:aalto-xml:1.2.2'), expected it at: /home/jenkins/jenkins-slave/workspace/Solr/Solr-Check-cloud2refimpl/solr/licenses/aalto-xml-LICENSE-[type].txt or /home/jenkins/jenkins-slave/workspace/Solr/Solr-Check-cloud2refimpl/solr/licenses/aalto-LICENSE-[type].txt, where [type] can be any of [ASL, BSD, BSD_LIKE, CDDL, CPL, EPL, MIT, MPL, PD, SUN, COMPOUND].
    - License file missing ('com.google.guava:failureaccess:1.0.1'), expected it at: /home/jenkins/jenkins-slave/workspace/Solr/Solr-Check-cloud2refimpl/solr/licenses/failureaccess-LICENSE-[type].txt, where [type] can be any of [ASL, BSD, BSD_LIKE, CDDL, CPL, EPL, MIT, MPL, PD, SUN, COMPOUND].
    - License file missing ('com.google.guava:listenablefuture:9999.0-empty-to-avoid-conflict-with-guava'), expected it at: /home/jenkins/jenkins-slave/workspace/Solr/Solr-Check-cloud2refimpl/solr/licenses/listenablefuture-LICENSE-[type].txt, where [type] can be any of [ASL, BSD, BSD_LIKE, CDDL, CPL, EPL, MIT, MPL, PD, SUN, COMPOUND].
    - License file missing ('com.vlkan.log4j2:log4j2-logstash-layout:1.0.5'), expected it at: /home/jenkins/jenkins-slave/workspace/Solr/Solr-Check-cloud2refimpl/solr/licenses/log4j2-logstash-layout-LICENSE-[type].txt or /home/jenkins/jenkins-slave/workspace/Solr/Solr-Check-cloud2refimpl/solr/licenses/log4j2-logstash-LICENSE-[type].txt or /home/jenkins/jenkins-slave/workspace/Solr/Solr-Check-cloud2refimpl/solr/licenses/log4j2-LICENSE-[type].txt, where [type] can be any of [ASL, BSD, BSD_LIKE, CDDL, CPL, EPL, MIT, MPL, PD, SUN, COMPOUND].
    - License file missing ('net.sf.saxon:Saxon-HE:10.3'), expected it at: /home/jenkins/jenkins-slave/workspace/Solr/Solr-Check-cloud2refimpl/solr/licenses/Saxon-HE-LICENSE-[type].txt or /home/jenkins/jenkins-slave/workspace/Solr/Solr-Check-cloud2refimpl/solr/licenses/Saxon-LICENSE-[type].txt, where [type] can be any of [ASL, BSD, BSD_LIKE, CDDL, CPL, EPL, MIT, MPL, PD, SUN, COMPOUND].
    - License file missing ('xml-apis:xml-apis:1.4.01'), expected it at: /home/jenkins/jenkins-slave/workspace/Solr/Solr-Check-cloud2refimpl/solr/licenses/xml-apis-LICENSE-[type].txt or /home/jenkins/jenkins-slave/workspace/Solr/Solr-Check-cloud2refimpl/solr/licenses/xml-LICENSE-[type].txt, where [type] can be any of [ASL, BSD, BSD_LIKE, CDDL, CPL, EPL, MIT, MPL, PD, SUN, COMPOUND].

* Try:
Run with --stacktrace option to get the stack trace. Run with --info or --debug option to get more log output. Run with --scan to get full insights.
==============================================================================

13: Task failed with an exception.
-----------
* Where:
Script '/home/jenkins/jenkins-slave/workspace/Solr/Solr-Check-cloud2refimpl/gradle/validation/jar-checks.gradle' line: 197

* What went wrong:
Execution failed for task ':solr:server:validateJarChecksums'.
> Dependency checksum validation failed:
    - Dependency checksum missing ('com.fasterxml.jackson.core:jackson-annotations:2.12.1'), expected it at: /home/jenkins/jenkins-slave/workspace/Solr/Solr-Check-cloud2refimpl/solr/licenses/jackson-annotations-2.12.1.jar.sha1
    - Dependency checksum missing ('com.fasterxml.jackson.core:jackson-core:2.12.1'), expected it at: /home/jenkins/jenkins-slave/workspace/Solr/Solr-Check-cloud2refimpl/solr/licenses/jackson-core-2.12.1.jar.sha1
    - Dependency checksum missing ('com.fasterxml.jackson.core:jackson-databind:2.12.1'), expected it at: /home/jenkins/jenkins-slave/workspace/Solr/Solr-Check-cloud2refimpl/solr/licenses/jackson-databind-2.12.1.jar.sha1
    - Dependency checksum missing ('com.vlkan.log4j2:log4j2-logstash-layout:1.0.5'), expected it at: /home/jenkins/jenkins-slave/workspace/Solr/Solr-Check-cloud2refimpl/solr/licenses/log4j2-logstash-layout-1.0.5.jar.sha1
    - Dependency checksum missing ('javax.annotation:javax.annotation-api:1.3.2'), expected it at: /home/jenkins/jenkins-slave/workspace/Solr/Solr-Check-cloud2refimpl/solr/licenses/javax.annotation-api-1.3.2.jar.sha1
    - Dependency checksum missing ('javax.transaction:javax.transaction-api:1.3'), expected it at: /home/jenkins/jenkins-slave/workspace/Solr/Solr-Check-cloud2refimpl/solr/licenses/javax.transaction-api-1.3.jar.sha1
    - Dependency checksum missing ('org.apache.commons:commons-lang3:3.11'), expected it at: /home/jenkins/jenkins-slave/workspace/Solr/Solr-Check-cloud2refimpl/solr/licenses/commons-lang3-3.11.jar.sha1
    - Dependency checksum missing ('org.apache.logging.log4j:log4j-1.2-api:2.14.0'), expected it at: /home/jenkins/jenkins-slave/workspace/Solr/Solr-Check-cloud2refimpl/solr/licenses/log4j-1.2-api-2.14.0.jar.sha1
    - Dependency checksum missing ('org.apache.logging.log4j:log4j-api:2.14.0'), expected it at: /home/jenkins/jenkins-slave/workspace/Solr/Solr-Check-cloud2refimpl/solr/licenses/log4j-api-2.14.0.jar.sha1
    - Dependency checksum missing ('org.apache.logging.log4j:log4j-core:2.14.0'), expected it at: /home/jenkins/jenkins-slave/workspace/Solr/Solr-Check-cloud2refimpl/solr/licenses/log4j-core-2.14.0.jar.sha1
    - Dependency checksum missing ('org.apache.logging.log4j:log4j-slf4j-impl:2.14.0'), expected it at: /home/jenkins/jenkins-slave/workspace/Solr/Solr-Check-cloud2refimpl/solr/licenses/log4j-slf4j-impl-2.14.0.jar.sha1
    - Dependency checksum missing ('org.apache.logging.log4j:log4j-web:2.14.0'), expected it at: /home/jenkins/jenkins-slave/workspace/Solr/Solr-Check-cloud2refimpl/solr/licenses/log4j-web-2.14.0.jar.sha1
    - Dependency checksum missing ('org.eclipse.jetty.http2:http2-common:9.4.36.v20210114'), expected it at: /home/jenkins/jenkins-slave/workspace/Solr/Solr-Check-cloud2refimpl/solr/licenses/http2-common-9.4.36.v20210114.jar.sha1
    - Dependency checksum missing ('org.eclipse.jetty.http2:http2-hpack:9.4.36.v20210114'), expected it at: /home/jenkins/jenkins-slave/workspace/Solr/Solr-Check-cloud2refimpl/solr/licenses/http2-hpack-9.4.36.v20210114.jar.sha1
    - Dependency checksum missing ('org.eclipse.jetty.http2:http2-server:9.4.36.v20210114'), expected it at: /home/jenkins/jenkins-slave/workspace/Solr/Solr-Check-cloud2refimpl/solr/licenses/http2-server-9.4.36.v20210114.jar.sha1
    - Dependency checksum missing ('org.eclipse.jetty:jetty-alpn-java-server:9.4.36.v20210114'), expected it at: /home/jenkins/jenkins-slave/workspace/Solr/Solr-Check-cloud2refimpl/solr/licenses/jetty-alpn-java-server-9.4.36.v20210114.jar.sha1
    - Dependency checksum missing ('org.eclipse.jetty:jetty-alpn-server:9.4.36.v20210114'), expected it at: /home/jenkins/jenkins-slave/workspace/Solr/Solr-Check-cloud2refimpl/solr/licenses/jetty-alpn-server-9.4.36.v20210114.jar.sha1
    - Dependency checksum missing ('org.eclipse.jetty:jetty-annotations:9.4.36.v20210114'), expected it at: /home/jenkins/jenkins-slave/workspace/Solr/Solr-Check-cloud2refimpl/solr/licenses/jetty-annotations-9.4.36.v20210114.jar.sha1
    - Dependency checksum missing ('org.eclipse.jetty:jetty-continuation:9.4.36.v20210114'), expected it at: /home/jenkins/jenkins-slave/workspace/Solr/Solr-Check-cloud2refimpl/solr/licenses/jetty-continuation-9.4.36.v20210114.jar.sha1
    - Dependency checksum missing ('org.eclipse.jetty:jetty-deploy:9.4.36.v20210114'), expected it at: /home/jenkins/jenkins-slave/workspace/Solr/Solr-Check-cloud2refimpl/solr/licenses/jetty-deploy-9.4.36.v20210114.jar.sha1
    - Dependency checksum missing ('org.eclipse.jetty:jetty-http:9.4.36.v20210114'), expected it at: /home/jenkins/jenkins-slave/workspace/Solr/Solr-Check-cloud2refimpl/solr/licenses/jetty-http-9.4.36.v20210114.jar.sha1
    - Dependency checksum missing ('org.eclipse.jetty:jetty-io:9.4.36.v20210114'), expected it at: /home/jenkins/jenkins-slave/workspace/Solr/Solr-Check-cloud2refimpl/solr/licenses/jetty-io-9.4.36.v20210114.jar.sha1
    - Dependency checksum missing ('org.eclipse.jetty:jetty-jmx:9.4.36.v20210114'), expected it at: /home/jenkins/jenkins-slave/workspace/Solr/Solr-Check-cloud2refimpl/solr/licenses/jetty-jmx-9.4.36.v20210114.jar.sha1
    - Dependency checksum missing ('org.eclipse.jetty:jetty-jndi:9.4.36.v20210114'), expected it at: /home/jenkins/jenkins-slave/workspace/Solr/Solr-Check-cloud2refimpl/solr/licenses/jetty-jndi-9.4.36.v20210114.jar.sha1
    - Dependency checksum missing ('org.eclipse.jetty:jetty-plus:9.4.36.v20210114'), expected it at: /home/jenkins/jenkins-slave/workspace/Solr/Solr-Check-cloud2refimpl/solr/licenses/jetty-plus-9.4.36.v20210114.jar.sha1
    - Dependency checksum missing ('org.eclipse.jetty:jetty-quickstart:9.4.36.v20210114'), expected it at: /home/jenkins/jenkins-slave/workspace/Solr/Solr-Check-cloud2refimpl/solr/licenses/jetty-quickstart-9.4.36.v20210114.jar.sha1
    - Dependency checksum missing ('org.eclipse.jetty:jetty-rewrite:9.4.36.v20210114'), expected it at: /home/jenkins/jenkins-slave/workspace/Solr/Solr-Check-cloud2refimpl/solr/licenses/jetty-rewrite-9.4.36.v20210114.jar.sha1
    - Dependency checksum missing ('org.eclipse.jetty:jetty-security:9.4.36.v20210114'), expected it at: /home/jenkins/jenkins-slave/workspace/Solr/Solr-Check-cloud2refimpl/solr/licenses/jetty-security-9.4.36.v20210114.jar.sha1
    - Dependency checksum missing ('org.eclipse.jetty:jetty-server:9.4.36.v20210114'), expected it at: /home/jenkins/jenkins-slave/workspace/Solr/Solr-Check-cloud2refimpl/solr/licenses/jetty-server-9.4.36.v20210114.jar.sha1
    - Dependency checksum missing ('org.eclipse.jetty:jetty-servlet:9.4.36.v20210114'), expected it at: /home/jenkins/jenkins-slave/workspace/Solr/Solr-Check-cloud2refimpl/solr/licenses/jetty-servlet-9.4.36.v20210114.jar.sha1
    - Dependency checksum missing ('org.eclipse.jetty:jetty-servlets:9.4.36.v20210114'), expected it at: /home/jenkins/jenkins-slave/workspace/Solr/Solr-Check-cloud2refimpl/solr/licenses/jetty-servlets-9.4.36.v20210114.jar.sha1
    - Dependency checksum missing ('org.eclipse.jetty:jetty-start:9.4.36.v20210114'), expected it at: /home/jenkins/jenkins-slave/workspace/Solr/Solr-Check-cloud2refimpl/solr/licenses/jetty-start-9.4.36.v20210114-shaded.jar.sha1
    - Dependency checksum missing ('org.eclipse.jetty:jetty-util-ajax:9.4.36.v20210114'), expected it at: /home/jenkins/jenkins-slave/workspace/Solr/Solr-Check-cloud2refimpl/solr/licenses/jetty-util-ajax-9.4.36.v20210114.jar.sha1
    - Dependency checksum missing ('org.eclipse.jetty:jetty-util:9.4.36.v20210114'), expected it at: /home/jenkins/jenkins-slave/workspace/Solr/Solr-Check-cloud2refimpl/solr/licenses/jetty-util-9.4.36.v20210114.jar.sha1
    - Dependency checksum missing ('org.eclipse.jetty:jetty-webapp:9.4.36.v20210114'), expected it at: /home/jenkins/jenkins-slave/workspace/Solr/Solr-Check-cloud2refimpl/solr/licenses/jetty-webapp-9.4.36.v20210114.jar.sha1
    - Dependency checksum missing ('org.eclipse.jetty:jetty-xml:9.4.36.v20210114'), expected it at: /home/jenkins/jenkins-slave/workspace/Solr/Solr-Check-cloud2refimpl/solr/licenses/jetty-xml-9.4.36.v20210114.jar.sha1
    - Dependency checksum missing ('org.ow2.asm:asm-analysis:9.0'), expected it at: /home/jenkins/jenkins-slave/workspace/Solr/Solr-Check-cloud2refimpl/solr/licenses/asm-analysis-9.0.jar.sha1
    - Dependency checksum missing ('org.ow2.asm:asm-commons:9.0'), expected it at: /home/jenkins/jenkins-slave/workspace/Solr/Solr-Check-cloud2refimpl/solr/licenses/asm-commons-9.0.jar.sha1
    - Dependency checksum missing ('org.ow2.asm:asm-tree:9.0'), expected it at: /home/jenkins/jenkins-slave/workspace/Solr/Solr-Check-cloud2refimpl/solr/licenses/asm-tree-9.0.jar.sha1
    - Dependency checksum missing ('org.ow2.asm:asm:9.0'), expected it at: /home/jenkins/jenkins-slave/workspace/Solr/Solr-Check-cloud2refimpl/solr/licenses/asm-9.0.jar.sha1

* Try:
Run with --stacktrace option to get the stack trace. Run with --info or --debug option to get more log output. Run with --scan to get full insights.
==============================================================================

14: Task failed with an exception.
-----------
* Where:
Script '/home/jenkins/jenkins-slave/workspace/Solr/Solr-Check-cloud2refimpl/gradle/validation/jar-checks.gradle' line: 264

* What went wrong:
Execution failed for task ':solr:server:validateJarLicenses'.
> Certain license/ notice files are missing:
    - License file missing ('com.vlkan.log4j2:log4j2-logstash-layout:1.0.5'), expected it at: /home/jenkins/jenkins-slave/workspace/Solr/Solr-Check-cloud2refimpl/solr/licenses/log4j2-logstash-layout-LICENSE-[type].txt or /home/jenkins/jenkins-slave/workspace/Solr/Solr-Check-cloud2refimpl/solr/licenses/log4j2-logstash-LICENSE-[type].txt or /home/jenkins/jenkins-slave/workspace/Solr/Solr-Check-cloud2refimpl/solr/licenses/log4j2-LICENSE-[type].txt, where [type] can be any of [ASL, BSD, BSD_LIKE, CDDL, CPL, EPL, MIT, MPL, PD, SUN, COMPOUND].
    - License file missing ('javax.annotation:javax.annotation-api:1.3.2'), expected it at: /home/jenkins/jenkins-slave/workspace/Solr/Solr-Check-cloud2refimpl/solr/licenses/javax.annotation-api-LICENSE-[type].txt or /home/jenkins/jenkins-slave/workspace/Solr/Solr-Check-cloud2refimpl/solr/licenses/javax.annotation-LICENSE-[type].txt, where [type] can be any of [ASL, BSD, BSD_LIKE, CDDL, CPL, EPL, MIT, MPL, PD, SUN, COMPOUND].
    - License file missing ('javax.transaction:javax.transaction-api:1.3'), expected it at: /home/jenkins/jenkins-slave/workspace/Solr/Solr-Check-cloud2refimpl/solr/licenses/javax.transaction-api-LICENSE-[type].txt or /home/jenkins/jenkins-slave/workspace/Solr/Solr-Check-cloud2refimpl/solr/licenses/javax.transaction-LICENSE-[type].txt, where [type] can be any of [ASL, BSD, BSD_LIKE, CDDL, CPL, EPL, MIT, MPL, PD, SUN, COMPOUND].

* Try:
Run with --stacktrace option to get the stack trace. Run with --info or --debug option to get more log output. Run with --scan to get full insights.
==============================================================================

15: Task failed with an exception.
-----------
* Where:
Script '/home/jenkins/jenkins-slave/workspace/Solr/Solr-Check-cloud2refimpl/gradle/validation/jar-checks.gradle' line: 197

* What went wrong:
Execution failed for task ':solr:solrj:validateJarChecksums'.
> Dependency checksum validation failed:
    - Dependency checksum missing ('com.fasterxml.woodstox:woodstox-core:6.2.3'), expected it at: /home/jenkins/jenkins-slave/workspace/Solr/Solr-Check-cloud2refimpl/solr/licenses/woodstox-core-6.2.3.jar.sha1
    - Dependency checksum missing ('com.flipkart.zjsonpatch:zjsonpatch:0.4.4'), expected it at: /home/jenkins/jenkins-slave/workspace/Solr/Solr-Check-cloud2refimpl/solr/licenses/zjsonpatch-0.4.4.jar.sha1
    - Dependency checksum missing ('com.github.jknack:handlebars-helpers:4.2.0'), expected it at: /home/jenkins/jenkins-slave/workspace/Solr/Solr-Check-cloud2refimpl/solr/licenses/handlebars-helpers-4.2.0.jar.sha1
    - Dependency checksum missing ('com.github.jknack:handlebars:4.2.0'), expected it at: /home/jenkins/jenkins-slave/workspace/Solr/Solr-Check-cloud2refimpl/solr/licenses/handlebars-4.2.0.jar.sha1
    - Dependency checksum missing ('com.github.tomakehurst:wiremock-jre8:2.27.0'), expected it at: /home/jenkins/jenkins-slave/workspace/Solr/Solr-Check-cloud2refimpl/solr/licenses/wiremock-jre8-2.27.0.jar.sha1
    - Dependency checksum missing ('com.google.guava:failureaccess:1.0.1'), expected it at: /home/jenkins/jenkins-slave/workspace/Solr/Solr-Check-cloud2refimpl/solr/licenses/failureaccess-1.0.1.jar.sha1
    - Dependency checksum missing ('com.google.guava:guava:29.0-jre'), expected it at: /home/jenkins/jenkins-slave/workspace/Solr/Solr-Check-cloud2refimpl/solr/licenses/guava-29.0-jre.jar.sha1
    - Dependency checksum missing ('com.google.guava:listenablefuture:9999.0-empty-to-avoid-conflict-with-guava'), expected it at: /home/jenkins/jenkins-slave/workspace/Solr/Solr-Check-cloud2refimpl/solr/licenses/listenablefuture-9999.0-empty-to-avoid-conflict-with-guava.jar.sha1
    - Dependency checksum missing ('com.google.j2objc:j2objc-annotations:1.3'), expected it at: /home/jenkins/jenkins-slave/workspace/Solr/Solr-Check-cloud2refimpl/solr/licenses/j2objc-annotations-1.3.jar.sha1
    - Dependency checksum missing ('commons-fileupload:commons-fileupload:1.4'), expected it at: /home/jenkins/jenkins-slave/workspace/Solr/Solr-Check-cloud2refimpl/solr/licenses/commons-fileupload-1.4.jar.sha1
    - Dependency checksum missing ('commons-lang:commons-lang:2.6'), expected it at: /home/jenkins/jenkins-slave/workspace/Solr/Solr-Check-cloud2refimpl/solr/licenses/commons-lang-2.6.jar.sha1
    - Dependency checksum missing ('io.netty:netty-buffer:4.1.50.Final'), expected it at: /home/jenkins/jenkins-slave/workspace/Solr/Solr-Check-cloud2refimpl/solr/licenses/netty-buffer-4.1.50.Final.jar.sha1
    - Dependency checksum missing ('io.netty:netty-codec:4.1.50.Final'), expected it at: /home/jenkins/jenkins-slave/workspace/Solr/Solr-Check-cloud2refimpl/solr/licenses/netty-codec-4.1.50.Final.jar.sha1
    - Dependency checksum missing ('io.netty:netty-common:4.1.50.Final'), expected it at: /home/jenkins/jenkins-slave/workspace/Solr/Solr-Check-cloud2refimpl/solr/licenses/netty-common-4.1.50.Final.jar.sha1
    - Dependency checksum missing ('io.netty:netty-handler:4.1.50.Final'), expected it at: /home/jenkins/jenkins-slave/workspace/Solr/Solr-Check-cloud2refimpl/solr/licenses/netty-handler-4.1.50.Final.jar.sha1
    - Dependency checksum missing ('io.netty:netty-resolver:4.1.50.Final'), expected it at: /home/jenkins/jenkins-slave/workspace/Solr/Solr-Check-cloud2refimpl/solr/licenses/netty-resolver-4.1.50.Final.jar.sha1
    - Dependency checksum missing ('io.netty:netty-transport-native-epoll:4.1.50.Final'), expected it at: /home/jenkins/jenkins-slave/workspace/Solr/Solr-Check-cloud2refimpl/solr/licenses/netty-transport-native-epoll-4.1.50.Final.jar.sha1
    - Dependency checksum missing ('io.netty:netty-transport-native-unix-common:4.1.50.Final'), expected it at: /home/jenkins/jenkins-slave/workspace/Solr/Solr-Check-cloud2refimpl/solr/licenses/netty-transport-native-unix-common-4.1.50.Final.jar.sha1
    - Dependency checksum missing ('io.netty:netty-transport:4.1.50.Final'), expected it at: /home/jenkins/jenkins-slave/workspace/Solr/Solr-Check-cloud2refimpl/solr/licenses/netty-transport-4.1.50.Final.jar.sha1
    - Dependency checksum missing ('net.javacrumbs.json-unit:json-unit-core:2.12.0'), expected it at: /home/jenkins/jenkins-slave/workspace/Solr/Solr-Check-cloud2refimpl/solr/licenses/json-unit-core-2.12.0.jar.sha1
    - Dependency checksum missing ('net.minidev:accessors-smart:1.2'), expected it at: /home/jenkins/jenkins-slave/workspace/Solr/Solr-Check-cloud2refimpl/solr/licenses/accessors-smart-1.2.jar.sha1
    - Dependency checksum missing ('net.minidev:json-smart:2.3'), expected it at: /home/jenkins/jenkins-slave/workspace/Solr/Solr-Check-cloud2refimpl/solr/licenses/json-smart-2.3.jar.sha1
    - Dependency checksum missing ('net.sf.jopt-simple:jopt-simple:5.0.3'), expected it at: /home/jenkins/jenkins-slave/workspace/Solr/Solr-Check-cloud2refimpl/solr/licenses/jopt-simple-5.0.3.jar.sha1
    - Dependency checksum missing ('org.apache.httpcomponents:httpclient:4.5.12'), expected it at: /home/jenkins/jenkins-slave/workspace/Solr/Solr-Check-cloud2refimpl/solr/licenses/httpclient-4.5.12.jar.sha1
    - Dependency checksum missing ('org.apache.httpcomponents:httpcore:4.4.13'), expected it at: /home/jenkins/jenkins-slave/workspace/Solr/Solr-Check-cloud2refimpl/solr/licenses/httpcore-4.4.13.jar.sha1
    - Dependency checksum missing ('org.apache.httpcomponents:httpmime:4.5.12'), expected it at: /home/jenkins/jenkins-slave/workspace/Solr/Solr-Check-cloud2refimpl/solr/licenses/httpmime-4.5.12.jar.sha1
    - Dependency checksum missing ('org.apache.logging.log4j:log4j-api:2.14.0'), expected it at: /home/jenkins/jenkins-slave/workspace/Solr/Solr-Check-cloud2refimpl/solr/licenses/log4j-api-2.14.0.jar.sha1
    - Dependency checksum missing ('org.apache.logging.log4j:log4j-core:2.14.0'), expected it at: /home/jenkins/jenkins-slave/workspace/Solr/Solr-Check-cloud2refimpl/solr/licenses/log4j-core-2.14.0.jar.sha1
    - Dependency checksum missing ('org.apache.logging.log4j:log4j-slf4j-impl:2.14.0'), expected it at: /home/jenkins/jenkins-slave/workspace/Solr/Solr-Check-cloud2refimpl/solr/licenses/log4j-slf4j-impl-2.14.0.jar.sha1
    - Dependency checksum missing ('org.apache.zookeeper:zookeeper-jute:3.6.2'), expected it at: /home/jenkins/jenkins-slave/workspace/Solr/Solr-Check-cloud2refimpl/solr/licenses/zookeeper-jute-3.6.2.jar.sha1
    - Dependency checksum missing ('org.apache.zookeeper:zookeeper:3.6.2'), expected it at: /home/jenkins/jenkins-slave/workspace/Solr/Solr-Check-cloud2refimpl/solr/licenses/zookeeper-3.6.2.jar.sha1
    - Dependency checksum missing ('org.checkerframework:checker-qual:2.11.1'), expected it at: /home/jenkins/jenkins-slave/workspace/Solr/Solr-Check-cloud2refimpl/solr/licenses/checker-qual-2.11.1.jar.sha1
    - Dependency checksum missing ('org.codehaus.woodstox:stax2-api:4.2.1'), expected it at: /home/jenkins/jenkins-slave/workspace/Solr/Solr-Check-cloud2refimpl/solr/licenses/stax2-api-4.2.1.jar.sha1
    - Dependency checksum missing ('org.conscrypt:conscrypt-openjdk-uber:2.2.1'), expected it at: /home/jenkins/jenkins-slave/workspace/Solr/Solr-Check-cloud2refimpl/solr/licenses/conscrypt-openjdk-uber-2.2.1.jar.sha1
    - Dependency checksum missing ('org.eclipse.jetty.http2:http2-client:9.4.36.v20210114'), expected it at: /home/jenkins/jenkins-slave/workspace/Solr/Solr-Check-cloud2refimpl/solr/licenses/http2-client-9.4.36.v20210114.jar.sha1
    - Dependency checksum missing ('org.eclipse.jetty.http2:http2-common:9.4.36.v20210114'), expected it at: /home/jenkins/jenkins-slave/workspace/Solr/Solr-Check-cloud2refimpl/solr/licenses/http2-common-9.4.36.v20210114.jar.sha1
    - Dependency checksum missing ('org.eclipse.jetty.http2:http2-hpack:9.4.36.v20210114'), expected it at: /home/jenkins/jenkins-slave/workspace/Solr/Solr-Check-cloud2refimpl/solr/licenses/http2-hpack-9.4.36.v20210114.jar.sha1
    - Dependency checksum missing ('org.eclipse.jetty.http2:http2-http-client-transport:9.4.36.v20210114'), expected it at: /home/jenkins/jenkins-slave/workspace/Solr/Solr-Check-cloud2refimpl/solr/licenses/http2-http-client-transport-9.4.36.v20210114.jar.sha1
    - Dependency checksum missing ('org.eclipse.jetty:jetty-alpn-client:9.4.36.v20210114'), expected it at: /home/jenkins/jenkins-slave/workspace/Solr/Solr-Check-cloud2refimpl/solr/licenses/jetty-alpn-client-9.4.36.v20210114.jar.sha1
    - Dependency checksum missing ('org.eclipse.jetty:jetty-alpn-java-client:9.4.36.v20210114'), expected it at: /home/jenkins/jenkins-slave/workspace/Solr/Solr-Check-cloud2refimpl/solr/licenses/jetty-alpn-java-client-9.4.36.v20210114.jar.sha1
    - Dependency checksum missing ('org.eclipse.jetty:jetty-alpn-java-server:9.4.36.v20210114'), expected it at: /home/jenkins/jenkins-slave/workspace/Solr/Solr-Check-cloud2refimpl/solr/licenses/jetty-alpn-java-server-9.4.36.v20210114.jar.sha1
    - Dependency checksum missing ('org.eclipse.jetty:jetty-alpn-server:9.4.36.v20210114'), expected it at: /home/jenkins/jenkins-slave/workspace/Solr/Solr-Check-cloud2refimpl/solr/licenses/jetty-alpn-server-9.4.36.v20210114.jar.sha1
    - Dependency checksum missing ('org.eclipse.jetty:jetty-client:9.4.36.v20210114'), expected it at: /home/jenkins/jenkins-slave/workspace/Solr/Solr-Check-cloud2refimpl/solr/licenses/jetty-client-9.4.36.v20210114.jar.sha1
    - Dependency checksum missing ('org.eclipse.jetty:jetty-http:9.4.36.v20210114'), expected it at: /home/jenkins/jenkins-slave/workspace/Solr/Solr-Check-cloud2refimpl/solr/licenses/jetty-http-9.4.36.v20210114.jar.sha1
    - Dependency checksum missing ('org.eclipse.jetty:jetty-io:9.4.36.v20210114'), expected it at: /home/jenkins/jenkins-slave/workspace/Solr/Solr-Check-cloud2refimpl/solr/licenses/jetty-io-9.4.36.v20210114.jar.sha1
    - Dependency checksum missing ('org.eclipse.jetty:jetty-security:9.4.36.v20210114'), expected it at: /home/jenkins/jenkins-slave/workspace/Solr/Solr-Check-cloud2refimpl/solr/licenses/jetty-security-9.4.36.v20210114.jar.sha1
    - Dependency checksum missing ('org.eclipse.jetty:jetty-server:9.4.36.v20210114'), expected it at: /home/jenkins/jenkins-slave/workspace/Solr/Solr-Check-cloud2refimpl/solr/licenses/jetty-server-9.4.36.v20210114.jar.sha1
    - Dependency checksum missing ('org.eclipse.jetty:jetty-servlet:9.4.36.v20210114'), expected it at: /home/jenkins/jenkins-slave/workspace/Solr/Solr-Check-cloud2refimpl/solr/licenses/jetty-servlet-9.4.36.v20210114.jar.sha1
    - Dependency checksum missing ('org.eclipse.jetty:jetty-util-ajax:9.4.36.v20210114'), expected it at: /home/jenkins/jenkins-slave/workspace/Solr/Solr-Check-cloud2refimpl/solr/licenses/jetty-util-ajax-9.4.36.v20210114.jar.sha1
    - Dependency checksum missing ('org.eclipse.jetty:jetty-util:9.4.36.v20210114'), expected it at: /home/jenkins/jenkins-slave/workspace/Solr/Solr-Check-cloud2refimpl/solr/licenses/jetty-util-9.4.36.v20210114.jar.sha1
    - Dependency checksum missing ('org.eclipse.jetty:jetty-webapp:9.4.36.v20210114'), expected it at: /home/jenkins/jenkins-slave/workspace/Solr/Solr-Check-cloud2refimpl/solr/licenses/jetty-webapp-9.4.36.v20210114.jar.sha1
    - Dependency checksum missing ('org.eclipse.jetty:jetty-xml:9.4.36.v20210114'), expected it at: /home/jenkins/jenkins-slave/workspace/Solr/Solr-Check-cloud2refimpl/solr/licenses/jetty-xml-9.4.36.v20210114.jar.sha1
    - Dependency checksum missing ('org.hamcrest:hamcrest-core:2.2'), expected it at: /home/jenkins/jenkins-slave/workspace/Solr/Solr-Check-cloud2refimpl/solr/licenses/hamcrest-core-2.2.jar.sha1
    - Dependency checksum missing ('org.hamcrest:hamcrest:2.2'), expected it at: /home/jenkins/jenkins-slave/workspace/Solr/Solr-Check-cloud2refimpl/solr/licenses/hamcrest-2.2.jar.sha1
    - Dependency checksum missing ('org.jline:jline:3.19.0'), expected it at: /home/jenkins/jenkins-slave/workspace/Solr/Solr-Check-cloud2refimpl/solr/licenses/jline-3.19.0.jar.sha1
    - Dependency checksum missing ('org.lz4:lz4-java:1.7.1'), expected it at: /home/jenkins/jenkins-slave/workspace/Solr/Solr-Check-cloud2refimpl/solr/licenses/lz4-java-1.7.1.jar.sha1
    - Dependency checksum missing ('org.opentest4j:opentest4j:1.1.1'), expected it at: /home/jenkins/jenkins-slave/workspace/Solr/Solr-Check-cloud2refimpl/solr/licenses/opentest4j-1.1.1.jar.sha1
    - Dependency checksum missing ('org.ow2.asm:asm:9.0'), expected it at: /home/jenkins/jenkins-slave/workspace/Solr/Solr-Check-cloud2refimpl/solr/licenses/asm-9.0.jar.sha1
    - Dependency checksum missing ('org.xerial.snappy:snappy-java:1.1.8.1'), expected it at: /home/jenkins/jenkins-slave/workspace/Solr/Solr-Check-cloud2refimpl/solr/licenses/snappy-java-1.1.8.1.jar.sha1
    - Dependency checksum missing ('org.xmlunit:xmlunit-core:2.7.0'), expected it at: /home/jenkins/jenkins-slave/workspace/Solr/Solr-Check-cloud2refimpl/solr/licenses/xmlunit-core-2.7.0.jar.sha1
    - Dependency checksum missing ('org.xmlunit:xmlunit-legacy:2.7.0'), expected it at: /home/jenkins/jenkins-slave/workspace/Solr/Solr-Check-cloud2refimpl/solr/licenses/xmlunit-legacy-2.7.0.jar.sha1
    - Dependency checksum missing ('org.xmlunit:xmlunit-placeholders:2.7.0'), expected it at: /home/jenkins/jenkins-slave/workspace/Solr/Solr-Check-cloud2refimpl/solr/licenses/xmlunit-placeholders-2.7.0.jar.sha1

* Try:
Run with --stacktrace option to get the stack trace. Run with --info or --debug option to get more log output. Run with --scan to get full insights.
==============================================================================

16: Task failed with an exception.
-----------
* Where:
Script '/home/jenkins/jenkins-slave/workspace/Solr/Solr-Check-cloud2refimpl/gradle/validation/jar-checks.gradle' line: 264

* What went wrong:
Execution failed for task ':solr:solrj:validateJarLicenses'.
> Certain license/ notice files are missing:
    - License file missing ('com.fasterxml.woodstox:woodstox-core:6.2.3'), expected it at: /home/jenkins/jenkins-slave/workspace/Solr/Solr-Check-cloud2refimpl/solr/licenses/woodstox-core-LICENSE-[type].txt or /home/jenkins/jenkins-slave/workspace/Solr/Solr-Check-cloud2refimpl/solr/licenses/woodstox-LICENSE-[type].txt, where [type] can be any of [ASL, BSD, BSD_LIKE, CDDL, CPL, EPL, MIT, MPL, PD, SUN, COMPOUND].
    - License file missing ('com.flipkart.zjsonpatch:zjsonpatch:0.4.4'), expected it at: /home/jenkins/jenkins-slave/workspace/Solr/Solr-Check-cloud2refimpl/solr/licenses/zjsonpatch-LICENSE-[type].txt, where [type] can be any of [ASL, BSD, BSD_LIKE, CDDL, CPL, EPL, MIT, MPL, PD, SUN, COMPOUND].
    - License file missing ('com.github.jknack:handlebars-helpers:4.2.0'), expected it at: /home/jenkins/jenkins-slave/workspace/Solr/Solr-Check-cloud2refimpl/solr/licenses/handlebars-helpers-LICENSE-[type].txt or /home/jenkins/jenkins-slave/workspace/Solr/Solr-Check-cloud2refimpl/solr/licenses/handlebars-LICENSE-[type].txt, where [type] can be any of [ASL, BSD, BSD_LIKE, CDDL, CPL, EPL, MIT, MPL, PD, SUN, COMPOUND].
    - License file missing ('com.github.jknack:handlebars:4.2.0'), expected it at: /home/jenkins/jenkins-slave/workspace/Solr/Solr-Check-cloud2refimpl/solr/licenses/handlebars-LICENSE-[type].txt, where [type] can be any of [ASL, BSD, BSD_LIKE, CDDL, CPL, EPL, MIT, MPL, PD, SUN, COMPOUND].
    - License file missing ('com.github.tomakehurst:wiremock-jre8:2.27.0'), expected it at: /home/jenkins/jenkins-slave/workspace/Solr/Solr-Check-cloud2refimpl/solr/licenses/wiremock-jre8-LICENSE-[type].txt or /home/jenkins/jenkins-slave/workspace/Solr/Solr-Check-cloud2refimpl/solr/licenses/wiremock-LICENSE-[type].txt, where [type] can be any of [ASL, BSD, BSD_LIKE, CDDL, CPL, EPL, MIT, MPL, PD, SUN, COMPOUND].
    - License file missing ('com.google.guava:failureaccess:1.0.1'), expected it at: /home/jenkins/jenkins-slave/workspace/Solr/Solr-Check-cloud2refimpl/solr/licenses/failureaccess-LICENSE-[type].txt, where [type] can be any of [ASL, BSD, BSD_LIKE, CDDL, CPL, EPL, MIT, MPL, PD, SUN, COMPOUND].
    - License file missing ('com.google.guava:listenablefuture:9999.0-empty-to-avoid-conflict-with-guava'), expected it at: /home/jenkins/jenkins-slave/workspace/Solr/Solr-Check-cloud2refimpl/solr/licenses/listenablefuture-LICENSE-[type].txt, where [type] can be any of [ASL, BSD, BSD_LIKE, CDDL, CPL, EPL, MIT, MPL, PD, SUN, COMPOUND].
    - License file missing ('com.google.j2objc:j2objc-annotations:1.3'), expected it at: /home/jenkins/jenkins-slave/workspace/Solr/Solr-Check-cloud2refimpl/solr/licenses/j2objc-annotations-LICENSE-[type].txt or /home/jenkins/jenkins-slave/workspace/Solr/Solr-Check-cloud2refimpl/solr/licenses/j2objc-LICENSE-[type].txt, where [type] can be any of [ASL, BSD, BSD_LIKE, CDDL, CPL, EPL, MIT, MPL, PD, SUN, COMPOUND].
    - License file missing ('commons-fileupload:commons-fileupload:1.4'), expected it at: /home/jenkins/jenkins-slave/workspace/Solr/Solr-Check-cloud2refimpl/solr/licenses/commons-fileupload-LICENSE-[type].txt or /home/jenkins/jenkins-slave/workspace/Solr/Solr-Check-cloud2refimpl/solr/licenses/commons-LICENSE-[type].txt, where [type] can be any of [ASL, BSD, BSD_LIKE, CDDL, CPL, EPL, MIT, MPL, PD, SUN, COMPOUND].
    - License file missing ('commons-lang:commons-lang:2.6'), expected it at: /home/jenkins/jenkins-slave/workspace/Solr/Solr-Check-cloud2refimpl/solr/licenses/commons-lang-LICENSE-[type].txt or /home/jenkins/jenkins-slave/workspace/Solr/Solr-Check-cloud2refimpl/solr/licenses/commons-LICENSE-[type].txt, where [type] can be any of [ASL, BSD, BSD_LIKE, CDDL, CPL, EPL, MIT, MPL, PD, SUN, COMPOUND].
    - License file missing ('net.javacrumbs.json-unit:json-unit-core:2.12.0'), expected it at: /home/jenkins/jenkins-slave/workspace/Solr/Solr-Check-cloud2refimpl/solr/licenses/json-unit-core-LICENSE-[type].txt or /home/jenkins/jenkins-slave/workspace/Solr/Solr-Check-cloud2refimpl/solr/licenses/json-unit-LICENSE-[type].txt or /home/jenkins/jenkins-slave/workspace/Solr/Solr-Check-cloud2refimpl/solr/licenses/json-LICENSE-[type].txt, where [type] can be any of [ASL, BSD, BSD_LIKE, CDDL, CPL, EPL, MIT, MPL, PD, SUN, COMPOUND].
    - License file missing ('net.minidev:accessors-smart:1.2'), expected it at: /home/jenkins/jenkins-slave/workspace/Solr/Solr-Check-cloud2refimpl/solr/licenses/accessors-smart-LICENSE-[type].txt or /home/jenkins/jenkins-slave/workspace/Solr/Solr-Check-cloud2refimpl/solr/licenses/accessors-LICENSE-[type].txt, where [type] can be any of [ASL, BSD, BSD_LIKE, CDDL, CPL, EPL, MIT, MPL, PD, SUN, COMPOUND].
    - License file missing ('net.minidev:json-smart:2.3'), expected it at: /home/jenkins/jenkins-slave/workspace/Solr/Solr-Check-cloud2refimpl/solr/licenses/json-smart-LICENSE-[type].txt or /home/jenkins/jenkins-slave/workspace/Solr/Solr-Check-cloud2refimpl/solr/licenses/json-LICENSE-[type].txt, where [type] can be any of [ASL, BSD, BSD_LIKE, CDDL, CPL, EPL, MIT, MPL, PD, SUN, COMPOUND].
    - License file missing ('net.sf.jopt-simple:jopt-simple:5.0.3'), expected it at: /home/jenkins/jenkins-slave/workspace/Solr/Solr-Check-cloud2refimpl/solr/licenses/jopt-simple-LICENSE-[type].txt or /home/jenkins/jenkins-slave/workspace/Solr/Solr-Check-cloud2refimpl/solr/licenses/jopt-LICENSE-[type].txt, where [type] can be any of [ASL, BSD, BSD_LIKE, CDDL, CPL, EPL, MIT, MPL, PD, SUN, COMPOUND].
    - License file missing ('org.checkerframework:checker-qual:2.11.1'), expected it at: /home/jenkins/jenkins-slave/workspace/Solr/Solr-Check-cloud2refimpl/solr/licenses/checker-qual-LICENSE-[type].txt or /home/jenkins/jenkins-slave/workspace/Solr/Solr-Check-cloud2refimpl/solr/licenses/checker-LICENSE-[type].txt, where [type] can be any of [ASL, BSD, BSD_LIKE, CDDL, CPL, EPL, MIT, MPL, PD, SUN, COMPOUND].
    - License file missing ('org.conscrypt:conscrypt-openjdk-uber:2.2.1'), expected it at: /home/jenkins/jenkins-slave/workspace/Solr/Solr-Check-cloud2refimpl/solr/licenses/conscrypt-openjdk-uber-LICENSE-[type].txt or /home/jenkins/jenkins-slave/workspace/Solr/Solr-Check-cloud2refimpl/solr/licenses/conscrypt-openjdk-LICENSE-[type].txt or /home/jenkins/jenkins-slave/workspace/Solr/Solr-Check-cloud2refimpl/solr/licenses/conscrypt-LICENSE-[type].txt, where [type] can be any of [ASL, BSD, BSD_LIKE, CDDL, CPL, EPL, MIT, MPL, PD, SUN, COMPOUND].
    - License file missing ('org.hamcrest:hamcrest:2.2'), expected it at: /home/jenkins/jenkins-slave/workspace/Solr/Solr-Check-cloud2refimpl/solr/licenses/hamcrest-LICENSE-[type].txt, where [type] can be any of [ASL, BSD, BSD_LIKE, CDDL, CPL, EPL, MIT, MPL, PD, SUN, COMPOUND].
    - License file missing ('org.jline:jline:3.19.0'), expected it at: /home/jenkins/jenkins-slave/workspace/Solr/Solr-Check-cloud2refimpl/solr/licenses/jline-LICENSE-[type].txt, where [type] can be any of [ASL, BSD, BSD_LIKE, CDDL, CPL, EPL, MIT, MPL, PD, SUN, COMPOUND].
    - License file missing ('org.lz4:lz4-java:1.7.1'), expected it at: /home/jenkins/jenkins-slave/workspace/Solr/Solr-Check-cloud2refimpl/solr/licenses/lz4-java-LICENSE-[type].txt or /home/jenkins/jenkins-slave/workspace/Solr/Solr-Check-cloud2refimpl/solr/licenses/lz4-LICENSE-[type].txt, where [type] can be any of [ASL, BSD, BSD_LIKE, CDDL, CPL, EPL, MIT, MPL, PD, SUN, COMPOUND].
    - License file missing ('org.opentest4j:opentest4j:1.1.1'), expected it at: /home/jenkins/jenkins-slave/workspace/Solr/Solr-Check-cloud2refimpl/solr/licenses/opentest4j-LICENSE-[type].txt, where [type] can be any of [ASL, BSD, BSD_LIKE, CDDL, CPL, EPL, MIT, MPL, PD, SUN, COMPOUND].
    - License file missing ('org.xerial.snappy:snappy-java:1.1.8.1'), expected it at: /home/jenkins/jenkins-slave/workspace/Solr/Solr-Check-cloud2refimpl/solr/licenses/snappy-java-LICENSE-[type].txt or /home/jenkins/jenkins-slave/workspace/Solr/Solr-Check-cloud2refimpl/solr/licenses/snappy-LICENSE-[type].txt, where [type] can be any of [ASL, BSD, BSD_LIKE, CDDL, CPL, EPL, MIT, MPL, PD, SUN, COMPOUND].
    - License file missing ('org.xmlunit:xmlunit-core:2.7.0'), expected it at: /home/jenkins/jenkins-slave/workspace/Solr/Solr-Check-cloud2refimpl/solr/licenses/xmlunit-core-LICENSE-[type].txt or /home/jenkins/jenkins-slave/workspace/Solr/Solr-Check-cloud2refimpl/solr/licenses/xmlunit-LICENSE-[type].txt, where [type] can be any of [ASL, BSD, BSD_LIKE, CDDL, CPL, EPL, MIT, MPL, PD, SUN, COMPOUND].
    - License file missing ('org.xmlunit:xmlunit-legacy:2.7.0'), expected it at: /home/jenkins/jenkins-slave/workspace/Solr/Solr-Check-cloud2refimpl/solr/licenses/xmlunit-legacy-LICENSE-[type].txt or /home/jenkins/jenkins-slave/workspace/Solr/Solr-Check-cloud2refimpl/solr/licenses/xmlunit-LICENSE-[type].txt, where [type] can be any of [ASL, BSD, BSD_LIKE, CDDL, CPL, EPL, MIT, MPL, PD, SUN, COMPOUND].
    - License file missing ('org.xmlunit:xmlunit-placeholders:2.7.0'), expected it at: /home/jenkins/jenkins-slave/workspace/Solr/Solr-Check-cloud2refimpl/solr/licenses/xmlunit-placeholders-LICENSE-[type].txt or /home/jenkins/jenkins-slave/workspace/Solr/Solr-Check-cloud2refimpl/solr/licenses/xmlunit-LICENSE-[type].txt, where [type] can be any of [ASL, BSD, BSD_LIKE, CDDL, CPL, EPL, MIT, MPL, PD, SUN, COMPOUND].

* Try:
Run with --stacktrace option to get the stack trace. Run with --info or --debug option to get more log output. Run with --scan to get full insights.
==============================================================================

17: Task failed with an exception.
-----------
* Where:
Script '/home/jenkins/jenkins-slave/workspace/Solr/Solr-Check-cloud2refimpl/gradle/validation/jar-checks.gradle' line: 197

* What went wrong:
Execution failed for task ':solr:test-framework:validateJarChecksums'.
> Dependency checksum validation failed:
    - Dependency checksum missing ('junit:junit:4.13.1'), expected it at: /home/jenkins/jenkins-slave/workspace/Solr/Solr-Check-cloud2refimpl/solr/licenses/junit-4.13.1.jar.sha1
    - Dependency checksum missing ('org.apache.logging.log4j:log4j-api:2.14.0'), expected it at: /home/jenkins/jenkins-slave/workspace/Solr/Solr-Check-cloud2refimpl/solr/licenses/log4j-api-2.14.0.jar.sha1
    - Dependency checksum missing ('org.apache.logging.log4j:log4j-core:2.14.0'), expected it at: /home/jenkins/jenkins-slave/workspace/Solr/Solr-Check-cloud2refimpl/solr/licenses/log4j-core-2.14.0.jar.sha1
    - Dependency checksum missing ('org.awaitility:awaitility:4.0.3'), expected it at: /home/jenkins/jenkins-slave/workspace/Solr/Solr-Check-cloud2refimpl/solr/licenses/awaitility-4.0.3.jar.sha1
    - Dependency checksum missing ('org.eclipse.jetty:jetty-http:9.4.36.v20210114'), expected it at: /home/jenkins/jenkins-slave/workspace/Solr/Solr-Check-cloud2refimpl/solr/licenses/jetty-http-9.4.36.v20210114.jar.sha1
    - Dependency checksum missing ('org.eclipse.jetty:jetty-io:9.4.36.v20210114'), expected it at: /home/jenkins/jenkins-slave/workspace/Solr/Solr-Check-cloud2refimpl/solr/licenses/jetty-io-9.4.36.v20210114.jar.sha1
    - Dependency checksum missing ('org.eclipse.jetty:jetty-server:9.4.36.v20210114'), expected it at: /home/jenkins/jenkins-slave/workspace/Solr/Solr-Check-cloud2refimpl/solr/licenses/jetty-server-9.4.36.v20210114.jar.sha1
    - Dependency checksum missing ('org.eclipse.jetty:jetty-util:9.4.36.v20210114'), expected it at: /home/jenkins/jenkins-slave/workspace/Solr/Solr-Check-cloud2refimpl/solr/licenses/jetty-util-9.4.36.v20210114.jar.sha1
    - Dependency checksum missing ('org.hamcrest:hamcrest-core:2.2'), expected it at: /home/jenkins/jenkins-slave/workspace/Solr/Solr-Check-cloud2refimpl/solr/licenses/hamcrest-core-2.2.jar.sha1
    - Dependency checksum missing ('org.hamcrest:hamcrest:2.2'), expected it at: /home/jenkins/jenkins-slave/workspace/Solr/Solr-Check-cloud2refimpl/solr/licenses/hamcrest-2.2.jar.sha1

* Try:
Run with --stacktrace option to get the stack trace. Run with --info or --debug option to get more log output. Run with --scan to get full insights.
==============================================================================

18: Task failed with an exception.
-----------
* Where:
Script '/home/jenkins/jenkins-slave/workspace/Solr/Solr-Check-cloud2refimpl/gradle/validation/jar-checks.gradle' line: 264

* What went wrong:
Execution failed for task ':solr:test-framework:validateJarLicenses'.
> Certain license/ notice files are missing:
    - License file missing ('org.awaitility:awaitility:4.0.3'), expected it at: /home/jenkins/jenkins-slave/workspace/Solr/Solr-Check-cloud2refimpl/solr/licenses/awaitility-LICENSE-[type].txt, where [type] can be any of [ASL, BSD, BSD_LIKE, CDDL, CPL, EPL, MIT, MPL, PD, SUN, COMPOUND].
    - License file missing ('org.hamcrest:hamcrest:2.2'), expected it at: /home/jenkins/jenkins-slave/workspace/Solr/Solr-Check-cloud2refimpl/solr/licenses/hamcrest-LICENSE-[type].txt, where [type] can be any of [ASL, BSD, BSD_LIKE, CDDL, CPL, EPL, MIT, MPL, PD, SUN, COMPOUND].

* Try:
Run with --stacktrace option to get the stack trace. Run with --info or --debug option to get more log output. Run with --scan to get full insights.
==============================================================================

19: Task failed with an exception.
-----------
* Where:
Script '/home/jenkins/jenkins-slave/workspace/Solr/Solr-Check-cloud2refimpl/gradle/validation/jar-checks.gradle' line: 197

* What went wrong:
Execution failed for task ':solr:contrib:clustering:validateJarChecksums'.
> Dependency checksum validation failed:
    - Dependency checksum missing ('com.carrotsearch:hppc:0.8.2'), expected it at: /home/jenkins/jenkins-slave/workspace/Solr/Solr-Check-cloud2refimpl/solr/licenses/hppc-0.8.2.jar.sha1
    - Dependency checksum missing ('com.fasterxml.jackson.core:jackson-annotations:2.12.1'), expected it at: /home/jenkins/jenkins-slave/workspace/Solr/Solr-Check-cloud2refimpl/solr/licenses/jackson-annotations-2.12.1.jar.sha1
    - Dependency checksum missing ('com.fasterxml.jackson.core:jackson-core:2.12.1'), expected it at: /home/jenkins/jenkins-slave/workspace/Solr/Solr-Check-cloud2refimpl/solr/licenses/jackson-core-2.12.1.jar.sha1
    - Dependency checksum missing ('com.fasterxml.jackson.core:jackson-databind:2.12.1'), expected it at: /home/jenkins/jenkins-slave/workspace/Solr/Solr-Check-cloud2refimpl/solr/licenses/jackson-databind-2.12.1.jar.sha1
    - Dependency checksum missing ('org.apache.commons:commons-lang3:3.11'), expected it at: /home/jenkins/jenkins-slave/workspace/Solr/Solr-Check-cloud2refimpl/solr/licenses/commons-lang3-3.11.jar.sha1

* Try:
Run with --stacktrace option to get the stack trace. Run with --info or --debug option to get more log output. Run with --scan to get full insights.
==============================================================================

20: Task failed with an exception.
-----------
* Where:
Script '/home/jenkins/jenkins-slave/workspace/Solr/Solr-Check-cloud2refimpl/gradle/validation/jar-checks.gradle' line: 197

* What went wrong:
Execution failed for task ':solr:contrib:dataimporthandler:validateJarChecksums'.
> Dependency checksum validation failed:
    - Dependency checksum missing ('xerces:xercesImpl:2.12.1'), expected it at: /home/jenkins/jenkins-slave/workspace/Solr/Solr-Check-cloud2refimpl/solr/licenses/xercesImpl-2.12.1.jar.sha1
    - Dependency checksum missing ('xml-apis:xml-apis:1.4.01'), expected it at: /home/jenkins/jenkins-slave/workspace/Solr/Solr-Check-cloud2refimpl/solr/licenses/xml-apis-1.4.01.jar.sha1

* Try:
Run with --stacktrace option to get the stack trace. Run with --info or --debug option to get more log output. Run with --scan to get full insights.
==============================================================================

21: Task failed with an exception.
-----------
* Where:
Script '/home/jenkins/jenkins-slave/workspace/Solr/Solr-Check-cloud2refimpl/gradle/validation/jar-checks.gradle' line: 264

* What went wrong:
Execution failed for task ':solr:contrib:dataimporthandler:validateJarLicenses'.
> Certain license/ notice files are missing:
    - License file missing ('xml-apis:xml-apis:1.4.01'), expected it at: /home/jenkins/jenkins-slave/workspace/Solr/Solr-Check-cloud2refimpl/solr/licenses/xml-apis-LICENSE-[type].txt or /home/jenkins/jenkins-slave/workspace/Solr/Solr-Check-cloud2refimpl/solr/licenses/xml-LICENSE-[type].txt, where [type] can be any of [ASL, BSD, BSD_LIKE, CDDL, CPL, EPL, MIT, MPL, PD, SUN, COMPOUND].

* Try:
Run with --stacktrace option to get the stack trace. Run with --info or --debug option to get more log output. Run with --scan to get full insights.
==============================================================================

22: Task failed with an exception.
-----------
* Where:
Script '/home/jenkins/jenkins-slave/workspace/Solr/Solr-Check-cloud2refimpl/gradle/validation/jar-checks.gradle' line: 197

* What went wrong:
Execution failed for task ':solr:contrib:extraction:validateJarChecksums'.
> Dependency checksum validation failed:
    - Dependency checksum missing ('org.apache.commons:commons-collections4:4.4'), expected it at: /home/jenkins/jenkins-slave/workspace/Solr/Solr-Check-cloud2refimpl/solr/licenses/commons-collections4-4.4.jar.sha1
    - Dependency checksum missing ('xerces:xercesImpl:2.12.1'), expected it at: /home/jenkins/jenkins-slave/workspace/Solr/Solr-Check-cloud2refimpl/solr/licenses/xercesImpl-2.12.1.jar.sha1
    - Dependency checksum missing ('xml-apis:xml-apis:1.4.01'), expected it at: /home/jenkins/jenkins-slave/workspace/Solr/Solr-Check-cloud2refimpl/solr/licenses/xml-apis-1.4.01.jar.sha1

* Try:
Run with --stacktrace option to get the stack trace. Run with --info or --debug option to get more log output. Run with --scan to get full insights.
==============================================================================

23: Task failed with an exception.
-----------
* Where:
Script '/home/jenkins/jenkins-slave/workspace/Solr/Solr-Check-cloud2refimpl/gradle/validation/jar-checks.gradle' line: 264

* What went wrong:
Execution failed for task ':solr:contrib:extraction:validateJarLicenses'.
> Certain license/ notice files are missing:
    - License file missing ('xml-apis:xml-apis:1.4.01'), expected it at: /home/jenkins/jenkins-slave/workspace/Solr/Solr-Check-cloud2refimpl/solr/licenses/xml-apis-LICENSE-[type].txt or /home/jenkins/jenkins-slave/workspace/Solr/Solr-Check-cloud2refimpl/solr/licenses/xml-LICENSE-[type].txt, where [type] can be any of [ASL, BSD, BSD_LIKE, CDDL, CPL, EPL, MIT, MPL, PD, SUN, COMPOUND].

* Try:
Run with --stacktrace option to get the stack trace. Run with --info or --debug option to get more log output. Run with --scan to get full insights.
==============================================================================

24: Task failed with an exception.
-----------
* Where:
Script '/home/jenkins/jenkins-slave/workspace/Solr/Solr-Check-cloud2refimpl/gradle/validation/jar-checks.gradle' line: 197

* What went wrong:
Execution failed for task ':solr:contrib:prometheus-exporter:validateJarChecksums'.
> Dependency checksum validation failed:
    - Dependency checksum missing ('com.fasterxml.jackson.core:jackson-annotations:2.12.1'), expected it at: /home/jenkins/jenkins-slave/workspace/Solr/Solr-Check-cloud2refimpl/solr/licenses/jackson-annotations-2.12.1.jar.sha1
    - Dependency checksum missing ('com.fasterxml.jackson.core:jackson-core:2.12.1'), expected it at: /home/jenkins/jenkins-slave/workspace/Solr/Solr-Check-cloud2refimpl/solr/licenses/jackson-core-2.12.1.jar.sha1
    - Dependency checksum missing ('com.fasterxml.jackson.core:jackson-databind:2.12.1'), expected it at: /home/jenkins/jenkins-slave/workspace/Solr/Solr-Check-cloud2refimpl/solr/licenses/jackson-databind-2.12.1.jar.sha1
    - Dependency checksum missing ('org.apache.httpcomponents:httpcore:4.4.13'), expected it at: /home/jenkins/jenkins-slave/workspace/Solr/Solr-Check-cloud2refimpl/solr/licenses/httpcore-4.4.13.jar.sha1
    - Dependency checksum missing ('org.eclipse.jetty:jetty-http:9.4.36.v20210114'), expected it at: /home/jenkins/jenkins-slave/workspace/Solr/Solr-Check-cloud2refimpl/solr/licenses/jetty-http-9.4.36.v20210114.jar.sha1
    - Dependency checksum missing ('org.eclipse.jetty:jetty-io:9.4.36.v20210114'), expected it at: /home/jenkins/jenkins-slave/workspace/Solr/Solr-Check-cloud2refimpl/solr/licenses/jetty-io-9.4.36.v20210114.jar.sha1
    - Dependency checksum missing ('org.eclipse.jetty:jetty-security:9.4.36.v20210114'), expected it at: /home/jenkins/jenkins-slave/workspace/Solr/Solr-Check-cloud2refimpl/solr/licenses/jetty-security-9.4.36.v20210114.jar.sha1
    - Dependency checksum missing ('org.eclipse.jetty:jetty-server:9.4.36.v20210114'), expected it at: /home/jenkins/jenkins-slave/workspace/Solr/Solr-Check-cloud2refimpl/solr/licenses/jetty-server-9.4.36.v20210114.jar.sha1
    - Dependency checksum missing ('org.eclipse.jetty:jetty-servlet:9.4.36.v20210114'), expected it at: /home/jenkins/jenkins-slave/workspace/Solr/Solr-Check-cloud2refimpl/solr/licenses/jetty-servlet-9.4.36.v20210114.jar.sha1
    - Dependency checksum missing ('org.eclipse.jetty:jetty-util-ajax:9.4.36.v20210114'), expected it at: /home/jenkins/jenkins-slave/workspace/Solr/Solr-Check-cloud2refimpl/solr/licenses/jetty-util-ajax-9.4.36.v20210114.jar.sha1
    - Dependency checksum missing ('org.eclipse.jetty:jetty-util:9.4.36.v20210114'), expected it at: /home/jenkins/jenkins-slave/workspace/Solr/Solr-Check-cloud2refimpl/solr/licenses/jetty-util-9.4.36.v20210114.jar.sha1

* Try:
Run with --stacktrace option to get the stack trace. Run with --info or --debug option to get more log output. Run with --scan to get full insights.
==============================================================================

25: Task failed with an exception.
-----------
* Where:
Script '/home/jenkins/jenkins-slave/workspace/Solr/Solr-Check-cloud2refimpl/gradle/validation/jar-checks.gradle' line: 197

* What went wrong:
Execution failed for task ':solr:contrib:velocity:validateJarChecksums'.
> Dependency checksum validation failed:
    - Dependency checksum missing ('org.apache.commons:commons-lang3:3.11'), expected it at: /home/jenkins/jenkins-slave/workspace/Solr/Solr-Check-cloud2refimpl/solr/licenses/commons-lang3-3.11.jar.sha1

* Try:
Run with --stacktrace option to get the stack trace. Run with --info or --debug option to get more log output. Run with --scan to get full insights.
==============================================================================

26: Task failed with an exception.
-----------
* Where:
Script '/home/jenkins/jenkins-slave/workspace/Solr/Solr-Check-cloud2refimpl/gradle/documentation/render-javadoc.gradle' line: 576

* What went wrong:
Execution failed for task ':lucene:core:renderJavadoc'.
> Javadoc generation failed for :lucene:core,
    Options file at: /home/jenkins/jenkins-slave/workspace/Solr/Solr-Check-cloud2refimpl/lucene/core/build/tmp/renderJavadoc/javadoc-options.txt
    Command output at: /home/jenkins/jenkins-slave/workspace/Solr/Solr-Check-cloud2refimpl/lucene/core/build/tmp/renderJavadoc/javadoc-output.txt

* Try:
Run with --stacktrace option to get the stack trace. Run with --info or --debug option to get more log output. Run with --scan to get full insights.
==============================================================================

27: Task failed with an exception.
-----------
* What went wrong:
Execution failed for task ':solr:core:ecjLintMain'.
> Process 'command '/usr/local/asfpackages/java/oraclejdk-11.0.9/bin/java'' finished with non-zero exit value 255

* Try:
Run with --stacktrace option to get the stack trace. Run with --info or --debug option to get more log output. Run with --scan to get full insights.
==============================================================================

28: Task failed with an exception.
-----------
* What went wrong:
Execution failed for task ':solr:core:ecjLintTest'.
> Process 'command '/usr/local/asfpackages/java/oraclejdk-11.0.9/bin/java'' finished with non-zero exit value 255

* Try:
Run with --stacktrace option to get the stack trace. Run with --info or --debug option to get more log output. Run with --scan to get full insights.
==============================================================================

29: Task failed with an exception.
-----------
* What went wrong:
Execution failed for task ':solr:core:forbiddenApisMain'.
> de.thetaphi.forbiddenapis.ForbiddenApiException: Check for forbidden API calls failed, see log.

* Try:
Run with --stacktrace option to get the stack trace. Run with --info or --debug option to get more log output. Run with --scan to get full insights.
==============================================================================

30: Task failed with an exception.
-----------
* What went wrong:
Execution failed for task ':solr:core:forbiddenApisTest'.
> de.thetaphi.forbiddenapis.ForbiddenApiException: Check for forbidden API calls failed, see log.

* Try:
Run with --stacktrace option to get the stack trace. Run with --info or --debug option to get more log output. Run with --scan to get full insights.
==============================================================================

31: Task failed with an exception.
-----------
* Where:
Script '/home/jenkins/jenkins-slave/workspace/Solr/Solr-Check-cloud2refimpl/gradle/documentation/render-javadoc.gradle' line: 576

* What went wrong:
Execution failed for task ':solr:solrj:renderJavadoc'.
> Javadoc generation failed for :solr:solrj,
    Options file at: /home/jenkins/jenkins-slave/workspace/Solr/Solr-Check-cloud2refimpl/solr/solrj/build/tmp/renderJavadoc/javadoc-options.txt
    Command output at: /home/jenkins/jenkins-slave/workspace/Solr/Solr-Check-cloud2refimpl/solr/solrj/build/tmp/renderJavadoc/javadoc-output.txt

* Try:
Run with --stacktrace option to get the stack trace. Run with --info or --debug option to get more log output. Run with --scan to get full insights.
==============================================================================

32: Task failed with an exception.
-----------
* Where:
Script '/home/jenkins/jenkins-slave/workspace/Solr/Solr-Check-cloud2refimpl/gradle/validation/validate-log-calls.gradle' line: 243

* What went wrong:
Execution failed for task ':solr:core:validateLogCalls'.
> Found 751 violations in source files (
  cause: 'hasPlus: true' Suspicious logging call, Parameterize and possibly surround with 'if (log.is*Enabled) {..}'. Help at: 'gradlew helpValidateLogCalls' 
      /home/jenkins/jenkins-slave/workspace/Solr/Solr-Check-cloud2refimpl/solr/core/src/java/org/apache/solr/metrics/reporters/jmx/JmxMetricsReporter.java:537, 
  cause: 'hasPlus: true' Suspicious logging call, Parameterize and possibly surround with 'if (log.is*Enabled) {..}'. Help at: 'gradlew helpValidateLogCalls' 
      /home/jenkins/jenkins-slave/workspace/Solr/Solr-Check-cloud2refimpl/solr/core/src/java/org/apache/solr/metrics/SolrMetricManager.java:574, 
  Found an unexpected log level: isdebugenabled, file: /home/jenkins/jenkins-slave/workspace/Solr/Solr-Check-cloud2refimpl/solr/core/src/java/org/apache/solr/metrics/SolrMetricManager.java:1119, 
  cause: 'hasPlus: true' Suspicious logging call, Parameterize and possibly surround with 'if (log.is*Enabled) {..}'. Help at: 'gradlew helpValidateLogCalls' 
      /home/jenkins/jenkins-slave/workspace/Solr/Solr-Check-cloud2refimpl/solr/core/src/java/org/apache/solr/metrics/SolrMetricManager.java:1119, 
  Found an unexpected log level: isdebugenabled, file: /home/jenkins/jenkins-slave/workspace/Solr/Solr-Check-cloud2refimpl/solr/core/src/java/org/apache/solr/client/solrj/embedded/JettySolrRunner.java:417, 
  cause: 'hasParens true prevLineNotIf true pernicketyLevel true' Suspicious logging call, Parameterize and possibly surround with 'if (log.is*Enabled) {..}'. Help at: 'gradlew helpValidateLogCalls' 
      /home/jenkins/jenkins-slave/workspace/Solr/Solr-Check-cloud2refimpl/solr/core/src/java/org/apache/solr/client/solrj/embedded/JettySolrRunner.java:417, 
  Found an unexpected log level: isdebugenabled, file: /home/jenkins/jenkins-slave/workspace/Solr/Solr-Check-cloud2refimpl/solr/core/src/java/org/apache/solr/client/solrj/embedded/JettySolrRunner.java:573, 
  cause: 'hasParens true prevLineNotIf true pernicketyLevel true' Suspicious logging call, Parameterize and possibly surround with 'if (log.is*Enabled) {..}'. Help at: 'gradlew helpValidateLogCalls' 
      /home/jenkins/jenkins-slave/workspace/Solr/Solr-Check-cloud2refimpl/solr/core/src/java/org/apache/solr/client/solrj/embedded/JettySolrRunner.java:573, 
  Found an unexpected log level: isdebugenabled, file: /home/jenkins/jenkins-slave/workspace/Solr/Solr-Check-cloud2refimpl/solr/core/src/java/org/apache/solr/client/solrj/embedded/JettySolrRunner.java:610, 
  cause: 'hasParens true prevLineNotIf true pernicketyLevel true' Suspicious logging call, Parameterize and possibly surround with 'if (log.is*Enabled) {..}'. Help at: 'gradlew helpValidateLogCalls' 
      /home/jenkins/jenkins-slave/workspace/Solr/Solr-Check-cloud2refimpl/solr/core/src/java/org/apache/solr/client/solrj/embedded/JettySolrRunner.java:610, 
  cause: 'hasParens true prevLineNotIf true pernicketyLevel true' Suspicious logging call, Parameterize and possibly surround with 'if (log.is*Enabled) {..}'. Help at: 'gradlew helpValidateLogCalls' 
      /home/jenkins/jenkins-slave/workspace/Solr/Solr-Check-cloud2refimpl/solr/core/src/java/org/apache/solr/client/solrj/embedded/JettySolrRunner.java:700, 
  cause: 'hasParens true prevLineNotIf true pernicketyLevel true' Suspicious logging call, Parameterize and possibly surround with 'if (log.is*Enabled) {..}'. Help at: 'gradlew helpValidateLogCalls' 
      /home/jenkins/jenkins-slave/workspace/Solr/Solr-Check-cloud2refimpl/solr/core/src/java/org/apache/solr/client/solrj/embedded/JettySolrRunner.java:706, 
  cause: 'hasParens true prevLineNotIf true pernicketyLevel true' Suspicious logging call, Parameterize and possibly surround with 'if (log.is*Enabled) {..}'. Help at: 'gradlew helpValidateLogCalls' 
      /home/jenk

[...truncated too long message...]


  Found an unexpected log level: istraceenabled, file: /home/jenkins/jenkins-slave/workspace/Solr/Solr-Check-cloud2refimpl/solr/solrj/src/java/org/apache/solr/common/ParWork.java:468, 
  cause: 'hasParens true prevLineNotIf true pernicketyLevel true' Suspicious logging call, Parameterize and possibly surround with 'if (log.is*Enabled) {..}'. Help at: 'gradlew helpValidateLogCalls' 
      /home/jenkins/jenkins-slave/workspace/Solr/Solr-Check-cloud2refimpl/solr/solrj/src/java/org/apache/solr/common/ParWork.java:468, 
  cause: 'hasPlus: true' Suspicious logging call, Parameterize and possibly surround with 'if (log.is*Enabled) {..}'. Help at: 'gradlew helpValidateLogCalls' 
      /home/jenkins/jenkins-slave/workspace/Solr/Solr-Check-cloud2refimpl/solr/solrj/src/java/org/apache/solr/common/ParWork.java:511, 
  cause: 'hasPlus: true' Suspicious logging call, Parameterize and possibly surround with 'if (log.is*Enabled) {..}'. Help at: 'gradlew helpValidateLogCalls' 
      /home/jenkins/jenkins-slave/workspace/Solr/Solr-Check-cloud2refimpl/solr/solrj/src/java/org/apache/solr/common/ParWork.java:516, 
  Found an unexpected log level: istraceenabled, file: /home/jenkins/jenkins-slave/workspace/Solr/Solr-Check-cloud2refimpl/solr/solrj/src/java/org/apache/solr/common/ParWork.java:532, 
  cause: 'hasParens true prevLineNotIf true pernicketyLevel true' Suspicious logging call, Parameterize and possibly surround with 'if (log.is*Enabled) {..}'. Help at: 'gradlew helpValidateLogCalls' 
      /home/jenkins/jenkins-slave/workspace/Solr/Solr-Check-cloud2refimpl/solr/solrj/src/java/org/apache/solr/common/ParWork.java:532, 
  cause: 'hasPlus: true' Suspicious logging call, Parameterize and possibly surround with 'if (log.is*Enabled) {..}'. Help at: 'gradlew helpValidateLogCalls' 
      /home/jenkins/jenkins-slave/workspace/Solr/Solr-Check-cloud2refimpl/solr/solrj/src/java/org/apache/solr/common/ParWork.java:562, 
  cause: 'hasPlus: true' Suspicious logging call, Parameterize and possibly surround with 'if (log.is*Enabled) {..}'. Help at: 'gradlew helpValidateLogCalls' 
      /home/jenkins/jenkins-slave/workspace/Solr/Solr-Check-cloud2refimpl/solr/solrj/src/java/org/apache/solr/common/ParWork.java:564, 
  Change the logger name to lower-case 'log' in SolrQueuedThreadPool.java   private static final Logger LOG = LoggerFactory.getLogger(MethodHandles.lookup().lookupClass()); projectproject ':solr:solrj', 
  Change the logger name to lower-case 'log' in ZooKeeperExposed.java     private static final Logger LOG = LoggerFactory.getLogger(ZooKeeperTestable.class); projectproject ':solr:solrj', 
  cause: 'hasParens true prevLineNotIf true pernicketyLevel true' Suspicious logging call, Parameterize and possibly surround with 'if (log.is*Enabled) {..}'. Help at: 'gradlew helpValidateLogCalls' 
      /home/jenkins/jenkins-slave/workspace/Solr/Solr-Check-cloud2refimpl/solr/solrj/src/test/org/apache/solr/client/solrj/impl/BaseSolrClientWireMockTest.java:156, 
  Change the logger name to lower-case 'log' in SolrProvider.java   private static final Logger LOGGER = StatusLogger.getLogger(); projectproject ':solr:solrj').

* Try:
Run with --stacktrace option to get the stack trace. Run with --info or --debug option to get more log output. Run with --scan to get full insights.
==============================================================================

40: Task failed with an exception.
-----------
* Where:
Script '/home/jenkins/jenkins-slave/workspace/Solr/Solr-Check-cloud2refimpl/gradle/validation/validate-source-patterns.gradle' line: 324

* What went wrong:
Execution failed for task ':solr:solrj:validateSourcePatterns'.
> Found 20 violations in source files (invalid logger name [log, uses static class name, not specialized logger], invalid logging pattern [not private static final, uses static class name]).

* Try:
Run with --stacktrace option to get the stack trace. Run with --info or --debug option to get more log output. Run with --scan to get full insights.
==============================================================================

41: Task failed with an exception.
-----------
* What went wrong:
Execution failed for task ':solr:test-framework:ecjLintMain'.
> Process 'command '/usr/local/asfpackages/java/oraclejdk-11.0.9/bin/java'' finished with non-zero exit value 255

* Try:
Run with --stacktrace option to get the stack trace. Run with --info or --debug option to get more log output. Run with --scan to get full insights.
==============================================================================

42: Task failed with an exception.
-----------
* What went wrong:
Execution failed for task ':solr:test-framework:forbiddenApisMain'.
> de.thetaphi.forbiddenapis.ForbiddenApiException: Check for forbidden API calls failed, see log.

* Try:
Run with --stacktrace option to get the stack trace. Run with --info or --debug option to get more log output. Run with --scan to get full insights.
==============================================================================

43: Task failed with an exception.
-----------
* Where:
Script '/home/jenkins/jenkins-slave/workspace/Solr/Solr-Check-cloud2refimpl/gradle/validation/validate-log-calls.gradle' line: 243

* What went wrong:
Execution failed for task ':solr:test-framework:validateLogCalls'.
> Found 1 violations in source files (
  cause: 'hasParens true prevLineNotIf true pernicketyLevel true' Suspicious logging call, Parameterize and possibly surround with 'if (log.is*Enabled) {..}'. Help at: 'gradlew helpValidateLogCalls' 
      /home/jenkins/jenkins-slave/workspace/Solr/Solr-Check-cloud2refimpl/solr/test-framework/src/java/org/apache/solr/cloud/MiniSolrCloudCluster.java:299).

* Try:
Run with --stacktrace option to get the stack trace. Run with --info or --debug option to get more log output. Run with --scan to get full insights.
==============================================================================

44: Task failed with an exception.
-----------
* What went wrong:
Execution failed for task ':solr:contrib:analytics:ecjLintTest'.
> Process 'command '/usr/local/asfpackages/java/oraclejdk-11.0.9/bin/java'' finished with non-zero exit value 255

* Try:
Run with --stacktrace option to get the stack trace. Run with --info or --debug option to get more log output. Run with --scan to get full insights.
==============================================================================

45: Task failed with an exception.
-----------
* What went wrong:
Execution failed for task ':solr:contrib:dataimporthandler:ecjLintMain'.
> Process 'command '/usr/local/asfpackages/java/oraclejdk-11.0.9/bin/java'' finished with non-zero exit value 255

* Try:
Run with --stacktrace option to get the stack trace. Run with --info or --debug option to get more log output. Run with --scan to get full insights.
==============================================================================

46: Task failed with an exception.
-----------
* What went wrong:
Execution failed for task ':solr:contrib:dataimporthandler:ecjLintTest'.
> Process 'command '/usr/local/asfpackages/java/oraclejdk-11.0.9/bin/java'' finished with non-zero exit value 255

* Try:
Run with --stacktrace option to get the stack trace. Run with --info or --debug option to get more log output. Run with --scan to get full insights.
==============================================================================

47: Task failed with an exception.
-----------
* What went wrong:
Execution failed for task ':solr:contrib:dataimporthandler-extras:ecjLintMain'.
> Process 'command '/usr/local/asfpackages/java/oraclejdk-11.0.9/bin/java'' finished with non-zero exit value 255

* Try:
Run with --stacktrace option to get the stack trace. Run with --info or --debug option to get more log output. Run with --scan to get full insights.
==============================================================================

48: Task failed with an exception.
-----------
* What went wrong:
Execution failed for task ':solr:contrib:extraction:ecjLintMain'.
> Process 'command '/usr/local/asfpackages/java/oraclejdk-11.0.9/bin/java'' finished with non-zero exit value 255

* Try:
Run with --stacktrace option to get the stack trace. Run with --info or --debug option to get more log output. Run with --scan to get full insights.
==============================================================================

49: Task failed with an exception.
-----------
* What went wrong:
Execution failed for task ':solr:contrib:extraction:ecjLintTest'.
> Process 'command '/usr/local/asfpackages/java/oraclejdk-11.0.9/bin/java'' finished with non-zero exit value 255

* Try:
Run with --stacktrace option to get the stack trace. Run with --info or --debug option to get more log output. Run with --scan to get full insights.
==============================================================================

50: Task failed with an exception.
-----------
* What went wrong:
Execution failed for task ':solr:contrib:ltr:ecjLintTest'.
> Process 'command '/usr/local/asfpackages/java/oraclejdk-11.0.9/bin/java'' finished with non-zero exit value 255

* Try:
Run with --stacktrace option to get the stack trace. Run with --info or --debug option to get more log output. Run with --scan to get full insights.
==============================================================================

* Get more help at https://help.gradle.org

Deprecated Gradle features were used in this build, making it incompatible with Gradle 7.0.
Use '--warning-mode all' to show the individual deprecation warnings.
See https://docs.gradle.org/6.4.1/userguide/command_line_interface.html#sec:command_line_warnings

BUILD FAILED in 20m 8s
788 actionable tasks: 788 executed
Build step 'Invoke Gradle script' changed build result to FAILURE
Build step 'Invoke Gradle script' marked build as failure
Archiving artifacts
Recording test results
[Checks API] No suitable checks publisher found.
Email was triggered for: Failure - Any
Sending email for trigger: Failure - Any

Mime
View raw message