solr-builds mailing list archives

Site index · List index
Message view « Date » · « Thread »
Top « Date » · « Thread »
From Apache Jenkins Server <jenk...@builds.apache.org>
Subject [JENKINS] Solr » Solr-Check-main - Build # 740 - Still Unstable!
Date Thu, 13 May 2021 17:45:37 GMT
Build: https://ci-builds.apache.org/job/Solr/job/Solr-Check-main/740/

3 tests failed.
FAILED:  org.apache.solr.cloud.hdfs.HDFSCollectionsAPITest.testDataDirIsNotReused

Error Message:
org.apache.solr.client.solrj.impl.BaseHttpSolrClient$RemoteSolrException: Error from server
at http://127.0.0.1:39429/solr/test: Error opening new searcher

Stack Trace:
org.apache.solr.client.solrj.impl.BaseHttpSolrClient$RemoteSolrException: Error from server
at http://127.0.0.1:39429/solr/test: Error opening new searcher
	at __randomizedtesting.SeedInfo.seed([72AD5DED26095B0B:6AB21F993550F9AC]:0)
	at org.apache.solr.client.solrj.impl.HttpSolrClient.executeMethod(HttpSolrClient.java:698)
	at org.apache.solr.client.solrj.impl.HttpSolrClient.request(HttpSolrClient.java:269)
	at org.apache.solr.client.solrj.impl.HttpSolrClient.request(HttpSolrClient.java:251)
	at org.apache.solr.client.solrj.impl.LBSolrClient.doRequest(LBSolrClient.java:390)
	at org.apache.solr.client.solrj.impl.LBSolrClient.request(LBSolrClient.java:360)
	at org.apache.solr.client.solrj.impl.BaseCloudSolrClient.sendRequest(BaseCloudSolrClient.java:1164)
	at org.apache.solr.client.solrj.impl.BaseCloudSolrClient.requestWithRetryOnStaleState(BaseCloudSolrClient.java:927)
	at org.apache.solr.client.solrj.impl.BaseCloudSolrClient.request(BaseCloudSolrClient.java:861)
	at org.apache.solr.client.solrj.SolrRequest.process(SolrRequest.java:229)
	at org.apache.solr.client.solrj.SolrClient.commit(SolrClient.java:505)
	at org.apache.solr.client.solrj.SolrClient.commit(SolrClient.java:480)
	at org.apache.solr.cloud.hdfs.HDFSCollectionsAPITest.testDataDirIsNotReused(HDFSCollectionsAPITest.java:78)
	at java.base/jdk.internal.reflect.NativeMethodAccessorImpl.invoke0(Native Method)
	at java.base/jdk.internal.reflect.NativeMethodAccessorImpl.invoke(NativeMethodAccessorImpl.java:62)
	at java.base/jdk.internal.reflect.DelegatingMethodAccessorImpl.invoke(DelegatingMethodAccessorImpl.java:43)
	at java.base/java.lang.reflect.Method.invoke(Method.java:566)
	at com.carrotsearch.randomizedtesting.RandomizedRunner.invoke(RandomizedRunner.java:1754)
	at com.carrotsearch.randomizedtesting.RandomizedRunner$8.evaluate(RandomizedRunner.java:942)
	at com.carrotsearch.randomizedtesting.RandomizedRunner$9.evaluate(RandomizedRunner.java:978)
	at com.carrotsearch.randomizedtesting.RandomizedRunner$10.evaluate(RandomizedRunner.java:992)
	at com.carrotsearch.randomizedtesting.rules.SystemPropertiesRestoreRule$1.evaluate(SystemPropertiesRestoreRule.java:57)
	at org.junit.rules.RunRules.evaluate(RunRules.java:20)
	at org.apache.lucene.util.TestRuleSetupTeardownChained$1.evaluate(TestRuleSetupTeardownChained.java:44)
	at org.apache.lucene.util.AbstractBeforeAfterRule$1.evaluate(AbstractBeforeAfterRule.java:43)
	at org.apache.lucene.util.TestRuleThreadAndTestName$1.evaluate(TestRuleThreadAndTestName.java:45)
	at org.apache.lucene.util.TestRuleIgnoreAfterMaxFailures$1.evaluate(TestRuleIgnoreAfterMaxFailures.java:60)
	at org.apache.lucene.util.TestRuleMarkFailure$1.evaluate(TestRuleMarkFailure.java:44)
	at org.junit.rules.RunRules.evaluate(RunRules.java:20)
	at com.carrotsearch.randomizedtesting.rules.StatementAdapter.evaluate(StatementAdapter.java:36)
	at com.carrotsearch.randomizedtesting.ThreadLeakControl$StatementRunner.run(ThreadLeakControl.java:370)
	at com.carrotsearch.randomizedtesting.ThreadLeakControl.forkTimeoutingTask(ThreadLeakControl.java:819)
	at com.carrotsearch.randomizedtesting.ThreadLeakControl$3.evaluate(ThreadLeakControl.java:470)
	at com.carrotsearch.randomizedtesting.RandomizedRunner.runSingleTest(RandomizedRunner.java:951)
	at com.carrotsearch.randomizedtesting.RandomizedRunner$5.evaluate(RandomizedRunner.java:836)
	at com.carrotsearch.randomizedtesting.RandomizedRunner$6.evaluate(RandomizedRunner.java:887)
	at com.carrotsearch.randomizedtesting.RandomizedRunner$7.evaluate(RandomizedRunner.java:898)
	at com.carrotsearch.randomizedtesting.rules.StatementAdapter.evaluate(StatementAdapter.java:36)
	at org.apache.lucene.util.AbstractBeforeAfterRule$1.evaluate(AbstractBeforeAfterRule.java:43)
	at org.apache.lucene.util.AbstractBeforeAfterRule$1.evaluate(AbstractBeforeAfterRule.java:43)
	at com.carrotsearch.randomizedtesting.rules.SystemPropertiesRestoreRule$1.evaluate(SystemPropertiesRestoreRule.java:57)
	at org.junit.rules.RunRules.evaluate(RunRules.java:20)
	at org.apache.lucene.util.AbstractBeforeAfterRule$1.evaluate(AbstractBeforeAfterRule.java:43)
	at com.carrotsearch.randomizedtesting.rules.StatementAdapter.evaluate(StatementAdapter.java:36)
	at org.apache.lucene.util.TestRuleStoreClassName$1.evaluate(TestRuleStoreClassName.java:38)
	at com.carrotsearch.randomizedtesting.rules.NoShadowingOrOverridesOnMethodsRule$1.evaluate(NoShadowingOrOverridesOnMethodsRule.java:40)
	at com.carrotsearch.randomizedtesting.rules.NoShadowingOrOverridesOnMethodsRule$1.evaluate(NoShadowingOrOverridesOnMethodsRule.java:40)
	at com.carrotsearch.randomizedtesting.rules.StatementAdapter.evaluate(StatementAdapter.java:36)
	at com.carrotsearch.randomizedtesting.rules.StatementAdapter.evaluate(StatementAdapter.java:36)
	at org.apache.lucene.util.TestRuleAssertionsRequired$1.evaluate(TestRuleAssertionsRequired.java:53)
	at org.apache.lucene.util.AbstractBeforeAfterRule$1.evaluate(AbstractBeforeAfterRule.java:43)
	at org.apache.lucene.util.TestRuleMarkFailure$1.evaluate(TestRuleMarkFailure.java:44)
	at org.apache.lucene.util.TestRuleIgnoreAfterMaxFailures$1.evaluate(TestRuleIgnoreAfterMaxFailures.java:60)
	at org.apache.lucene.util.TestRuleIgnoreTestSuites$1.evaluate(TestRuleIgnoreTestSuites.java:47)
	at org.junit.rules.RunRules.evaluate(RunRules.java:20)
	at com.carrotsearch.randomizedtesting.rules.StatementAdapter.evaluate(StatementAdapter.java:36)
	at com.carrotsearch.randomizedtesting.ThreadLeakControl$StatementRunner.run(ThreadLeakControl.java:370)
	at com.carrotsearch.randomizedtesting.ThreadLeakControl.lambda$forkTimeoutingTask$0(ThreadLeakControl.java:826)
	at java.base/java.lang.Thread.run(Thread.java:834)


FAILED:  org.apache.solr.index.hdfs.CheckHdfsIndexTest.testDeletedDocs

Error Message:
java.lang.IllegalStateException: this writer hit an unrecoverable error; cannot complete forceMerge

Stack Trace:
java.lang.IllegalStateException: this writer hit an unrecoverable error; cannot complete forceMerge
	at org.apache.lucene.index.IndexWriter.forceMerge(IndexWriter.java:2139)
	at org.apache.lucene.index.IndexWriter.forceMerge(IndexWriter.java:2079)
	at org.apache.lucene.index.BaseTestCheckIndex.testDeletedDocs(BaseTestCheckIndex.java:51)
	at org.apache.solr.index.hdfs.CheckHdfsIndexTest.testDeletedDocs(CheckHdfsIndexTest.java:140)
	at java.base/jdk.internal.reflect.NativeMethodAccessorImpl.invoke0(Native Method)
	at java.base/jdk.internal.reflect.NativeMethodAccessorImpl.invoke(NativeMethodAccessorImpl.java:62)
	at java.base/jdk.internal.reflect.DelegatingMethodAccessorImpl.invoke(DelegatingMethodAccessorImpl.java:43)
	at java.base/java.lang.reflect.Method.invoke(Method.java:566)
	at com.carrotsearch.randomizedtesting.RandomizedRunner.invoke(RandomizedRunner.java:1754)
	at com.carrotsearch.randomizedtesting.RandomizedRunner$8.evaluate(RandomizedRunner.java:942)
	at com.carrotsearch.randomizedtesting.RandomizedRunner$9.evaluate(RandomizedRunner.java:978)
	at com.carrotsearch.randomizedtesting.RandomizedRunner$10.evaluate(RandomizedRunner.java:992)
	at org.apache.solr.BaseDistributedSearchTestCase$ShardsRepeatRule$ShardsFixedStatement.callStatement(BaseDistributedSearchTestCase.java:1087)
	at org.apache.solr.BaseDistributedSearchTestCase$ShardsRepeatRule$ShardsStatement.evaluate(BaseDistributedSearchTestCase.java:1058)
	at com.carrotsearch.randomizedtesting.rules.SystemPropertiesRestoreRule$1.evaluate(SystemPropertiesRestoreRule.java:57)
	at org.junit.rules.RunRules.evaluate(RunRules.java:20)
	at org.apache.lucene.util.TestRuleSetupTeardownChained$1.evaluate(TestRuleSetupTeardownChained.java:44)
	at org.apache.lucene.util.AbstractBeforeAfterRule$1.evaluate(AbstractBeforeAfterRule.java:43)
	at org.apache.lucene.util.TestRuleThreadAndTestName$1.evaluate(TestRuleThreadAndTestName.java:45)
	at org.apache.lucene.util.TestRuleIgnoreAfterMaxFailures$1.evaluate(TestRuleIgnoreAfterMaxFailures.java:60)
	at org.apache.lucene.util.TestRuleMarkFailure$1.evaluate(TestRuleMarkFailure.java:44)
	at org.junit.rules.RunRules.evaluate(RunRules.java:20)
	at com.carrotsearch.randomizedtesting.rules.StatementAdapter.evaluate(StatementAdapter.java:36)
	at com.carrotsearch.randomizedtesting.ThreadLeakControl$StatementRunner.run(ThreadLeakControl.java:370)
	at com.carrotsearch.randomizedtesting.ThreadLeakControl.forkTimeoutingTask(ThreadLeakControl.java:819)
	at com.carrotsearch.randomizedtesting.ThreadLeakControl$3.evaluate(ThreadLeakControl.java:470)
	at com.carrotsearch.randomizedtesting.RandomizedRunner.runSingleTest(RandomizedRunner.java:951)
	at com.carrotsearch.randomizedtesting.RandomizedRunner$5.evaluate(RandomizedRunner.java:836)
	at com.carrotsearch.randomizedtesting.RandomizedRunner$6.evaluate(RandomizedRunner.java:887)
	at com.carrotsearch.randomizedtesting.RandomizedRunner$7.evaluate(RandomizedRunner.java:898)
	at com.carrotsearch.randomizedtesting.rules.StatementAdapter.evaluate(StatementAdapter.java:36)
	at org.apache.lucene.util.AbstractBeforeAfterRule$1.evaluate(AbstractBeforeAfterRule.java:43)
	at org.apache.lucene.util.AbstractBeforeAfterRule$1.evaluate(AbstractBeforeAfterRule.java:43)
	at com.carrotsearch.randomizedtesting.rules.SystemPropertiesRestoreRule$1.evaluate(SystemPropertiesRestoreRule.java:57)
	at org.junit.rules.RunRules.evaluate(RunRules.java:20)
	at org.apache.lucene.util.AbstractBeforeAfterRule$1.evaluate(AbstractBeforeAfterRule.java:43)
	at com.carrotsearch.randomizedtesting.rules.StatementAdapter.evaluate(StatementAdapter.java:36)
	at org.apache.lucene.util.TestRuleStoreClassName$1.evaluate(TestRuleStoreClassName.java:38)
	at com.carrotsearch.randomizedtesting.rules.NoShadowingOrOverridesOnMethodsRule$1.evaluate(NoShadowingOrOverridesOnMethodsRule.java:40)
	at com.carrotsearch.randomizedtesting.rules.NoShadowingOrOverridesOnMethodsRule$1.evaluate(NoShadowingOrOverridesOnMethodsRule.java:40)
	at com.carrotsearch.randomizedtesting.rules.StatementAdapter.evaluate(StatementAdapter.java:36)
	at com.carrotsearch.randomizedtesting.rules.StatementAdapter.evaluate(StatementAdapter.java:36)
	at org.apache.lucene.util.TestRuleAssertionsRequired$1.evaluate(TestRuleAssertionsRequired.java:53)
	at org.apache.lucene.util.AbstractBeforeAfterRule$1.evaluate(AbstractBeforeAfterRule.java:43)
	at org.apache.lucene.util.TestRuleMarkFailure$1.evaluate(TestRuleMarkFailure.java:44)
	at org.apache.lucene.util.TestRuleIgnoreAfterMaxFailures$1.evaluate(TestRuleIgnoreAfterMaxFailures.java:60)
	at org.apache.lucene.util.TestRuleIgnoreTestSuites$1.evaluate(TestRuleIgnoreTestSuites.java:47)
	at org.junit.rules.RunRules.evaluate(RunRules.java:20)
	at com.carrotsearch.randomizedtesting.rules.StatementAdapter.evaluate(StatementAdapter.java:36)
	at com.carrotsearch.randomizedtesting.ThreadLeakControl$StatementRunner.run(ThreadLeakControl.java:370)
	at com.carrotsearch.randomizedtesting.ThreadLeakControl.lambda$forkTimeoutingTask$0(ThreadLeakControl.java:826)
	at java.base/java.lang.Thread.run(Thread.java:834)
Caused by: org.apache.lucene.index.CorruptIndexException: Problem reading index from HdfsDirectory@hdfs://localhost:41347/solr
lockFactory=org.apache.solr.store.hdfs.HdfsLockFactory@45564e50 (resource=HdfsDirectory@hdfs://localhost:41347/solr
lockFactory=org.apache.solr.store.hdfs.HdfsLockFactory@45564e50)
	at org.apache.lucene.index.SegmentCoreReaders.<init>(SegmentCoreReaders.java:160)
	at org.apache.lucene.index.SegmentReader.<init>(SegmentReader.java:89)
	at org.apache.lucene.index.ReadersAndUpdates.getReader(ReadersAndUpdates.java:179)
	at org.apache.lucene.index.ReadersAndUpdates.getReaderForMerge(ReadersAndUpdates.java:786)
	at org.apache.lucene.index.IndexWriter.lambda$mergeMiddle$19(IndexWriter.java:4906)
	at org.apache.lucene.index.MergePolicy$OneMerge.initMergeReaders(MergePolicy.java:418)
	at org.apache.lucene.index.IndexWriter.mergeMiddle(IndexWriter.java:4902)
	at org.apache.lucene.index.IndexWriter.merge(IndexWriter.java:4503)
	at org.apache.lucene.index.IndexWriter$IndexWriterMergeSource.merge(IndexWriter.java:6255)
	at org.apache.lucene.index.ConcurrentMergeScheduler.doMerge(ConcurrentMergeScheduler.java:636)
	at org.apache.lucene.index.ConcurrentMergeScheduler$MergeThread.run(ConcurrentMergeScheduler.java:697)
Caused by: java.io.EOFException: End of file reached before reading fully.
	at org.apache.hadoop.fs.FSInputStream.readFully(FSInputStream.java:126)
	at org.apache.hadoop.fs.FSDataInputStream.readFully(FSDataInputStream.java:111)
	at org.apache.solr.store.hdfs.HdfsDirectory$HdfsIndexInput.readInternal(HdfsDirectory.java:251)
	at org.apache.solr.store.blockcache.CustomBufferedIndexInput.refill(CustomBufferedIndexInput.java:191)
	at org.apache.solr.store.blockcache.CustomBufferedIndexInput.readByte(CustomBufferedIndexInput.java:45)
	at org.apache.lucene.store.DataInput.readVInt(DataInput.java:131)
	at org.apache.solr.store.blockcache.CustomBufferedIndexInput.readVInt(CustomBufferedIndexInput.java:160)
	at org.apache.lucene.codecs.blockterms.FixedGapTermsIndexReader.<init>(FixedGapTermsIndexReader.java:97)
	at org.apache.lucene.codecs.blockterms.LuceneFixedGap.fieldsProducer(LuceneFixedGap.java:93)
	at org.apache.lucene.codecs.perfield.PerFieldPostingsFormat$FieldsReader.<init>(PerFieldPostingsFormat.java:327)
	at org.apache.lucene.codecs.perfield.PerFieldPostingsFormat.fieldsProducer(PerFieldPostingsFormat.java:389)
	at org.apache.lucene.index.SegmentCoreReaders.<init>(SegmentCoreReaders.java:117)
	... 10 more


FAILED:  org.apache.solr.update.TestHdfsUpdateLog.testFSThreadSafety

Error Message:
com.carrotsearch.randomizedtesting.UncaughtExceptionError: Captured an uncaught exception
in thread: Thread[id=29687, name=Thread-5494, state=RUNNABLE, group=TGRP-TestHdfsUpdateLog]

Stack Trace:
com.carrotsearch.randomizedtesting.UncaughtExceptionError: Captured an uncaught exception
in thread: Thread[id=29687, name=Thread-5494, state=RUNNABLE, group=TGRP-TestHdfsUpdateLog]
	at __randomizedtesting.SeedInfo.seed([72AD5DED26095B0B:8482FA16EBA3F3F8]:0)
Caused by: org.apache.solr.common.SolrException: Server error writing document id 151 to the
index
	at __randomizedtesting.SeedInfo.seed([72AD5DED26095B0B]:0)
	at org.apache.solr.update.DirectUpdateHandler2.addDoc(DirectUpdateHandler2.java:240)
	at org.apache.solr.update.processor.RunUpdateProcessorFactory$RunUpdateProcessor.processAdd(RunUpdateProcessorFactory.java:73)
	at org.apache.solr.update.processor.UpdateRequestProcessor.processAdd(UpdateRequestProcessor.java:55)
	at org.apache.solr.update.processor.NestedUpdateProcessorFactory$NestedUpdateProcessor.processAdd(NestedUpdateProcessorFactory.java:79)
	at org.apache.solr.update.processor.UpdateRequestProcessor.processAdd(UpdateRequestProcessor.java:55)
	at org.apache.solr.update.processor.DistributedUpdateProcessor.doLocalAdd(DistributedUpdateProcessor.java:263)
	at org.apache.solr.update.processor.DistributedUpdateProcessor.doVersionAdd(DistributedUpdateProcessor.java:502)
	at org.apache.solr.update.processor.DistributedUpdateProcessor.lambda$versionAdd$0(DistributedUpdateProcessor.java:343)
	at org.apache.solr.update.VersionBucket.runWithLock(VersionBucket.java:50)
	at org.apache.solr.update.processor.DistributedUpdateProcessor.versionAdd(DistributedUpdateProcessor.java:343)
	at org.apache.solr.update.processor.DistributedUpdateProcessor.processAdd(DistributedUpdateProcessor.java:229)
	at org.apache.solr.update.processor.LogUpdateProcessorFactory$LogUpdateProcessor.processAdd(LogUpdateProcessorFactory.java:106)
	at org.apache.solr.handler.loader.XMLLoader.processUpdate(XMLLoader.java:178)
	at org.apache.solr.handler.loader.XMLLoader.load(XMLLoader.java:127)
	at org.apache.solr.handler.UpdateRequestHandler$1.load(UpdateRequestHandler.java:97)
	at org.apache.solr.handler.ContentStreamHandlerBase.handleRequestBody(ContentStreamHandlerBase.java:82)
	at org.apache.solr.handler.RequestHandlerBase.handleRequest(RequestHandlerBase.java:214)
	at org.apache.solr.core.SolrCore.execute(SolrCore.java:2610)
	at org.apache.solr.servlet.DirectSolrConnection.request(DirectSolrConnection.java:125)
	at org.apache.solr.util.TestHarness.update(TestHarness.java:293)
	at org.apache.solr.util.BaseTestHarness.checkUpdateStatus(BaseTestHarness.java:274)
	at org.apache.solr.util.BaseTestHarness.validateUpdate(BaseTestHarness.java:244)
	at org.apache.solr.SolrTestCaseJ4.checkUpdateU(SolrTestCaseJ4.java:989)
	at org.apache.solr.SolrTestCaseJ4.assertU(SolrTestCaseJ4.java:968)
	at org.apache.solr.SolrTestCaseJ4.assertU(SolrTestCaseJ4.java:962)
	at org.apache.solr.update.TestHdfsUpdateLog$2.run(TestHdfsUpdateLog.java:122)
Caused by: org.apache.lucene.store.AlreadyClosedException: this IndexWriter is closed
	at org.apache.lucene.index.IndexWriter.ensureOpen(IndexWriter.java:907)
	at org.apache.lucene.index.IndexWriter.ensureOpen(IndexWriter.java:920)
	at org.apache.lucene.index.IndexWriter.updateDocuments(IndexWriter.java:1527)
	at org.apache.lucene.index.IndexWriter.updateDocuments(IndexWriter.java:1519)
	at org.apache.solr.update.DirectUpdateHandler2.updateDocOrDocValues(DirectUpdateHandler2.java:961)
	at org.apache.solr.update.DirectUpdateHandler2.doNormalUpdate(DirectUpdateHandler2.java:336)
	at org.apache.solr.update.DirectUpdateHandler2.addDoc0(DirectUpdateHandler2.java:288)
	at org.apache.solr.update.DirectUpdateHandler2.addDoc(DirectUpdateHandler2.java:235)
	... 25 more
Caused by: org.apache.lucene.index.CorruptIndexException: Problem reading index from NRTCachingDirectory(BlockDirectory(HdfsDirectory@hdfs://localhost:44939/solr_hdfs_home/collection1/home/jenkins/jenkins-slave/workspace/Solr/Solr-Check-main/solr/core/build/tmp/tests-tmp/solr.update.TestHdfsUpdateLog_72AD5DED26095B0B-001/data-dir-119-001/index
lockFactory=org.apache.lucene.store.SingleInstanceLockFactory@3e4d14a8); maxCacheMB=192.0
maxMergeSizeMB=16.0) (resource=NRTCachingDirectory(BlockDirectory(HdfsDirectory@hdfs://localhost:44939/solr_hdfs_home/collection1/home/jenkins/jenkins-slave/workspace/Solr/Solr-Check-main/solr/core/build/tmp/tests-tmp/solr.update.TestHdfsUpdateLog_72AD5DED26095B0B-001/data-dir-119-001/index
lockFactory=org.apache.lucene.store.SingleInstanceLockFactory@3e4d14a8); maxCacheMB=192.0
maxMergeSizeMB=16.0))
	at org.apache.lucene.index.SegmentCoreReaders.<init>(SegmentCoreReaders.java:160)
	at org.apache.lucene.index.SegmentReader.<init>(SegmentReader.java:89)
	at org.apache.lucene.index.ReadersAndUpdates.getReader(ReadersAndUpdates.java:179)
	at org.apache.lucene.index.BufferedUpdatesStream$SegmentState.<init>(BufferedUpdatesStream.java:295)
	at org.apache.lucene.index.IndexWriter.openSegmentStates(IndexWriter.java:6154)
	at org.apache.lucene.index.IndexWriter.forceApply(IndexWriter.java:5928)
	at org.apache.lucene.index.IndexWriter.tryApply(IndexWriter.java:5862)
	at org.apache.lucene.index.IndexWriter.lambda$publishFrozenUpdates$10(IndexWriter.java:2762)
	at org.apache.lucene.index.IndexWriter$EventQueue.processEventsInternal(IndexWriter.java:323)
	at org.apache.lucene.index.IndexWriter$EventQueue.processEvents(IndexWriter.java:312)
	at org.apache.lucene.index.IndexWriter.processEvents(IndexWriter.java:5705)
	at org.apache.lucene.index.IndexWriter.getReader(IndexWriter.java:575)
	at org.apache.lucene.index.StandardDirectoryReader.doOpenFromWriter(StandardDirectoryReader.java:380)
	at org.apache.lucene.index.StandardDirectoryReader.doOpenIfChanged(StandardDirectoryReader.java:365)
	at org.apache.lucene.index.DirectoryReader.openIfChanged(DirectoryReader.java:239)
	at org.apache.solr.core.SolrCore.openNewSearcher(SolrCore.java:2098)
	at org.apache.solr.update.DirectUpdateHandler2.commit(DirectUpdateHandler2.java:703)
	at org.apache.solr.update.CommitTracker.run(CommitTracker.java:273)
	at java.base/java.util.concurrent.Executors$RunnableAdapter.call(Executors.java:515)
	at java.base/java.util.concurrent.FutureTask.run(FutureTask.java:264)
	at java.base/java.util.concurrent.ScheduledThreadPoolExecutor$ScheduledFutureTask.run(ScheduledThreadPoolExecutor.java:304)
	at java.base/java.util.concurrent.ThreadPoolExecutor.runWorker(ThreadPoolExecutor.java:1128)
	at java.base/java.util.concurrent.ThreadPoolExecutor$Worker.run(ThreadPoolExecutor.java:628)
	at java.base/java.lang.Thread.run(Thread.java:834)
Caused by: java.io.EOFException: position is negative
	at org.apache.hadoop.fs.FSInputStream.validatePositionedReadArgs(FSInputStream.java:103)
	at org.apache.hadoop.fs.FSInputStream.readFully(FSInputStream.java:118)
	at org.apache.hadoop.fs.FSDataInputStream.readFully(FSDataInputStream.java:111)
	at org.apache.solr.store.hdfs.HdfsDirectory$HdfsIndexInput.readInternal(HdfsDirectory.java:251)
	at org.apache.solr.store.blockcache.CustomBufferedIndexInput.readBytes(CustomBufferedIndexInput.java:112)
	at org.apache.solr.store.blockcache.CustomBufferedIndexInput.readBytes(CustomBufferedIndexInput.java:67)
	at org.apache.solr.store.blockcache.BlockDirectory$CachedIndexInput.readIntoCacheAndResult(BlockDirectory.java:221)
	at org.apache.solr.store.blockcache.BlockDirectory$CachedIndexInput.fetchBlock(BlockDirectory.java:208)
	at org.apache.solr.store.blockcache.BlockDirectory$CachedIndexInput.readInternal(BlockDirectory.java:192)
	at org.apache.solr.store.blockcache.CustomBufferedIndexInput.refill(CustomBufferedIndexInput.java:191)
	at org.apache.solr.store.blockcache.CustomBufferedIndexInput.readByte(CustomBufferedIndexInput.java:45)
	at org.apache.lucene.store.DataInput.readVInt(DataInput.java:131)
	at org.apache.solr.store.blockcache.CustomBufferedIndexInput.readVInt(CustomBufferedIndexInput.java:160)
	at org.apache.lucene.codecs.blocktreeords.OrdsBlockTreeTermsReader.<init>(OrdsBlockTreeTermsReader.java:115)
	at org.apache.lucene.codecs.mockrandom.MockRandomPostingsFormat.fieldsProducer(MockRandomPostingsFormat.java:379)
	at org.apache.lucene.codecs.perfield.PerFieldPostingsFormat$FieldsReader.<init>(PerFieldPostingsFormat.java:327)
	at org.apache.lucene.codecs.perfield.PerFieldPostingsFormat.fieldsProducer(PerFieldPostingsFormat.java:389)
	at org.apache.lucene.index.SegmentCoreReaders.<init>(SegmentCoreReaders.java:117)
	... 23 more




Build Log:
[...truncated 4269 lines...]
ERROR: The following test(s) have failed:
  - org.apache.solr.index.hdfs.CheckHdfsIndexTest.testDeletedDocs (:solr:core)
    Test output: /home/jenkins/jenkins-slave/workspace/Solr/Solr-Check-main/solr/core/build/test-results/test/outputs/OUTPUT-org.apache.solr.index.hdfs.CheckHdfsIndexTest.txt
    Reproduce with: gradlew :solr:core:test --tests "org.apache.solr.index.hdfs.CheckHdfsIndexTest.testDeletedDocs"
-Ptests.jvms=4 -Ptests.haltonfailure=false -Ptests.jvmargs=-XX:TieredStopAtLevel=1 -Ptests.seed=72AD5DED26095B0B
-Ptests.multiplier=2 -Ptests.badapples=false -Ptests.file.encoding=US-ASCII

  - org.apache.solr.cloud.hdfs.HDFSCollectionsAPITest.testDataDirIsNotReused (:solr:core)
    Test output: /home/jenkins/jenkins-slave/workspace/Solr/Solr-Check-main/solr/core/build/test-results/test/outputs/OUTPUT-org.apache.solr.cloud.hdfs.HDFSCollectionsAPITest.txt
    Reproduce with: gradlew :solr:core:test --tests "org.apache.solr.cloud.hdfs.HDFSCollectionsAPITest.testDataDirIsNotReused"
-Ptests.jvms=4 -Ptests.haltonfailure=false -Ptests.jvmargs=-XX:TieredStopAtLevel=1 -Ptests.seed=72AD5DED26095B0B
-Ptests.multiplier=2 -Ptests.badapples=false -Ptests.file.encoding=US-ASCII

  - org.apache.solr.update.TestHdfsUpdateLog.testFSThreadSafety (:solr:core)
    Test output: /home/jenkins/jenkins-slave/workspace/Solr/Solr-Check-main/solr/core/build/test-results/test/outputs/OUTPUT-org.apache.solr.update.TestHdfsUpdateLog.txt
    Reproduce with: gradlew :solr:core:test --tests "org.apache.solr.update.TestHdfsUpdateLog.testFSThreadSafety"
-Ptests.jvms=4 -Ptests.haltonfailure=false -Ptests.jvmargs=-XX:TieredStopAtLevel=1 -Ptests.seed=72AD5DED26095B0B
-Ptests.multiplier=2 -Ptests.badapples=false -Ptests.file.encoding=US-ASCII


Deprecated Gradle features were used in this build, making it incompatible with Gradle 7.0.
Use '--warning-mode all' to show the individual deprecation warnings.
See https://docs.gradle.org/6.8.3/userguide/command_line_interface.html#sec:command_line_warnings

BUILD SUCCESSFUL in 48m 26s
313 actionable tasks: 313 executed
Build step 'Invoke Gradle script' changed build result to SUCCESS
Archiving artifacts
java.lang.InterruptedException: no matches found within 10000
	at hudson.FilePath$ValidateAntFileMask.hasMatch(FilePath.java:3066)
	at hudson.FilePath$ValidateAntFileMask.invoke(FilePath.java:2945)
	at hudson.FilePath$ValidateAntFileMask.invoke(FilePath.java:2926)
	at hudson.FilePath$FileCallableWrapper.call(FilePath.java:3313)
Also:   hudson.remoting.Channel$CallSiteStackTrace: Remote call to lucene2
		at hudson.remoting.Channel.attachCallSiteStackTrace(Channel.java:1800)
		at hudson.remoting.UserRequest$ExceptionResponse.retrieve(UserRequest.java:357)
		at hudson.remoting.Channel.call(Channel.java:1001)
		at hudson.FilePath.act(FilePath.java:1157)
		at hudson.FilePath.act(FilePath.java:1146)
		at hudson.FilePath.validateAntFileMask(FilePath.java:2924)
		at hudson.tasks.ArtifactArchiver.perform(ArtifactArchiver.java:270)
		at hudson.tasks.BuildStepCompatibilityLayer.perform(BuildStepCompatibilityLayer.java:80)
		at hudson.tasks.BuildStepMonitor$1.perform(BuildStepMonitor.java:20)
		at hudson.model.AbstractBuild$AbstractBuildExecution.perform(AbstractBuild.java:804)
		at hudson.model.AbstractBuild$AbstractBuildExecution.performAllBuildSteps(AbstractBuild.java:753)
		at hudson.model.Build$BuildExecution.post2(Build.java:177)
		at hudson.model.AbstractBuild$AbstractBuildExecution.post(AbstractBuild.java:698)
		at hudson.model.Run.execute(Run.java:1932)
		at hudson.model.FreeStyleBuild.run(FreeStyleBuild.java:43)
		at hudson.model.ResourceController.execute(ResourceController.java:97)
		at hudson.model.Executor.run(Executor.java:429)
Caused: hudson.FilePath$TunneledInterruptedException
	at hudson.FilePath$FileCallableWrapper.call(FilePath.java:3315)
	at hudson.remoting.UserRequest.perform(UserRequest.java:211)
	at hudson.remoting.UserRequest.perform(UserRequest.java:54)
	at hudson.remoting.Request$2.run(Request.java:375)
	at hudson.remoting.InterceptingExecutorService$1.call(InterceptingExecutorService.java:73)
	at java.util.concurrent.FutureTask.run(FutureTask.java:266)
	at java.util.concurrent.ThreadPoolExecutor.runWorker(ThreadPoolExecutor.java:1149)
	at java.util.concurrent.ThreadPoolExecutor$Worker.run(ThreadPoolExecutor.java:624)
	at java.lang.Thread.run(Thread.java:748)
Caused: java.lang.InterruptedException: java.lang.InterruptedException: no matches found within
10000
	at hudson.FilePath.act(FilePath.java:1159)
	at hudson.FilePath.act(FilePath.java:1146)
	at hudson.FilePath.validateAntFileMask(FilePath.java:2924)
	at hudson.tasks.ArtifactArchiver.perform(ArtifactArchiver.java:270)
	at hudson.tasks.BuildStepCompatibilityLayer.perform(BuildStepCompatibilityLayer.java:80)
	at hudson.tasks.BuildStepMonitor$1.perform(BuildStepMonitor.java:20)
	at hudson.model.AbstractBuild$AbstractBuildExecution.perform(AbstractBuild.java:804)
	at hudson.model.AbstractBuild$AbstractBuildExecution.performAllBuildSteps(AbstractBuild.java:753)
	at hudson.model.Build$BuildExecution.post2(Build.java:177)
	at hudson.model.AbstractBuild$AbstractBuildExecution.post(AbstractBuild.java:698)
	at hudson.model.Run.execute(Run.java:1932)
	at hudson.model.FreeStyleBuild.run(FreeStyleBuild.java:43)
	at hudson.model.ResourceController.execute(ResourceController.java:97)
	at hudson.model.Executor.run(Executor.java:429)
No artifacts found that match the file pattern "**/*.events,heapdumps/**,**/hs_err_pid*".
Configuration error?
Recording test results
[Checks API] No suitable checks publisher found.
Build step 'Publish JUnit test result report' changed build result to UNSTABLE
Email was triggered for: Unstable (Test Failures)
Sending email for trigger: Unstable (Test Failures)

Mime
View raw message