sling-dev mailing list archives

Site index · List index
Message view « Date » · « Thread »
Top « Date » · « Thread »
From Apache Jenkins Server <jenk...@builds.apache.org>
Subject [Jenkins] Sling » sling-org-apache-sling-launchpad-testing » master #791 is BROKEN
Date Fri, 15 May 2020 13:41:49 GMT
Please see https://builds.apache.org/job/Sling/job/sling-org-apache-sling-launchpad-testing/job/master/791/
for details.

No further emails will be sent until the status of the build is changed.
Build log follows below:

[...truncated 2911 lines...]
[INFO] Tests run: 1, Failures: 0, Errors: 0, Skipped: 0, Time elapsed: 0 s - in org.apache.sling.launchpad.webapp.integrationtest.xml.SaxTest
[INFO] Running org.apache.sling.launchpad.webapp.integrationtest.ScriptBuiltinObjectsTest
[INFO] Tests run: 1, Failures: 0, Errors: 0, Skipped: 0, Time elapsed: 0.078 s - in org.apache.sling.launchpad.webapp.integrationtest.ScriptBuiltinObjectsTest
[INFO] Running org.apache.sling.launchpad.webapp.integrationtest.userManager.CreateGroupTest
[INFO] Tests run: 8, Failures: 0, Errors: 0, Skipped: 0, Time elapsed: 0.299 s - in org.apache.sling.launchpad.webapp.integrationtest.userManager.CreateGroupTest
[INFO] Running org.apache.sling.launchpad.webapp.integrationtest.LaunchpadConfigInstallerTest
[INFO] Tests run: 1, Failures: 0, Errors: 0, Skipped: 0, Time elapsed: 0 s - in org.apache.sling.launchpad.webapp.integrationtest.LaunchpadConfigInstallerTest
[INFO] Running org.apache.sling.launchpad.webapp.integrationtest.teleporter.TeleportedResourcesFolderTest
[INFO] Tests run: 3, Failures: 0, Errors: 0, Skipped: 0, Time elapsed: 0.475 s - in org.apache.sling.launchpad.webapp.integrationtest.teleporter.TeleportedResourcesFolderTest
[INFO] Running org.apache.sling.launchpad.webapp.integrationtest.JspForwardTest
[INFO] Tests run: 6, Failures: 0, Errors: 0, Skipped: 0, Time elapsed: 2.116 s - in org.apache.sling.launchpad.webapp.integrationtest.JspForwardTest
[INFO] Running org.apache.sling.launchpad.webapp.integrationtest.servlets.post.PostServletOrderTest
[INFO] Tests run: 9, Failures: 0, Errors: 0, Skipped: 0, Time elapsed: 0.548 s - in org.apache.sling.launchpad.webapp.integrationtest.servlets.post.PostServletOrderTest
[INFO] Running org.apache.sling.launchpad.webapp.integrationtest.NodetypeRenderingTest
[INFO] Tests run: 7, Failures: 0, Errors: 0, Skipped: 0, Time elapsed: 0.539 s - in org.apache.sling.launchpad.webapp.integrationtest.NodetypeRenderingTest
[INFO] Running org.apache.sling.launchpad.webapp.integrationtest.PostRedirectTest
[INFO] Tests run: 7, Failures: 0, Errors: 0, Skipped: 0, Time elapsed: 0.078 s - in org.apache.sling.launchpad.webapp.integrationtest.PostRedirectTest
[INFO] Running org.apache.sling.launchpad.webapp.integrationtest.ServerSideScriptsTest
[INFO] Tests run: 1, Failures: 0, Errors: 0, Skipped: 0, Time elapsed: 2.641 s - in org.apache.sling.launchpad.webapp.integrationtest.ServerSideScriptsTest
[INFO] Running org.apache.sling.launchpad.webapp.integrationtest.issues.SLING2522Test
[INFO] Tests run: 1, Failures: 0, Errors: 0, Skipped: 0, Time elapsed: 0.006 s - in org.apache.sling.launchpad.webapp.integrationtest.issues.SLING2522Test
[INFO] Running org.apache.sling.launchpad.webapp.integrationtest.FiltersTest
[INFO] Tests run: 1, Failures: 0, Errors: 0, Skipped: 0, Time elapsed: 0.001 s - in org.apache.sling.launchpad.webapp.integrationtest.FiltersTest
[INFO] Running org.apache.sling.launchpad.webapp.integrationtest.JspScriptingTest
[INFO] Tests run: 7, Failures: 0, Errors: 0, Skipped: 0, Time elapsed: 1.627 s - in org.apache.sling.launchpad.webapp.integrationtest.JspScriptingTest
[INFO] Running org.apache.sling.launchpad.webapp.integrationtest.issues.SLING760Test
[INFO] Tests run: 1, Failures: 0, Errors: 0, Skipped: 0, Time elapsed: 0.115 s - in org.apache.sling.launchpad.webapp.integrationtest.issues.SLING760Test
[INFO] Running org.apache.sling.launchpad.webapp.integrationtest.StreamServletTest
[INFO] Tests run: 4, Failures: 0, Errors: 0, Skipped: 0, Time elapsed: 0.31 s - in org.apache.sling.launchpad.webapp.integrationtest.StreamServletTest
[INFO] Running org.apache.sling.launchpad.webapp.integrationtest.repository.SystemUsersTest
[INFO] Tests run: 2, Failures: 0, Errors: 0, Skipped: 0, Time elapsed: 0.281 s - in org.apache.sling.launchpad.webapp.integrationtest.repository.SystemUsersTest
[INFO] Running org.apache.sling.launchpad.webapp.integrationtest.scripting.StandaloneScriptExecutionTest
[INFO] Tests run: 1, Failures: 0, Errors: 0, Skipped: 0, Time elapsed: 0.079 s - in org.apache.sling.launchpad.webapp.integrationtest.scripting.StandaloneScriptExecutionTest
[INFO] Running org.apache.sling.launchpad.webapp.integrationtest.ServletResolverConfigTest
[INFO] Tests run: 1, Failures: 0, Errors: 0, Skipped: 0, Time elapsed: 0.001 s - in org.apache.sling.launchpad.webapp.integrationtest.ServletResolverConfigTest
[INFO] Running org.apache.sling.launchpad.webapp.integrationtest.WriteableResourcesProxyTest
[INFO] Tests run: 1, Failures: 0, Errors: 0, Skipped: 0, Time elapsed: 0.006 s - in org.apache.sling.launchpad.webapp.integrationtest.WriteableResourcesProxyTest
[INFO] Running org.apache.sling.launchpad.webapp.integrationtest.ContentLoaderMiscPropertyTest
[INFO] Tests run: 1, Failures: 0, Errors: 0, Skipped: 0, Time elapsed: 0.001 s - in org.apache.sling.launchpad.webapp.integrationtest.ContentLoaderMiscPropertyTest
[INFO] Running org.apache.sling.launchpad.webapp.integrationtest.resourceprovider.PlanetsResourceProviderTest
[INFO] Tests run: 4, Failures: 0, Errors: 0, Skipped: 0, Time elapsed: 0.013 s - in org.apache.sling.launchpad.webapp.integrationtest.resourceprovider.PlanetsResourceProviderTest
[INFO] Running org.apache.sling.launchpad.webapp.integrationtest.servlets.post.PostServletPrivilegesUpdateTest
[WARNING] Tests run: 1, Failures: 0, Errors: 0, Skipped: 1, Time elapsed: 0 s - in org.apache.sling.launchpad.webapp.integrationtest.servlets.post.PostServletPrivilegesUpdateTest
[INFO] Running org.apache.sling.launchpad.webapp.integrationtest.InitialContentTest
[INFO] Tests run: 5, Failures: 0, Errors: 0, Skipped: 0, Time elapsed: 0.015 s - in org.apache.sling.launchpad.webapp.integrationtest.InitialContentTest
[INFO] Running org.apache.sling.launchpad.webapp.integrationtest.servlets.post.PostStatusTest
[INFO] Tests run: 4, Failures: 0, Errors: 0, Skipped: 0, Time elapsed: 0.036 s - in org.apache.sling.launchpad.webapp.integrationtest.servlets.post.PostStatusTest
[INFO] Running org.apache.sling.launchpad.webapp.integrationtest.servlets.post.PostServletDeleteTest
[INFO] Tests run: 5, Failures: 0, Errors: 0, Skipped: 0, Time elapsed: 0.791 s - in org.apache.sling.launchpad.webapp.integrationtest.servlets.post.PostServletDeleteTest
[INFO] Running org.apache.sling.launchpad.webapp.integrationtest.xml.DomTest
[INFO] Tests run: 1, Failures: 0, Errors: 0, Skipped: 0, Time elapsed: 0.001 s - in org.apache.sling.launchpad.webapp.integrationtest.xml.DomTest
[INFO] Running org.apache.sling.launchpad.webapp.integrationtest.EventsCounterTest
[INFO] Tests run: 1, Failures: 0, Errors: 0, Skipped: 0, Time elapsed: 0.015 s - in org.apache.sling.launchpad.webapp.integrationtest.EventsCounterTest
[INFO] Running org.apache.sling.launchpad.webapp.integrationtest.userManager.RemoveAuthorizablesTest
[INFO] Tests run: 11, Failures: 0, Errors: 0, Skipped: 0, Time elapsed: 0.75 s - in org.apache.sling.launchpad.webapp.integrationtest.userManager.RemoveAuthorizablesTest
[INFO] Running org.apache.sling.launchpad.webapp.integrationtest.RequestAttributeTest
[INFO] Tests run: 1, Failures: 0, Errors: 0, Skipped: 0, Time elapsed: 0.168 s - in org.apache.sling.launchpad.webapp.integrationtest.RequestAttributeTest
[INFO] Running org.apache.sling.launchpad.webapp.integrationtest.auth.AuthenticationResponseCodeTest
[INFO] Tests run: 10, Failures: 0, Errors: 0, Skipped: 0, Time elapsed: 0.069 s - in org.apache.sling.launchpad.webapp.integrationtest.auth.AuthenticationResponseCodeTest
[INFO] Running org.apache.sling.launchpad.webapp.integrationtest.installer.ServerSideInstallerTest
[INFO] Tests run: 3, Failures: 0, Errors: 0, Skipped: 0, Time elapsed: 0.522 s - in org.apache.sling.launchpad.webapp.integrationtest.installer.ServerSideInstallerTest
[INFO] Running org.apache.sling.launchpad.webapp.integrationtest.servlets.post.PostServletCreateTest
[INFO] Tests run: 16, Failures: 0, Errors: 0, Skipped: 0, Time elapsed: 0.344 s - in org.apache.sling.launchpad.webapp.integrationtest.servlets.post.PostServletCreateTest
[INFO] Running org.apache.sling.launchpad.webapp.integrationtest.servlets.resolution.RequestUriOptingServletTest
May 15, 2020 1:41:02 PM org.apache.sling.launchpad.testservices.servlets.TestServlet doGet
SEVERE: test JUL message
May 15, 2020 1:41:02 PM org.apache.sling.launchpad.testservices.servlets.TestServlet doGet
SEVERE: test JUL message
[INFO] Tests run: 4, Failures: 0, Errors: 0, Skipped: 0, Time elapsed: 0.445 s - in org.apache.sling.launchpad.webapp.integrationtest.servlets.resolution.RequestUriOptingServletTest
[INFO] Running org.apache.sling.launchpad.webapp.integrationtest.repository.RepositoryInitializersTest
[INFO] Tests run: 1, Failures: 0, Errors: 0, Skipped: 0, Time elapsed: 0.001 s - in org.apache.sling.launchpad.webapp.integrationtest.repository.RepositoryInitializersTest
[INFO] Running org.apache.sling.launchpad.webapp.integrationtest.repository.RepositoryNameTest
[INFO] Tests run: 1, Failures: 0, Errors: 0, Skipped: 0, Time elapsed: 0.009 s - in org.apache.sling.launchpad.webapp.integrationtest.repository.RepositoryNameTest
[INFO] Running org.apache.sling.launchpad.webapp.integrationtest.scripting.htl.HtlTest
[INFO] Tests run: 3, Failures: 0, Errors: 0, Skipped: 0, Time elapsed: 1.357 s - in org.apache.sling.launchpad.webapp.integrationtest.scripting.htl.HtlTest
[INFO] Running org.apache.sling.launchpad.webapp.integrationtest.teleporter.EmbeddedDependenciesTeleporterTest
[INFO] Tests run: 2, Failures: 0, Errors: 0, Skipped: 0, Time elapsed: 0.305 s - in org.apache.sling.launchpad.webapp.integrationtest.teleporter.EmbeddedDependenciesTeleporterTest
[INFO] Running org.apache.sling.launchpad.webapp.integrationtest.servlets.post.SlingPostProcessorTest
[INFO] Tests run: 1, Failures: 0, Errors: 0, Skipped: 0, Time elapsed: 0.012 s - in org.apache.sling.launchpad.webapp.integrationtest.servlets.post.SlingPostProcessorTest
[INFO] Running org.apache.sling.launchpad.webapp.integrationtest.xml.XPathTest
[INFO] Tests run: 1, Failures: 0, Errors: 0, Skipped: 0, Time elapsed: 0.051 s - in org.apache.sling.launchpad.webapp.integrationtest.xml.XPathTest
[INFO] Running org.apache.sling.launchpad.webapp.integrationtest.MappingEventsProxyTest
[INFO] Tests run: 1, Failures: 0, Errors: 0, Skipped: 0, Time elapsed: 8.537 s - in org.apache.sling.launchpad.webapp.integrationtest.MappingEventsProxyTest
[INFO] Running org.apache.sling.launchpad.webapp.integrationtest.issues.SLING2082Test
[INFO] Tests run: 2, Failures: 0, Errors: 0, Skipped: 0, Time elapsed: 0.008 s - in org.apache.sling.launchpad.webapp.integrationtest.issues.SLING2082Test
[INFO] Running org.apache.sling.launchpad.webapp.integrationtest.userManager.UpdateGroupTest
[INFO] Tests run: 8, Failures: 0, Errors: 0, Skipped: 0, Time elapsed: 1.109 s - in org.apache.sling.launchpad.webapp.integrationtest.userManager.UpdateGroupTest
[INFO] Running org.apache.sling.launchpad.webapp.integrationtest.accessManager.AccessPrivilegesInfoTest
[INFO] Tests run: 7, Failures: 0, Errors: 0, Skipped: 0, Time elapsed: 1.503 s - in org.apache.sling.launchpad.webapp.integrationtest.accessManager.AccessPrivilegesInfoTest
[INFO] Running org.apache.sling.launchpad.webapp.integrationtest.ResourceSuperTypeTest
[INFO] Tests run: 2, Failures: 0, Errors: 0, Skipped: 0, Time elapsed: 0.406 s - in org.apache.sling.launchpad.webapp.integrationtest.ResourceSuperTypeTest
[INFO] Running org.apache.sling.launchpad.webapp.integrationtest.login.AnonymousAccessTest
[INFO] Tests run: 4, Failures: 0, Errors: 0, Skipped: 0, Time elapsed: 0.126 s - in org.apache.sling.launchpad.webapp.integrationtest.login.AnonymousAccessTest
[INFO] Running org.apache.sling.launchpad.webapp.integrationtest.servlets.post.PostServletVersionableTest
[INFO] Tests run: 26, Failures: 0, Errors: 0, Skipped: 0, Time elapsed: 2.103 s - in org.apache.sling.launchpad.webapp.integrationtest.servlets.post.PostServletVersionableTest
[INFO] Running org.apache.sling.launchpad.webapp.integrationtest.servlets.resolution.HtmlDefaultServletTest
[INFO] %configMgr.pluginTitle: applyConfiguration: Deleting configuration org.apache.sling.launchpad.testservices.servlets.HtmlDefaultServlet
May 15, 2020 1:41:21 PM org.apache.sling.launchpad.testservices.servlets.TestServlet doGet
SEVERE: test JUL message
[INFO] %configMgr.pluginTitle: applyConfiguration: Deleting configuration org.apache.sling.launchpad.testservices.servlets.HtmlDefaultServlet
[INFO] Tests run: 2, Failures: 0, Errors: 0, Skipped: 0, Time elapsed: 6.257 s - in org.apache.sling.launchpad.webapp.integrationtest.servlets.resolution.HtmlDefaultServletTest
[INFO] Running org.apache.sling.launchpad.webapp.integrationtest.jaxb.JaxbMarshallingTest
[INFO] Tests run: 1, Failures: 0, Errors: 0, Skipped: 0, Time elapsed: 0.274 s - in org.apache.sling.launchpad.webapp.integrationtest.jaxb.JaxbMarshallingTest
[INFO] Running org.apache.sling.launchpad.webapp.integrationtest.UploadFileTest
[INFO] Tests run: 4, Failures: 0, Errors: 0, Skipped: 0, Time elapsed: 0.206 s - in org.apache.sling.launchpad.webapp.integrationtest.UploadFileTest
[INFO] Running org.apache.sling.launchpad.webapp.integrationtest.resourceresolver.ResourceResolverApiTest
[INFO] Tests run: 8, Failures: 0, Errors: 0, Skipped: 0, Time elapsed: 1.319 s - in org.apache.sling.launchpad.webapp.integrationtest.resourceresolver.ResourceResolverApiTest
[INFO] Running org.apache.sling.launchpad.webapp.integrationtest.accessManager.RemoveAcesTest
[INFO] Tests run: 4, Failures: 0, Errors: 0, Skipped: 0, Time elapsed: 0.526 s - in org.apache.sling.launchpad.webapp.integrationtest.accessManager.RemoveAcesTest
[INFO] Running org.apache.sling.launchpad.webapp.integrationtest.login.RedirectOnLogoutTest
[INFO] Tests run: 1, Failures: 0, Errors: 0, Skipped: 0, Time elapsed: 0 s - in org.apache.sling.launchpad.webapp.integrationtest.login.RedirectOnLogoutTest
[INFO] Running org.apache.sling.launchpad.webapp.integrationtest.login.AuthRequestLoginTest
[INFO] Tests run: 1, Failures: 0, Errors: 0, Skipped: 0, Time elapsed: 0.006 s - in org.apache.sling.launchpad.webapp.integrationtest.login.AuthRequestLoginTest
[INFO] Running org.apache.sling.launchpad.webapp.integrationtest.servlets.post.PostServletDeleteParentTest
[INFO] Tests run: 6, Failures: 0, Errors: 0, Skipped: 0, Time elapsed: 0.235 s - in org.apache.sling.launchpad.webapp.integrationtest.servlets.post.PostServletDeleteParentTest
[INFO] Running org.apache.sling.launchpad.webapp.integrationtest.DavExDisabledAnonAccessTest
[INFO] Tests run: 2, Failures: 0, Errors: 0, Skipped: 0, Time elapsed: 0.668 s - in org.apache.sling.launchpad.webapp.integrationtest.DavExDisabledAnonAccessTest
[INFO] Running org.apache.sling.launchpad.webapp.integrationtest.ForwardTest
[INFO] Tests run: 5, Failures: 0, Errors: 0, Skipped: 0, Time elapsed: 2.226 s - in org.apache.sling.launchpad.webapp.integrationtest.ForwardTest
[INFO] Running org.apache.sling.launchpad.webapp.integrationtest.servlets.resolution.SelectorServletTest
May 15, 2020 1:41:30 PM org.apache.sling.launchpad.testservices.servlets.TestServlet doGet
SEVERE: test JUL message
May 15, 2020 1:41:30 PM org.apache.sling.launchpad.testservices.servlets.TestServlet doGet
SEVERE: test JUL message
[INFO] Tests run: 4, Failures: 0, Errors: 0, Skipped: 0, Time elapsed: 0.41 s - in org.apache.sling.launchpad.webapp.integrationtest.servlets.resolution.SelectorServletTest
[INFO] Running org.apache.sling.launchpad.webapp.integrationtest.provisioning.EmbeddedModelTest
[INFO] Tests run: 2, Failures: 0, Errors: 0, Skipped: 0, Time elapsed: 0.275 s - in org.apache.sling.launchpad.webapp.integrationtest.provisioning.EmbeddedModelTest
[INFO] Running org.apache.sling.launchpad.webapp.integrationtest.CreateNodeTest
[INFO] Tests run: 6, Failures: 0, Errors: 0, Skipped: 0, Time elapsed: 0.176 s - in org.apache.sling.launchpad.webapp.integrationtest.CreateNodeTest
[INFO] Running org.apache.sling.launchpad.webapp.integrationtest.StaticContentTest
[INFO] Tests run: 2, Failures: 0, Errors: 0, Skipped: 0, Time elapsed: 0.001 s - in org.apache.sling.launchpad.webapp.integrationtest.StaticContentTest
[INFO] Running org.apache.sling.launchpad.webapp.integrationtest.teleporter.ServicesPresentTest
[INFO] Tests run: 1, Failures: 0, Errors: 0, Skipped: 0, Time elapsed: 0.127 s - in org.apache.sling.launchpad.webapp.integrationtest.teleporter.ServicesPresentTest
[INFO] Running org.apache.sling.launchpad.webapp.integrationtest.servlets.post.PostServletAtMoveTest
[INFO] Tests run: 9, Failures: 0, Errors: 0, Skipped: 0, Time elapsed: 0.415 s - in org.apache.sling.launchpad.webapp.integrationtest.servlets.post.PostServletAtMoveTest
[INFO] Running org.apache.sling.launchpad.webapp.integrationtest.servlets.HeadServletTest
[INFO] Tests run: 6, Failures: 0, Errors: 0, Skipped: 0, Time elapsed: 0.036 s - in org.apache.sling.launchpad.webapp.integrationtest.servlets.HeadServletTest
[INFO] Running org.apache.sling.launchpad.webapp.integrationtest.ImmediateScriptActivationTest
[INFO] Tests run: 2, Failures: 0, Errors: 0, Skipped: 0, Time elapsed: 1.74 s - in org.apache.sling.launchpad.webapp.integrationtest.ImmediateScriptActivationTest
[INFO] Running org.apache.sling.launchpad.webapp.integrationtest.VanityPathTest
[INFO] Tests run: 5, Failures: 0, Errors: 0, Skipped: 0, Time elapsed: 0.187 s - in org.apache.sling.launchpad.webapp.integrationtest.VanityPathTest
[INFO] Running org.apache.sling.launchpad.webapp.integrationtest.userManager.CreateUserTest
[INFO] Tests run: 11, Failures: 0, Errors: 0, Skipped: 0, Time elapsed: 0.374 s - in org.apache.sling.launchpad.webapp.integrationtest.userManager.CreateUserTest
[INFO] Running org.apache.sling.launchpad.webapp.integrationtest.accessManager.GetAclTest
[INFO] Tests run: 7, Failures: 0, Errors: 0, Skipped: 0, Time elapsed: 0.897 s - in org.apache.sling.launchpad.webapp.integrationtest.accessManager.GetAclTest
[INFO] Running org.apache.sling.launchpad.webapp.integrationtest.scripting.SlingJSPTaglibTest
[INFO] Tests run: 1, Failures: 0, Errors: 0, Skipped: 0, Time elapsed: 1.022 s - in org.apache.sling.launchpad.webapp.integrationtest.scripting.SlingJSPTaglibTest
[INFO] 
[INFO] Results:
[INFO] 
[ERROR] Failures: 
[ERROR]   CrudTest.testCreate:63->HttpTestBase.getContent:424->HttpTestBase.getContent:432->HttpTestBase.getContent:472
Expected Content-Type that starts with 'text/plain' for http://localhost:41000/CrudTest/1589549925738/5_1589549925753.html,
got 'text/html;charset=utf-8'
[INFO] 
[ERROR] Tests run: 657, Failures: 1, Errors: 0, Skipped: 1
[INFO] 
[INFO] 
[INFO] --- jacoco-maven-plugin:0.7.9:merge (merge-unit-and-it) @ org.apache.sling.launchpad.testing
---
[INFO] Loading execution data file /home/jenkins/jenkins-slave/workspace/e-sling-launchpad-testing_master/target/jacoco-it.exec
[INFO] Writing merged execution data to /home/jenkins/jenkins-slave/workspace/e-sling-launchpad-testing_master/target/jacoco-merged.exec
[INFO] 
[INFO] --- slingstart-maven-plugin:1.7.16:stop (stop-container) @ org.apache.sling.launchpad.testing
---
[INFO] Stopping 1 Launchpad instances
[INFO] Stopping Launchpad '_-41000'
15.05.2020 13:41:37.009 *INFO * [Apache Sling Terminator] Java VM is shutting down
15.05.2020 13:41:37.011 *INFO * [Apache Sling Terminator] Stopping Apache Sling
[DEBUG] [ServiceReference 677 from bundle 95 : org.apache.sling.jcr.davex:1.3.10 ref=[javax.servlet.Servlet]
properties={objectClass=[javax.servlet.Servlet], osgi.http.whiteboard.context.select=(osgi.http.whiteboard.context.name=DavExAuthHttpContext),
osgi.http.whiteboard.servlet.pattern=/server/*, service.bundleid=95, service.description=Sling
JcrRemoting Servlet, service.id=677, service.scope=singleton, service.vendor=The Apache Software
Foundation, servlet.init.createAbsoluteURI=true, servlet.init.csrf-protection=disabled, servlet.init.protectedhandlers-config=org.apache.jackrabbit.server.remoting.davex.AclRemoveHandler,
servlet.init.resource-path-prefix=/server, sling.auth.requirements=-/server}] Ignoring unmatching
Servlet service
[DEBUG] [ServiceReference 355 from bundle 142 : org.apache.sling.engine:2.7.2 ref=[javax.servlet.Servlet]
properties={objectClass=[javax.servlet.Servlet], osgi.http.whiteboard.context.select=(osgi.http.whiteboard.context.name=org.apache.sling),
osgi.http.whiteboard.servlet.name=ApacheSling/2.7, osgi.http.whiteboard.servlet.pattern=/,
service.bundleid=142, service.description=Apache Sling Engine Main Servlet, service.id=355,
service.scope=singleton, service.vendor=The Apache Software Foundation}] Ignoring unmatching
Servlet service
[DEBUG] [ServiceReference 149 from bundle 61 : org.apache.sling.launchpad.test-services:12.0.0.SNAPSHOT
ref=[javax.servlet.Servlet] properties={component.id=52, component.name=org.apache.sling.launchpad.testservices.servlets.R6WhiteboardServlet,
objectClass=[javax.servlet.Servlet], osgi.http.whiteboard.context.select=(osgi.http.whiteboard.context.name=org.apache.sling),
osgi.http.whiteboard.servlet.pattern=/whiteboard_r6, service.bundleid=61, service.id=149,
service.pid=org.apache.sling.launchpad.testservices.servlets.R6WhiteboardServlet, service.scope=bundle,
service.vendor=The Apache Software Foundation}] Ignoring unmatching Servlet service
[DEBUG] [ServiceReference 374 from bundle 142 : org.apache.sling.engine:2.7.2 ref=[javax.servlet.Filter]
properties={component.id=255, component.name=org.apache.sling.engine.parameters, file.max=-1,
file.threshold=256000, objectClass=[javax.servlet.Filter], osgi.http.whiteboard.context.select=(osgi.http.whiteboard.context.name=org.apache.sling),
osgi.http.whiteboard.filter.pattern=[/], request.max=-1, service.bundleid=142, service.description=Filter
for request parameter support, service.id=374, service.ranking=2147483647, service.scope=bundle,
service.vendor=The Apache Software Foundation, sling.default.max.parameters=10000, sling.default.parameter.checkForAdditionalContainerParameters=false,
sling.default.parameter.encoding=ISO-8859-1}] Ignoring unmatching Filter service
[DEBUG] [ServiceReference 590 from bundle 142 : org.apache.sling.engine:2.7.2 ref=[javax.servlet.Filter]
properties={component.id=254, component.name=org.apache.sling.engine.impl.log.RequestLoggerFilter,
objectClass=[javax.servlet.Filter], osgi.http.whiteboard.context.select=(osgi.http.whiteboard.context.name=org.apache.sling),
osgi.http.whiteboard.filter.pattern=[/], service.bundleid=142, service.description=Request
Logger Filter, service.id=590, service.ranking=32768, service.scope=bundle, service.vendor=The
Apache Software Foundation}] Ignoring unmatching Filter service
[INFO] Apachde Felix Http Whiteboard Service stopped
[DEBUG] [ServiceReference 1170 from bundle 41 : org.apache.felix.healthcheck.core:2.0.6 ref=[javax.servlet.Servlet]
properties={objectClass=[javax.servlet.Servlet], osgi.http.whiteboard.context.select=(osgi.http.whiteboard.context.name=internal.http.serviceunavailablefilter),
osgi.http.whiteboard.servlet.pattern=/, service.bundleid=41, service.id=1170, service.ranking=0,
service.scope=singleton}] Ignoring unmatching Servlet service
[INFO] Stopped Jetty.
15.05.2020 13:41:44.539 *INFO * [Sling Notifier] Apache Sling has been stopped
[INFO] 
[INFO] --- ianal-maven-plugin:1.0-alpha-1:verify-legal-files (default) @ org.apache.sling.launchpad.testing
---
[INFO] Checking legal files in: org.apache.sling.launchpad.testing-12-SNAPSHOT.jar
[INFO] Checking legal files in: org.apache.sling.launchpad.testing-12-SNAPSHOT-sources.jar
[INFO] 
[INFO] --- apache-rat-plugin:0.11:check (default) @ org.apache.sling.launchpad.testing ---
[INFO] 51 implicit excludes (use -debug for more details).
[INFO] Exclude: DEPENDENCIES
[INFO] Exclude: src/main/appended-resources/META-INF/*
[INFO] Exclude: velocity.log
[INFO] Exclude: target/*
[INFO] Exclude: README.md
[INFO] Exclude: maven-eclipse.xml
[INFO] Exclude: .*
[INFO] Exclude: .*/**
[INFO] Exclude: **/*.json
[INFO] Exclude: DEPENDENCIES
[INFO] Exclude: **/*.rej
[INFO] Exclude: hs_err_*.log
[INFO] Exclude: **/repository/index/*/index-details.txt
[INFO] Exclude: bnd.bnd
[INFO] 7 resources included (use -debug for more details)
[INFO] Rat check: Summary of files. Unapproved: 0 unknown: 0 generated: 0 approved: 6 licence.
[INFO] 
[INFO] --- jacoco-maven-plugin:0.7.9:report (report) @ org.apache.sling.launchpad.testing
---
[INFO] Skipping JaCoCo execution due to missing execution data file.
[INFO] 
[INFO] --- jacoco-maven-plugin:0.7.9:report-integration (report-integration) @ org.apache.sling.launchpad.testing
---
[INFO] Loading execution data file /home/jenkins/jenkins-slave/workspace/e-sling-launchpad-testing_master/target/jacoco-it.exec
[INFO] Analyzed bundle 'Apache Sling Launchpad Testing' with 0 classes
[INFO] 
[INFO] --- jacoco-maven-plugin:0.7.9:report (report-merged) @ org.apache.sling.launchpad.testing
---
[INFO] Loading execution data file /home/jenkins/jenkins-slave/workspace/e-sling-launchpad-testing_master/target/jacoco-merged.exec
[INFO] Analyzed bundle 'Apache Sling Launchpad Testing' with 0 classes
[INFO] 
[INFO] --- maven-failsafe-plugin:2.21.0:verify (default) @ org.apache.sling.launchpad.testing
---
[INFO] 
[INFO] ------------------------------------------------------------------------
[INFO] Skipping Apache Sling Launchpad Testing
[INFO] This project has been banned from the build due to previous failures.
[INFO] ------------------------------------------------------------------------
[INFO] ------------------------------------------------------------------------
[INFO] BUILD FAILURE
[INFO] ------------------------------------------------------------------------
[INFO] Total time:  04:08 min
[INFO] Finished at: 2020-05-15T13:41:46Z
[INFO] ------------------------------------------------------------------------
[INFO] [jenkins-event-spy] Generated /home/jenkins/jenkins-slave/workspace/e-sling-launchpad-testing_master@tmp/withMaven5189ce31/maven-spy-20200515-133737-340652752254430115835.log
[ERROR] Failed to execute goal org.apache.maven.plugins:maven-failsafe-plugin:2.21.0:verify
(default) on project org.apache.sling.launchpad.testing: There are test failures.
[ERROR] 
[ERROR] Please refer to /home/jenkins/jenkins-slave/workspace/e-sling-launchpad-testing_master/target/failsafe-reports
for the individual test results.
[ERROR] Please refer to dump files (if any exist) [date]-jvmRun[N].dump, [date].dumpstream
and [date]-jvmRun[N].dumpstream.
[ERROR] -> [Help 1]
[ERROR] 
[ERROR] To see the full stack trace of the errors, re-run Maven with the -e switch.
[ERROR] Re-run Maven using the -X switch to enable full debug logging.
[ERROR] 
[ERROR] For more information about the errors and possible solutions, please read the following
articles:
[ERROR] [Help 1] http://cwiki.apache.org/confluence/display/MAVEN/MojoFailureException
[Pipeline] echo
Marking build unstable due to mvn sonar:sonar failing. See https://cwiki.apache.org/confluence/display/SLING/SonarCloud+analysis
for more info.
[Pipeline] }
[withMaven] Publishers: 
[Pipeline] // withMaven
[Pipeline] }
[Pipeline] // withCredentials
[Pipeline] }
[Pipeline] // stage
[Pipeline] }
[Pipeline] // timeout
[Pipeline] stage
[Pipeline] { (Notifications)
[Pipeline] echo
Status change is BROKEN, notifications will be sent.
[Pipeline] emailext
Mime
  • Unnamed multipart/mixed (inline, None, 0 bytes)
View raw message