sling-dev mailing list archives

Site index · List index
Message view « Date » · « Thread »
Top « Date » · « Thread »
From Apache Jenkins Server <jenk...@builds.apache.org>
Subject [Jenkins] Sling » sling-org-apache-sling-launchpad-testing » master #807 is BROKEN
Date Sat, 23 May 2020 13:36:21 GMT
Please see https://builds.apache.org/job/Sling/job/sling-org-apache-sling-launchpad-testing/job/master/807/
for details.

No further emails will be sent until the status of the build is changed.
Build log follows below:

[...truncated 2079 lines...]
[INFO] Tests run: 3, Failures: 0, Errors: 0, Skipped: 0, Time elapsed: 1.167 s - in org.apache.sling.launchpad.webapp.integrationtest.servlets.post.SlingAutoPropertiesTest
[INFO] Running org.apache.sling.launchpad.webapp.integrationtest.servlets.post.PostServletUpdateTest
[INFO] Tests run: 7, Failures: 0, Errors: 0, Skipped: 0, Time elapsed: 0.269 s - in org.apache.sling.launchpad.webapp.integrationtest.servlets.post.PostServletUpdateTest
[INFO] Running org.apache.sling.launchpad.webapp.integrationtest.SyntheticResourceTest
[INFO] Tests run: 1, Failures: 0, Errors: 0, Skipped: 0, Time elapsed: 0.074 s - in org.apache.sling.launchpad.webapp.integrationtest.SyntheticResourceTest
[INFO] Running org.apache.sling.launchpad.webapp.integrationtest.teleporter.MultipleRulesTeleporterTest
[INFO] Tests run: 2, Failures: 0, Errors: 0, Skipped: 0, Time elapsed: 0.358 s - in org.apache.sling.launchpad.webapp.integrationtest.teleporter.MultipleRulesTeleporterTest
[INFO] Running org.apache.sling.launchpad.webapp.integrationtest.auth.AuthenticationResponseCodeTest
[INFO] Tests run: 10, Failures: 0, Errors: 0, Skipped: 0, Time elapsed: 0.104 s - in org.apache.sling.launchpad.webapp.integrationtest.auth.AuthenticationResponseCodeTest
[INFO] Running org.apache.sling.launchpad.webapp.integrationtest.runmodes.InactiveRunModeTest
[INFO] Tests run: 2, Failures: 0, Errors: 0, Skipped: 0, Time elapsed: 0.014 s - in org.apache.sling.launchpad.webapp.integrationtest.runmodes.InactiveRunModeTest
[INFO] Running org.apache.sling.launchpad.webapp.integrationtest.indexing.FullTextIndexingTest
[INFO] Tests run: 3, Failures: 0, Errors: 0, Skipped: 0, Time elapsed: 11.705 s - in org.apache.sling.launchpad.webapp.integrationtest.indexing.FullTextIndexingTest
[INFO] Running org.apache.sling.launchpad.webapp.integrationtest.servlets.post.PostServletCopyTest
[INFO] Tests run: 16, Failures: 0, Errors: 0, Skipped: 0, Time elapsed: 1.427 s - in org.apache.sling.launchpad.webapp.integrationtest.servlets.post.PostServletCopyTest
[INFO] Running org.apache.sling.launchpad.webapp.integrationtest.servlets.post.PostServletOrderTest
[INFO] Tests run: 9, Failures: 0, Errors: 0, Skipped: 0, Time elapsed: 0.64 s - in org.apache.sling.launchpad.webapp.integrationtest.servlets.post.PostServletOrderTest
[INFO] Running org.apache.sling.launchpad.webapp.integrationtest.servlets.post.PostStatusTest
[INFO] Tests run: 4, Failures: 0, Errors: 0, Skipped: 0, Time elapsed: 0.041 s - in org.apache.sling.launchpad.webapp.integrationtest.servlets.post.PostStatusTest
[INFO] Running org.apache.sling.launchpad.webapp.integrationtest.WriteableResourcesProxyTest
[INFO] Tests run: 1, Failures: 0, Errors: 0, Skipped: 0, Time elapsed: 0.014 s - in org.apache.sling.launchpad.webapp.integrationtest.WriteableResourcesProxyTest
[INFO] Running org.apache.sling.launchpad.webapp.integrationtest.accessManager.AccessPrivilegesInfoTest
[INFO] Tests run: 7, Failures: 0, Errors: 0, Skipped: 0, Time elapsed: 1.991 s - in org.apache.sling.launchpad.webapp.integrationtest.accessManager.AccessPrivilegesInfoTest
[INFO] Running org.apache.sling.launchpad.webapp.integrationtest.ResourceSuperTypeTest
[INFO] Tests run: 2, Failures: 0, Errors: 0, Skipped: 0, Time elapsed: 0.471 s - in org.apache.sling.launchpad.webapp.integrationtest.ResourceSuperTypeTest
[INFO] Running org.apache.sling.launchpad.webapp.integrationtest.servlets.resolution.PathsServletTest
May 23, 2020 1:35:46 PM org.apache.sling.launchpad.testservices.servlets.TestServlet doGet
SEVERE: test JUL message
May 23, 2020 1:35:46 PM org.apache.sling.launchpad.testservices.servlets.TestServlet doGet
SEVERE: test JUL message
[INFO] Tests run: 2, Failures: 0, Errors: 0, Skipped: 0, Time elapsed: 0.271 s - in org.apache.sling.launchpad.webapp.integrationtest.servlets.resolution.PathsServletTest
[INFO] Running org.apache.sling.launchpad.webapp.integrationtest.servlets.post.PostServletDeleteParentTest
[INFO] Tests run: 6, Failures: 0, Errors: 0, Skipped: 0, Time elapsed: 0.3 s - in org.apache.sling.launchpad.webapp.integrationtest.servlets.post.PostServletDeleteParentTest
[INFO] Running org.apache.sling.launchpad.webapp.integrationtest.servlets.post.PostServletPatchTest
[INFO] Tests run: 4, Failures: 0, Errors: 0, Skipped: 0, Time elapsed: 0.136 s - in org.apache.sling.launchpad.webapp.integrationtest.servlets.post.PostServletPatchTest
[INFO] Running org.apache.sling.launchpad.webapp.integrationtest.teleporter.LdapFilterTeleporterTest
[INFO] Tests run: 2, Failures: 0, Errors: 0, Skipped: 0, Time elapsed: 0.301 s - in org.apache.sling.launchpad.webapp.integrationtest.teleporter.LdapFilterTeleporterTest
[INFO] Running org.apache.sling.launchpad.webapp.integrationtest.repository.RepositoryInitializersTest
[INFO] Tests run: 1, Failures: 0, Errors: 0, Skipped: 0, Time elapsed: 0 s - in org.apache.sling.launchpad.webapp.integrationtest.repository.RepositoryInitializersTest
[INFO] Running org.apache.sling.launchpad.webapp.integrationtest.servlets.resolution.RequestUriOptingServletTest
May 23, 2020 1:35:47 PM org.apache.sling.launchpad.testservices.servlets.TestServlet doGet
SEVERE: test JUL message
May 23, 2020 1:35:47 PM org.apache.sling.launchpad.testservices.servlets.TestServlet doGet
SEVERE: test JUL message
[INFO] Tests run: 4, Failures: 0, Errors: 0, Skipped: 0, Time elapsed: 0.478 s - in org.apache.sling.launchpad.webapp.integrationtest.servlets.resolution.RequestUriOptingServletTest
[INFO] Running org.apache.sling.launchpad.webapp.integrationtest.servlets.post.CustomPostOperationTest
[INFO] Tests run: 2, Failures: 0, Errors: 0, Skipped: 0, Time elapsed: 0.156 s - in org.apache.sling.launchpad.webapp.integrationtest.servlets.post.CustomPostOperationTest
[INFO] Running org.apache.sling.launchpad.webapp.integrationtest.provisioning.EmbeddedModelTest
[INFO] Tests run: 2, Failures: 0, Errors: 0, Skipped: 0, Time elapsed: 0.283 s - in org.apache.sling.launchpad.webapp.integrationtest.provisioning.EmbeddedModelTest
[INFO] Running org.apache.sling.launchpad.webapp.integrationtest.NodeTypeBasedRenderingTest
[INFO] Tests run: 7, Failures: 0, Errors: 0, Skipped: 0, Time elapsed: 1.224 s - in org.apache.sling.launchpad.webapp.integrationtest.NodeTypeBasedRenderingTest
[INFO] Running org.apache.sling.launchpad.webapp.integrationtest.repository.RepositoryNameTest
[INFO] Tests run: 1, Failures: 0, Errors: 0, Skipped: 0, Time elapsed: 0.019 s - in org.apache.sling.launchpad.webapp.integrationtest.repository.RepositoryNameTest
[INFO] Running org.apache.sling.launchpad.webapp.integrationtest.DavExDisabledAnonAccessTest
[INFO] Tests run: 2, Failures: 0, Errors: 0, Skipped: 0, Time elapsed: 0.841 s - in org.apache.sling.launchpad.webapp.integrationtest.DavExDisabledAnonAccessTest
[INFO] Running org.apache.sling.launchpad.webapp.integrationtest.servlets.resolution.PrefixTest
May 23, 2020 1:35:50 PM org.apache.sling.launchpad.testservices.servlets.TestServlet doGet
SEVERE: test JUL message
May 23, 2020 1:35:50 PM org.apache.sling.launchpad.testservices.servlets.TestServlet doGet
SEVERE: test JUL message
May 23, 2020 1:35:50 PM org.apache.sling.launchpad.testservices.servlets.TestServlet doGet
SEVERE: test JUL message
[INFO] Tests run: 3, Failures: 0, Errors: 0, Skipped: 0, Time elapsed: 0.386 s - in org.apache.sling.launchpad.webapp.integrationtest.servlets.resolution.PrefixTest
[INFO] Running org.apache.sling.launchpad.webapp.integrationtest.servlets.post.PostServletImportTest
[INFO] Tests run: 19, Failures: 0, Errors: 0, Skipped: 0, Time elapsed: 1.139 s - in org.apache.sling.launchpad.webapp.integrationtest.servlets.post.PostServletImportTest
[INFO] Running org.apache.sling.launchpad.webapp.integrationtest.repository.RepoinitPathTest
[INFO] Tests run: 1, Failures: 0, Errors: 0, Skipped: 0, Time elapsed: 0.141 s - in org.apache.sling.launchpad.webapp.integrationtest.repository.RepoinitPathTest
[INFO] Running org.apache.sling.launchpad.webapp.integrationtest.crud.CrudTest
[INFO] Tests run: 1, Failures: 0, Errors: 0, Skipped: 0, Time elapsed: 0.218 s - in org.apache.sling.launchpad.webapp.integrationtest.crud.CrudTest
[INFO] Running org.apache.sling.launchpad.webapp.integrationtest.scripting.StandaloneScriptExecutionTest
[INFO] Tests run: 1, Failures: 0, Errors: 0, Skipped: 0, Time elapsed: 0.077 s - in org.apache.sling.launchpad.webapp.integrationtest.scripting.StandaloneScriptExecutionTest
[INFO] Running org.apache.sling.launchpad.webapp.integrationtest.servlets.post.SlingPostProcessorTest
[INFO] Tests run: 1, Failures: 0, Errors: 0, Skipped: 0, Time elapsed: 0.001 s - in org.apache.sling.launchpad.webapp.integrationtest.servlets.post.SlingPostProcessorTest
[INFO] Running org.apache.sling.launchpad.webapp.integrationtest.servlets.R6WhiteboardServletTest
[INFO] Tests run: 1, Failures: 0, Errors: 0, Skipped: 0, Time elapsed: 0.001 s - in org.apache.sling.launchpad.webapp.integrationtest.servlets.R6WhiteboardServletTest
[INFO] Running org.apache.sling.launchpad.webapp.integrationtest.teleporter.TeleportedResourcesSingleTest
[INFO] Tests run: 3, Failures: 0, Errors: 0, Skipped: 0, Time elapsed: 0.427 s - in org.apache.sling.launchpad.webapp.integrationtest.teleporter.TeleportedResourcesSingleTest
[INFO] Running org.apache.sling.launchpad.webapp.jsp.TagFileTest
[INFO] Tests run: 1, Failures: 0, Errors: 0, Skipped: 0, Time elapsed: 0.278 s - in org.apache.sling.launchpad.webapp.jsp.TagFileTest
[INFO] Running org.apache.sling.launchpad.webapp.integrationtest.repository.SystemUsersTest
[INFO] Tests run: 2, Failures: 0, Errors: 0, Skipped: 0, Time elapsed: 0.297 s - in org.apache.sling.launchpad.webapp.integrationtest.repository.SystemUsersTest
[INFO] Running org.apache.sling.launchpad.webapp.integrationtest.WebdavDeleteTest
[INFO] Tests run: 1, Failures: 0, Errors: 0, Skipped: 0, Time elapsed: 0.156 s - in org.apache.sling.launchpad.webapp.integrationtest.WebdavDeleteTest
[INFO] Running org.apache.sling.launchpad.webapp.integrationtest.scripting.SlingJSPTaglibTest
[INFO] Tests run: 1, Failures: 0, Errors: 0, Skipped: 0, Time elapsed: 1.061 s - in org.apache.sling.launchpad.webapp.integrationtest.scripting.SlingJSPTaglibTest
[INFO] Running org.apache.sling.launchpad.webapp.integrationtest.servlets.post.ReferenceTypeHintTest
[INFO] Tests run: 2, Failures: 0, Errors: 0, Skipped: 0, Time elapsed: 0.487 s - in org.apache.sling.launchpad.webapp.integrationtest.servlets.post.ReferenceTypeHintTest
[INFO] Running org.apache.sling.launchpad.webapp.integrationtest.JavascriptWrappersTest
[INFO] Tests run: 1, Failures: 0, Errors: 0, Skipped: 0, Time elapsed: 0.16 s - in org.apache.sling.launchpad.webapp.integrationtest.JavascriptWrappersTest
[INFO] Running org.apache.sling.launchpad.webapp.integrationtest.issues.SLING2094Test
[INFO] Tests run: 2, Failures: 0, Errors: 0, Skipped: 0, Time elapsed: 0.351 s - in org.apache.sling.launchpad.webapp.integrationtest.issues.SLING2094Test
[INFO] Running org.apache.sling.launchpad.webapp.integrationtest.GetWithSuffixTest
[INFO] Tests run: 4, Failures: 0, Errors: 0, Skipped: 0, Time elapsed: 0.37 s - in org.apache.sling.launchpad.webapp.integrationtest.GetWithSuffixTest
[INFO] Running org.apache.sling.launchpad.webapp.integrationtest.login.RedirectOnLogoutTest
[INFO] Tests run: 1, Failures: 0, Errors: 0, Skipped: 0, Time elapsed: 0.002 s - in org.apache.sling.launchpad.webapp.integrationtest.login.RedirectOnLogoutTest
[INFO] Running org.apache.sling.launchpad.webapp.integrationtest.xml.SaxTest
[INFO] Tests run: 1, Failures: 0, Errors: 0, Skipped: 0, Time elapsed: 0.001 s - in org.apache.sling.launchpad.webapp.integrationtest.xml.SaxTest
[INFO] Running org.apache.sling.launchpad.webapp.integrationtest.RequestAttributeTest
[INFO] Tests run: 1, Failures: 0, Errors: 0, Skipped: 0, Time elapsed: 0.252 s - in org.apache.sling.launchpad.webapp.integrationtest.RequestAttributeTest
[INFO] Running org.apache.sling.launchpad.webapp.integrationtest.servlets.post.PostServletOutputContentTypeTest
[INFO] Tests run: 6, Failures: 0, Errors: 0, Skipped: 0, Time elapsed: 0.078 s - in org.apache.sling.launchpad.webapp.integrationtest.servlets.post.PostServletOutputContentTypeTest
[INFO] Running org.apache.sling.launchpad.webapp.integrationtest.servlets.post.SlingDateValuesTest
[INFO] Tests run: 2, Failures: 0, Errors: 0, Skipped: 0, Time elapsed: 1.813 s - in org.apache.sling.launchpad.webapp.integrationtest.servlets.post.SlingDateValuesTest
[INFO] Running org.apache.sling.launchpad.webapp.integrationtest.userManager.RemoveAuthorizablesTest
[INFO] Tests run: 11, Failures: 0, Errors: 0, Skipped: 0, Time elapsed: 0.8 s - in org.apache.sling.launchpad.webapp.integrationtest.userManager.RemoveAuthorizablesTest
[INFO] Running org.apache.sling.launchpad.webapp.integrationtest.login.AuthRequestLoginTest
[INFO] Tests run: 1, Failures: 0, Errors: 0, Skipped: 0, Time elapsed: 0.019 s - in org.apache.sling.launchpad.webapp.integrationtest.login.AuthRequestLoginTest
[INFO] Running org.apache.sling.launchpad.webapp.integrationtest.SlingResourceTypeRenderingTest
[INFO] %configMgr.pluginTitle: applyConfiguration: Deleting configuration org.apache.sling.servlets.get.impl.version.VersionInfoServlet
[INFO] Tests run: 9, Failures: 0, Errors: 0, Skipped: 0, Time elapsed: 1.099 s - in org.apache.sling.launchpad.webapp.integrationtest.SlingResourceTypeRenderingTest
[INFO] Running org.apache.sling.launchpad.webapp.integrationtest.VersionInfoServletTest
23.05.2020 13:36:01 *ERROR* fromDocuments: Error accessing document bundle://3aae26ed-df68-4e79-bfd1-cc69e426badb_104.0:0/OSGI-INF/metatype/com.composum.sling.clientlibs.service.ClientlibConfigurationService.properties
: XML parsing exception while reading metadata: name expected (position:START_TAG <null>@7:218
in bundle://3aae26ed-df68-4e79-bfd1-cc69e426badb_104.0:0/OSGI-INF/metatype/com.composum.sling.clientlibs.service.ClientlibConfigurationService.properties)

[INFO] Tests run: 3, Failures: 0, Errors: 0, Skipped: 0, Time elapsed: 3.252 s - in org.apache.sling.launchpad.webapp.integrationtest.VersionInfoServletTest
[INFO] Running org.apache.sling.launchpad.webapp.integrationtest.servlets.resolution.PrioritiesTest
May 23, 2020 1:36:03 PM org.apache.sling.launchpad.testservices.servlets.TestServlet doGet
SEVERE: test JUL message
[INFO] Tests run: 1, Failures: 0, Errors: 0, Skipped: 0, Time elapsed: 0.104 s - in org.apache.sling.launchpad.webapp.integrationtest.servlets.resolution.PrioritiesTest
[INFO] Running org.apache.sling.launchpad.webapp.integrationtest.teleporter.BasicTeleporterTest
[INFO] Tests run: 2, Failures: 0, Errors: 0, Skipped: 0, Time elapsed: 0.265 s - in org.apache.sling.launchpad.webapp.integrationtest.teleporter.BasicTeleporterTest
[INFO] 
[INFO] Results:
[INFO] 
[ERROR] Failures: 
[ERROR] org.apache.sling.launchpad.webapp.integrationtest.userManager.CreateUserTest.testCreateUserResponseAsJSON(org.apache.sling.launchpad.webapp.integrationtest.userManager.CreateUserTest)
[ERROR]   Run 1: CreateUserTest.testCreateUserResponseAsJSON:289 Expected status 200 for http://localhost:41000/system/userManager/user.create.json
(content=<html>
<head>
    <title>Error while processing /system/userManager/user</title>
</head>
    <body>
    <h1>Error while processing /system/userManager/user</h1>
    <table>
        <tbody>
            <tr>
                <td>Status</td>
                <td><div id="Status">500</div></td>
            </tr>
            <tr>
                <td>Message</td>
                <td><div id="Message">java.lang.UnsupportedOperationException:
create &apos;userManager&apos; at /system</div></td>
            </tr>
            <tr>
                <td>Location</td>
                <td><a href="/system/userManager/user" id="Location">/system/userManager/user</a></td>
            </tr>
            <tr>
                <td>Parent Location</td>
                <td><a href="/system/userManager" id="ParentLocation">/system/userManager</a></td>
            </tr>
            <tr>
                <td>Path</td>
                <td><div id="Path">/system/userManager/user</div></td>
            </tr>
            <tr>
                <td>Referer</td>
                <td><div id="Referer"></div></td>
            </tr>
            <tr>
                <td>ChangeLog</td>
                <td><div id="ChangeLog"></div></td>
            </tr>
        </tbody>
    </table>
    <p><a href="/system/userManager/user">Modified Resource</a></p>
    <p><a href="/system/userManager">Parent of Modified Resource</a></p>
    </body>
</html>) expected:<200> but was:<500>
[ERROR]   Run 2: CreateUserTest.cleanup:62 expected:<200> but was:<500>
[INFO] 
[ERROR]   CreateUserTest.testNotAuthorizedCreateUser:118 Unexpected status while attempting
to create test user at http://localhost:41000/system/userManager/user.create.html expected:<200>
but was:<500>
[INFO] 
[ERROR] Tests run: 657, Failures: 2, Errors: 0, Skipped: 1
[INFO] 
[INFO] 
[INFO] --- slingstart-maven-plugin:1.7.16:stop (stop-container) @ org.apache.sling.launchpad.testing
---
[INFO] Stopping 1 Launchpad instances
[INFO] Stopping Launchpad '_-41000'
23.05.2020 13:36:04.303 *INFO * [Apache Sling Terminator] Java VM is shutting down
23.05.2020 13:36:04.304 *INFO * [Apache Sling Terminator] Stopping Apache Sling
[DEBUG] [ServiceReference 1090 from bundle 95 : org.apache.sling.jcr.davex:1.3.10 ref=[javax.servlet.Servlet]
properties={objectClass=[javax.servlet.Servlet], osgi.http.whiteboard.context.select=(osgi.http.whiteboard.context.name=DavExAuthHttpContext),
osgi.http.whiteboard.servlet.pattern=/server/*, service.bundleid=95, service.description=Sling
JcrRemoting Servlet, service.id=1090, service.scope=singleton, service.vendor=The Apache Software
Foundation, servlet.init.createAbsoluteURI=true, servlet.init.csrf-protection=disabled, servlet.init.protectedhandlers-config=org.apache.jackrabbit.server.remoting.davex.AclRemoveHandler,
servlet.init.resource-path-prefix=/server, sling.auth.requirements=-/server}] Ignoring unmatching
Servlet service
Warning: Nashorn engine is planned to be removed from a future JDK release
Warning: Nashorn engine is planned to be removed from a future JDK release
[DEBUG] [ServiceReference 355 from bundle 142 : org.apache.sling.engine:2.7.2 ref=[javax.servlet.Servlet]
properties={objectClass=[javax.servlet.Servlet], osgi.http.whiteboard.context.select=(osgi.http.whiteboard.context.name=org.apache.sling),
osgi.http.whiteboard.servlet.name=ApacheSling/2.7, osgi.http.whiteboard.servlet.pattern=/,
service.bundleid=142, service.description=Apache Sling Engine Main Servlet, service.id=355,
service.scope=singleton, service.vendor=The Apache Software Foundation}] Ignoring unmatching
Servlet service
[DEBUG] [ServiceReference 149 from bundle 61 : org.apache.sling.launchpad.test-services:12.0.0.SNAPSHOT
ref=[javax.servlet.Servlet] properties={component.id=52, component.name=org.apache.sling.launchpad.testservices.servlets.R6WhiteboardServlet,
objectClass=[javax.servlet.Servlet], osgi.http.whiteboard.context.select=(osgi.http.whiteboard.context.name=org.apache.sling),
osgi.http.whiteboard.servlet.pattern=/whiteboard_r6, service.bundleid=61, service.id=149,
service.pid=org.apache.sling.launchpad.testservices.servlets.R6WhiteboardServlet, service.scope=bundle,
service.vendor=The Apache Software Foundation}] Ignoring unmatching Servlet service
[DEBUG] [ServiceReference 374 from bundle 142 : org.apache.sling.engine:2.7.2 ref=[javax.servlet.Filter]
properties={component.id=255, component.name=org.apache.sling.engine.parameters, file.max=-1,
file.threshold=256000, objectClass=[javax.servlet.Filter], osgi.http.whiteboard.context.select=(osgi.http.whiteboard.context.name=org.apache.sling),
osgi.http.whiteboard.filter.pattern=[/], request.max=-1, service.bundleid=142, service.description=Filter
for request parameter support, service.id=374, service.ranking=2147483647, service.scope=bundle,
service.vendor=The Apache Software Foundation, sling.default.max.parameters=10000, sling.default.parameter.checkForAdditionalContainerParameters=false,
sling.default.parameter.encoding=ISO-8859-1}] Ignoring unmatching Filter service
[DEBUG] [ServiceReference 590 from bundle 142 : org.apache.sling.engine:2.7.2 ref=[javax.servlet.Filter]
properties={component.id=254, component.name=org.apache.sling.engine.impl.log.RequestLoggerFilter,
objectClass=[javax.servlet.Filter], osgi.http.whiteboard.context.select=(osgi.http.whiteboard.context.name=org.apache.sling),
osgi.http.whiteboard.filter.pattern=[/], service.bundleid=142, service.description=Request
Logger Filter, service.id=590, service.ranking=32768, service.scope=bundle, service.vendor=The
Apache Software Foundation}] Ignoring unmatching Filter service
[INFO] Apachde Felix Http Whiteboard Service stopped
[DEBUG] [ServiceReference 1183 from bundle 41 : org.apache.felix.healthcheck.core:2.0.6 ref=[javax.servlet.Servlet]
properties={objectClass=[javax.servlet.Servlet], osgi.http.whiteboard.context.select=(osgi.http.whiteboard.context.name=internal.http.serviceunavailablefilter),
osgi.http.whiteboard.servlet.pattern=/, service.bundleid=41, service.id=1183, service.ranking=0,
service.scope=singleton}] Ignoring unmatching Servlet service
[INFO] Stopped Jetty.
23.05.2020 13:36:11.487 *INFO * [Sling Notifier] Apache Sling has been stopped
[INFO] 
[INFO] --- ianal-maven-plugin:1.0-alpha-1:verify-legal-files (default) @ org.apache.sling.launchpad.testing
---
WARNING: An illegal reflective access operation has occurred
WARNING: Illegal reflective access by org.codehaus.groovy.reflection.CachedConstructor (file:/home/jenkins/.m2/repository/org/codehaus/groovy/groovy-all-minimal/1.5.6/groovy-all-minimal-1.5.6.jar)
to constructor java.io.File(java.lang.String,java.io.File)
WARNING: Please consider reporting this to the maintainers of org.codehaus.groovy.reflection.CachedConstructor
WARNING: Use --illegal-access=warn to enable warnings of further illegal reflective access
operations
WARNING: All illegal access operations will be denied in a future release
[INFO] Checking legal files in: org.apache.sling.launchpad.testing-12-SNAPSHOT.jar
[INFO] Checking legal files in: org.apache.sling.launchpad.testing-12-SNAPSHOT-sources.jar
[INFO] 
[INFO] --- apache-rat-plugin:0.11:check (default) @ org.apache.sling.launchpad.testing ---
[INFO] 51 implicit excludes (use -debug for more details).
[INFO] Exclude: DEPENDENCIES
[INFO] Exclude: src/main/appended-resources/META-INF/*
[INFO] Exclude: velocity.log
[INFO] Exclude: target/*
[INFO] Exclude: README.md
[INFO] Exclude: maven-eclipse.xml
[INFO] Exclude: .*
[INFO] Exclude: .*/**
[INFO] Exclude: **/*.json
[INFO] Exclude: DEPENDENCIES
[INFO] Exclude: **/*.rej
[INFO] Exclude: hs_err_*.log
[INFO] Exclude: **/repository/index/*/index-details.txt
[INFO] Exclude: bnd.bnd
[INFO] 7 resources included (use -debug for more details)
[INFO] Rat check: Summary of files. Unapproved: 0 unknown: 0 generated: 0 approved: 6 licence.
[INFO] 
[INFO] --- maven-failsafe-plugin:2.21.0:verify (default) @ org.apache.sling.launchpad.testing
---
[INFO] ------------------------------------------------------------------------
[INFO] BUILD FAILURE
[INFO] ------------------------------------------------------------------------
[INFO] Total time:  03:55 min
[INFO] Finished at: 2020-05-23T13:36:13Z
[INFO] ------------------------------------------------------------------------
[INFO] [jenkins-event-spy] Generated /home/jenkins/jenkins-slave/workspace/e-sling-launchpad-testing_master@tmp/withMaven509b60b8/maven-spy-20200523-133217-37213515733383455919131.log
[ERROR] Failed to execute goal org.apache.maven.plugins:maven-failsafe-plugin:2.21.0:verify
(default) on project org.apache.sling.launchpad.testing: There are test failures.
[ERROR] 
[ERROR] Please refer to /home/jenkins/jenkins-slave/workspace/e-sling-launchpad-testing_master/target/failsafe-reports
for the individual test results.
[ERROR] Please refer to dump files (if any exist) [date]-jvmRun[N].dump, [date].dumpstream
and [date]-jvmRun[N].dumpstream.
[ERROR] -> [Help 1]
[ERROR] 
[ERROR] To see the full stack trace of the errors, re-run Maven with the -e switch.
[ERROR] Re-run Maven using the -X switch to enable full debug logging.
[ERROR] 
[ERROR] For more information about the errors and possible solutions, please read the following
articles:
[ERROR] [Help 1] http://cwiki.apache.org/confluence/display/MAVEN/MojoFailureException
[Pipeline] }
[withMaven] Publishers: Pipeline Graph Publisher: 26 ms, JGiven Publisher: 1 ms
[Pipeline] // withMaven
[Pipeline] }
[Pipeline] // stage
[Pipeline] }
[Pipeline] // timeout
[Pipeline] stage
[Pipeline] { (Notifications)
[Pipeline] echo
Status change is BROKEN, notifications will be sent.
[Pipeline] emailext
Mime
  • Unnamed multipart/mixed (inline, None, 0 bytes)
View raw message