sling-dev mailing list archives

Site index · List index
Message view « Date » · « Thread »
Top « Date » · « Thread »
From Apache Jenkins Server <jenk...@builds.apache.org>
Subject [Jenkins] Sling » sling-org-apache-sling-launchpad-testing » master #568 is BROKEN
Date Wed, 05 Feb 2020 13:37:11 GMT
Please see https://builds.apache.org/job/Sling/job/sling-org-apache-sling-launchpad-testing/job/master/568/
for details.

No further emails will be sent until the status of the build is changed.
Build log follows below:

[...truncated 2663 lines...]
[INFO] Tests run: 2, Failures: 0, Errors: 0, Skipped: 0, Time elapsed: 0.274 s - in org.apache.sling.launchpad.webapp.integrationtest.servlets.resolution.PathsServletTest
[INFO] Running org.apache.sling.launchpad.webapp.integrationtest.servlets.post.SlingPostProcessorTest
[INFO] Tests run: 1, Failures: 0, Errors: 0, Skipped: 0, Time elapsed: 0.029 s - in org.apache.sling.launchpad.webapp.integrationtest.servlets.post.SlingPostProcessorTest
[INFO] Running org.apache.sling.launchpad.webapp.integrationtest.servlets.post.PostServletCreateTest
[INFO] Tests run: 16, Failures: 0, Errors: 0, Skipped: 0, Time elapsed: 0.45 s - in org.apache.sling.launchpad.webapp.integrationtest.servlets.post.PostServletCreateTest
[INFO] Running org.apache.sling.launchpad.webapp.integrationtest.servlets.post.PostServletOrderTest
[INFO] Tests run: 9, Failures: 0, Errors: 0, Skipped: 0, Time elapsed: 0.6 s - in org.apache.sling.launchpad.webapp.integrationtest.servlets.post.PostServletOrderTest
[INFO] Running org.apache.sling.launchpad.webapp.integrationtest.servlets.post.SlingDateValuesTest
[INFO] Tests run: 2, Failures: 0, Errors: 0, Skipped: 0, Time elapsed: 2.061 s - in org.apache.sling.launchpad.webapp.integrationtest.servlets.post.SlingDateValuesTest
[INFO] Running org.apache.sling.launchpad.webapp.integrationtest.servlets.post.PostServletNopTest
[INFO] Tests run: 6, Failures: 0, Errors: 0, Skipped: 0, Time elapsed: 0.035 s - in org.apache.sling.launchpad.webapp.integrationtest.servlets.post.PostServletNopTest
[INFO] Running org.apache.sling.launchpad.webapp.integrationtest.servlets.post.PostServletVersionableTest
[INFO] Tests run: 26, Failures: 0, Errors: 0, Skipped: 0, Time elapsed: 2.568 s - in org.apache.sling.launchpad.webapp.integrationtest.servlets.post.PostServletVersionableTest
[INFO] Running org.apache.sling.launchpad.webapp.integrationtest.servlets.post.SlingSessionInfoTest
[INFO] Tests run: 2, Failures: 0, Errors: 0, Skipped: 0, Time elapsed: 0.009 s - in org.apache.sling.launchpad.webapp.integrationtest.servlets.post.SlingSessionInfoTest
[INFO] Running org.apache.sling.launchpad.webapp.integrationtest.servlets.post.PostServletCopyTest
[INFO] Tests run: 16, Failures: 0, Errors: 0, Skipped: 0, Time elapsed: 1.478 s - in org.apache.sling.launchpad.webapp.integrationtest.servlets.post.PostServletCopyTest
[INFO] Running org.apache.sling.launchpad.webapp.integrationtest.servlets.post.ReferenceTypeHintTest
[INFO] Tests run: 2, Failures: 0, Errors: 0, Skipped: 0, Time elapsed: 0.467 s - in org.apache.sling.launchpad.webapp.integrationtest.servlets.post.ReferenceTypeHintTest
[INFO] Running org.apache.sling.launchpad.webapp.integrationtest.servlets.post.PostServletDeleteTest
[INFO] Tests run: 5, Failures: 0, Errors: 0, Skipped: 0, Time elapsed: 0.812 s - in org.apache.sling.launchpad.webapp.integrationtest.servlets.post.PostServletDeleteTest
[INFO] Running org.apache.sling.launchpad.webapp.integrationtest.servlets.post.PostServletUpdateTest
[INFO] Tests run: 7, Failures: 0, Errors: 0, Skipped: 0, Time elapsed: 0.292 s - in org.apache.sling.launchpad.webapp.integrationtest.servlets.post.PostServletUpdateTest
[INFO] Running org.apache.sling.launchpad.webapp.integrationtest.servlets.post.PostResponseCreatorTest
[INFO] Tests run: 1, Failures: 0, Errors: 0, Skipped: 0, Time elapsed: 0.007 s - in org.apache.sling.launchpad.webapp.integrationtest.servlets.post.PostResponseCreatorTest
[INFO] Running org.apache.sling.launchpad.webapp.integrationtest.servlets.post.PostServletPrivilegesUpdateTest
[WARNING] Tests run: 1, Failures: 0, Errors: 0, Skipped: 1, Time elapsed: 0.001 s - in org.apache.sling.launchpad.webapp.integrationtest.servlets.post.PostServletPrivilegesUpdateTest
[INFO] Running org.apache.sling.launchpad.webapp.integrationtest.servlets.post.SlingAutoPropertiesTest
[INFO] Tests run: 3, Failures: 0, Errors: 0, Skipped: 0, Time elapsed: 1.143 s - in org.apache.sling.launchpad.webapp.integrationtest.servlets.post.SlingAutoPropertiesTest
[INFO] Running org.apache.sling.launchpad.webapp.integrationtest.servlets.post.PostServletDeleteParentTest
[INFO] Tests run: 6, Failures: 0, Errors: 0, Skipped: 0, Time elapsed: 0.31 s - in org.apache.sling.launchpad.webapp.integrationtest.servlets.post.PostServletDeleteParentTest
[INFO] Running org.apache.sling.launchpad.webapp.integrationtest.servlets.post.PostServletAtMoveTest
[INFO] Tests run: 9, Failures: 0, Errors: 0, Skipped: 0, Time elapsed: 0.472 s - in org.apache.sling.launchpad.webapp.integrationtest.servlets.post.PostServletAtMoveTest
[INFO] Running org.apache.sling.launchpad.webapp.integrationtest.servlets.post.PostServletMoveTest
[INFO] Tests run: 15, Failures: 0, Errors: 0, Skipped: 0, Time elapsed: 1.897 s - in org.apache.sling.launchpad.webapp.integrationtest.servlets.post.PostServletMoveTest
[INFO] Running org.apache.sling.launchpad.webapp.integrationtest.servlets.post.PostServletImportTest
[INFO] Tests run: 19, Failures: 0, Errors: 0, Skipped: 0, Time elapsed: 1.633 s - in org.apache.sling.launchpad.webapp.integrationtest.servlets.post.PostServletImportTest
[INFO] Running org.apache.sling.launchpad.webapp.integrationtest.servlets.post.PostServletAtDeleteTest
[INFO] Tests run: 2, Failures: 0, Errors: 0, Skipped: 0, Time elapsed: 0.14 s - in org.apache.sling.launchpad.webapp.integrationtest.servlets.post.PostServletAtDeleteTest
[INFO] Running org.apache.sling.launchpad.webapp.integrationtest.servlets.post.PostServletAtCopyTest
[INFO] Tests run: 10, Failures: 0, Errors: 0, Skipped: 0, Time elapsed: 0.481 s - in org.apache.sling.launchpad.webapp.integrationtest.servlets.post.PostServletAtCopyTest
[INFO] Running org.apache.sling.launchpad.webapp.integrationtest.servlets.post.PostStatusTest
[INFO] Tests run: 4, Failures: 0, Errors: 0, Skipped: 0, Time elapsed: 0.033 s - in org.apache.sling.launchpad.webapp.integrationtest.servlets.post.PostStatusTest
[INFO] Running org.apache.sling.launchpad.webapp.integrationtest.servlets.post.PostServletOutputContentTypeTest
[INFO] Tests run: 6, Failures: 0, Errors: 0, Skipped: 0, Time elapsed: 0.082 s - in org.apache.sling.launchpad.webapp.integrationtest.servlets.post.PostServletOutputContentTypeTest
[INFO] Running org.apache.sling.launchpad.webapp.integrationtest.servlets.post.PostToRootTest
[INFO] Tests run: 1, Failures: 0, Errors: 0, Skipped: 0, Time elapsed: 0.01 s - in org.apache.sling.launchpad.webapp.integrationtest.servlets.post.PostToRootTest
[INFO] Running org.apache.sling.launchpad.webapp.integrationtest.servlets.post.CustomPostOperationTest
[INFO] Tests run: 2, Failures: 0, Errors: 0, Skipped: 0, Time elapsed: 0.143 s - in org.apache.sling.launchpad.webapp.integrationtest.servlets.post.CustomPostOperationTest
[INFO] Running org.apache.sling.launchpad.webapp.integrationtest.servlets.post.PostServletPatchTest
[INFO] Tests run: 4, Failures: 0, Errors: 0, Skipped: 0, Time elapsed: 0.132 s - in org.apache.sling.launchpad.webapp.integrationtest.servlets.post.PostServletPatchTest
[INFO] Running org.apache.sling.launchpad.webapp.integrationtest.servlets.post.SlingDefaultValuesTest
[INFO] Tests run: 5, Failures: 0, Errors: 0, Skipped: 0, Time elapsed: 0.26 s - in org.apache.sling.launchpad.webapp.integrationtest.servlets.post.SlingDefaultValuesTest
[INFO] Running org.apache.sling.launchpad.webapp.integrationtest.servlets.HeadServletTest
[INFO] Tests run: 6, Failures: 0, Errors: 0, Skipped: 0, Time elapsed: 0.046 s - in org.apache.sling.launchpad.webapp.integrationtest.servlets.HeadServletTest
[INFO] Running org.apache.sling.launchpad.webapp.integrationtest.servlets.resolver.errorhandler.ErrorHandlingTest
[INFO] Tests run: 10, Failures: 0, Errors: 0, Skipped: 0, Time elapsed: 4.353 s - in org.apache.sling.launchpad.webapp.integrationtest.servlets.resolver.errorhandler.ErrorHandlingTest
[INFO] Running org.apache.sling.launchpad.webapp.integrationtest.JavascriptWrappersTest
[INFO] Tests run: 1, Failures: 0, Errors: 0, Skipped: 0, Time elapsed: 0.192 s - in org.apache.sling.launchpad.webapp.integrationtest.JavascriptWrappersTest
[INFO] Running org.apache.sling.launchpad.webapp.integrationtest.installer.InstallManyBundlesTest
[INFO] Tests run: 2, Failures: 0, Errors: 0, Skipped: 0, Time elapsed: 13.324 s - in org.apache.sling.launchpad.webapp.integrationtest.installer.InstallManyBundlesTest
[INFO] Running org.apache.sling.launchpad.webapp.integrationtest.installer.ServerSideInstallerTest
[INFO] Tests run: 3, Failures: 0, Errors: 0, Skipped: 0, Time elapsed: 0.6 s - in org.apache.sling.launchpad.webapp.integrationtest.installer.ServerSideInstallerTest
[INFO] Running org.apache.sling.launchpad.webapp.integrationtest.resourceresolver.ResourceResolverGeneralTest
[INFO] Tests run: 62, Failures: 0, Errors: 0, Skipped: 0, Time elapsed: 41.428 s - in org.apache.sling.launchpad.webapp.integrationtest.resourceresolver.ResourceResolverGeneralTest
[INFO] Running org.apache.sling.launchpad.webapp.integrationtest.resourceresolver.ResourceResolverApiTest
[INFO] Tests run: 8, Failures: 0, Errors: 0, Skipped: 0, Time elapsed: 1.287 s - in org.apache.sling.launchpad.webapp.integrationtest.resourceresolver.ResourceResolverApiTest
[INFO] Running org.apache.sling.launchpad.webapp.integrationtest.DavExIntegrationTest
[INFO] Tests run: 2, Failures: 0, Errors: 0, Skipped: 0, Time elapsed: 0.267 s - in org.apache.sling.launchpad.webapp.integrationtest.DavExIntegrationTest
[INFO] Running org.apache.sling.launchpad.webapp.integrationtest.BundleContentTest
[INFO] Tests run: 4, Failures: 0, Errors: 0, Skipped: 0, Time elapsed: 0.036 s - in org.apache.sling.launchpad.webapp.integrationtest.BundleContentTest
[INFO] Running org.apache.sling.launchpad.webapp.integrationtest.GetWithSuffixTest
[INFO] Tests run: 4, Failures: 0, Errors: 0, Skipped: 0, Time elapsed: 0.417 s - in org.apache.sling.launchpad.webapp.integrationtest.GetWithSuffixTest
[INFO] Running org.apache.sling.launchpad.webapp.integrationtest.EspLoadTest
[INFO] Tests run: 2, Failures: 0, Errors: 0, Skipped: 0, Time elapsed: 0.375 s - in org.apache.sling.launchpad.webapp.integrationtest.EspLoadTest
[INFO] Running org.apache.sling.launchpad.webapp.integrationtest.teleporter.EmbeddedDependenciesTeleporterTest
[INFO] Tests run: 2, Failures: 0, Errors: 0, Skipped: 0, Time elapsed: 0.355 s - in org.apache.sling.launchpad.webapp.integrationtest.teleporter.EmbeddedDependenciesTeleporterTest
[INFO] Running org.apache.sling.launchpad.webapp.integrationtest.teleporter.LdapFilterTeleporterTest
[INFO] Tests run: 2, Failures: 0, Errors: 0, Skipped: 0, Time elapsed: 0.299 s - in org.apache.sling.launchpad.webapp.integrationtest.teleporter.LdapFilterTeleporterTest
[INFO] Running org.apache.sling.launchpad.webapp.integrationtest.teleporter.BasicTeleporterTest
[INFO] Tests run: 2, Failures: 0, Errors: 0, Skipped: 0, Time elapsed: 0.263 s - in org.apache.sling.launchpad.webapp.integrationtest.teleporter.BasicTeleporterTest
[INFO] Running org.apache.sling.launchpad.webapp.integrationtest.teleporter.LocalServiceTeleporterTest
[INFO] Tests run: 1, Failures: 0, Errors: 0, Skipped: 0, Time elapsed: 0.168 s - in org.apache.sling.launchpad.webapp.integrationtest.teleporter.LocalServiceTeleporterTest
[INFO] Running org.apache.sling.launchpad.webapp.integrationtest.teleporter.TeleportedResourcesSingleTest
[INFO] Tests run: 3, Failures: 0, Errors: 0, Skipped: 0, Time elapsed: 0.309 s - in org.apache.sling.launchpad.webapp.integrationtest.teleporter.TeleportedResourcesSingleTest
[INFO] Running org.apache.sling.launchpad.webapp.integrationtest.teleporter.MultipleRulesTeleporterTest
[INFO] Tests run: 2, Failures: 0, Errors: 0, Skipped: 0, Time elapsed: 0.259 s - in org.apache.sling.launchpad.webapp.integrationtest.teleporter.MultipleRulesTeleporterTest
[INFO] Running org.apache.sling.launchpad.webapp.integrationtest.teleporter.TeleporterOptionsTest
[INFO] Tests run: 1, Failures: 0, Errors: 0, Skipped: 0, Time elapsed: 0.001 s - in org.apache.sling.launchpad.webapp.integrationtest.teleporter.TeleporterOptionsTest
[INFO] Running org.apache.sling.launchpad.webapp.integrationtest.teleporter.TeleportedResourcesFolderTest
[INFO] Tests run: 3, Failures: 0, Errors: 0, Skipped: 0, Time elapsed: 0.393 s - in org.apache.sling.launchpad.webapp.integrationtest.teleporter.TeleportedResourcesFolderTest
[INFO] Running org.apache.sling.launchpad.webapp.integrationtest.teleporter.ServicesPresentTest
[INFO] Tests run: 1, Failures: 0, Errors: 0, Skipped: 0, Time elapsed: 0.149 s - in org.apache.sling.launchpad.webapp.integrationtest.teleporter.ServicesPresentTest
[INFO] Running org.apache.sling.launchpad.webapp.integrationtest.WriteableResourcesProxyTest
[INFO] Tests run: 1, Failures: 0, Errors: 0, Skipped: 0, Time elapsed: 0.007 s - in org.apache.sling.launchpad.webapp.integrationtest.WriteableResourcesProxyTest
[INFO] Running org.apache.sling.launchpad.webapp.integrationtest.ServerSideScriptsTest
[INFO] Tests run: 1, Failures: 0, Errors: 0, Skipped: 0, Time elapsed: 2.374 s - in org.apache.sling.launchpad.webapp.integrationtest.ServerSideScriptsTest
[INFO] Running org.apache.sling.launchpad.webapp.integrationtest.repository.RepositoryNameTest
[INFO] Tests run: 1, Failures: 0, Errors: 0, Skipped: 0, Time elapsed: 0.039 s - in org.apache.sling.launchpad.webapp.integrationtest.repository.RepositoryNameTest
[INFO] Running org.apache.sling.launchpad.webapp.integrationtest.repository.RepoinitPathTest
[INFO] Tests run: 1, Failures: 0, Errors: 0, Skipped: 0, Time elapsed: 0.142 s - in org.apache.sling.launchpad.webapp.integrationtest.repository.RepoinitPathTest
[INFO] Running org.apache.sling.launchpad.webapp.integrationtest.repository.SystemUsersTest
05.02.2020 13:36:40.648 *ERROR* [FelixDispatchQueue] ERROR: Bundle '170' EventDispatcher:
Error during dispatch. (java.lang.IllegalStateException: The bundle is uninstalled.)
java.lang.IllegalStateException: The bundle is uninstalled.
	at org.apache.felix.framework.Felix.findBundleEntries(Felix.java:1966)
	at org.apache.felix.framework.BundleImpl.findEntries(BundleImpl.java:333)
	at org.apache.sling.scripting.jsp.SlingTldLocationsCache.addBundle(SlingTldLocationsCache.java:128)
	at org.apache.sling.scripting.jsp.SlingTldLocationsCache.bundleChanged(SlingTldLocationsCache.java:87)
	at org.apache.felix.framework.EventDispatcher.invokeBundleListenerCallback(EventDispatcher.java:915)
	at org.apache.felix.framework.EventDispatcher.fireEventImmediately(EventDispatcher.java:834)
	at org.apache.felix.framework.EventDispatcher.run(EventDispatcher.java:1147)
	at org.apache.felix.framework.EventDispatcher.access$000(EventDispatcher.java:54)
	at org.apache.felix.framework.EventDispatcher$1.run(EventDispatcher.java:102)
	at java.base/java.lang.Thread.run(Thread.java:830)
05.02.2020 13:36:40.653 *ERROR* [FelixDispatchQueue] ERROR: Bundle '40' EventDispatcher: Error
during dispatch. (java.lang.IllegalStateException: The bundle is uninstalled.)
java.lang.IllegalStateException: The bundle is uninstalled.
	at org.apache.felix.framework.Felix.getBundleEntry(Felix.java:1905)
	at org.apache.felix.framework.BundleImpl.getEntry(BundleImpl.java:291)
	at org.apache.felix.hc.generalchecks.util.ScriptEnginesTracker.bundleChanged(ScriptEnginesTracker.java:86)
	at org.apache.felix.framework.EventDispatcher.invokeBundleListenerCallback(EventDispatcher.java:915)
	at org.apache.felix.framework.EventDispatcher.fireEventImmediately(EventDispatcher.java:834)
	at org.apache.felix.framework.EventDispatcher.run(EventDispatcher.java:1147)
	at org.apache.felix.framework.EventDispatcher.access$000(EventDispatcher.java:54)
	at org.apache.felix.framework.EventDispatcher$1.run(EventDispatcher.java:102)
	at java.base/java.lang.Thread.run(Thread.java:830)
05.02.2020 13:36:40.653 *ERROR* [FelixDispatchQueue] ERROR: Bundle '167' EventDispatcher:
Error during dispatch. (java.lang.IllegalStateException: The bundle is uninstalled.)
java.lang.IllegalStateException: The bundle is uninstalled.
	at org.apache.felix.framework.Felix.getBundleEntry(Felix.java:1905)
	at org.apache.felix.framework.BundleImpl.getEntry(BundleImpl.java:291)
	at org.apache.sling.scripting.core.impl.jsr223.SlingScriptEngineManager.bundleChanged(SlingScriptEngineManager.java:213)
	at org.apache.felix.framework.EventDispatcher.invokeBundleListenerCallback(EventDispatcher.java:915)
	at org.apache.felix.framework.EventDispatcher.fireEventImmediately(EventDispatcher.java:834)
	at org.apache.felix.framework.EventDispatcher.run(EventDispatcher.java:1147)
	at org.apache.felix.framework.EventDispatcher.access$000(EventDispatcher.java:54)
	at org.apache.felix.framework.EventDispatcher$1.run(EventDispatcher.java:102)
	at java.base/java.lang.Thread.run(Thread.java:830)
[INFO] Tests run: 2, Failures: 0, Errors: 0, Skipped: 0, Time elapsed: 0.597 s - in org.apache.sling.launchpad.webapp.integrationtest.repository.SystemUsersTest
[INFO] Running org.apache.sling.launchpad.webapp.integrationtest.repository.RepositoryInitializersTest
[INFO] Tests run: 1, Failures: 0, Errors: 0, Skipped: 0, Time elapsed: 0.014 s - in org.apache.sling.launchpad.webapp.integrationtest.repository.RepositoryInitializersTest
[INFO] Running org.apache.sling.launchpad.webapp.integrationtest.StreamServletTest
[INFO] Tests run: 4, Failures: 0, Errors: 0, Skipped: 0, Time elapsed: 0.363 s - in org.apache.sling.launchpad.webapp.integrationtest.StreamServletTest
[INFO] Running org.apache.sling.launchpad.webapp.integrationtest.StaticContentTest
[INFO] Tests run: 2, Failures: 0, Errors: 0, Skipped: 0, Time elapsed: 0.009 s - in org.apache.sling.launchpad.webapp.integrationtest.StaticContentTest
[INFO] Running org.apache.sling.launchpad.webapp.integrationtest.crud.CrudTest
[INFO] Tests run: 1, Failures: 0, Errors: 0, Skipped: 0, Time elapsed: 0.23 s - in org.apache.sling.launchpad.webapp.integrationtest.crud.CrudTest
[INFO] Running org.apache.sling.launchpad.webapp.integrationtest.PostRedirectTest
[INFO] Tests run: 7, Failures: 0, Errors: 0, Skipped: 0, Time elapsed: 0.117 s - in org.apache.sling.launchpad.webapp.integrationtest.PostRedirectTest
[INFO] Running org.apache.sling.launchpad.webapp.integrationtest.WebDavDoubleSlashTest
[INFO] Tests run: 2, Failures: 0, Errors: 0, Skipped: 0, Time elapsed: 0.09 s - in org.apache.sling.launchpad.webapp.integrationtest.WebDavDoubleSlashTest
[INFO] Running org.apache.sling.launchpad.webapp.integrationtest.indexing.FullTextIndexingTest
[INFO] Tests run: 3, Failures: 0, Errors: 0, Skipped: 0, Time elapsed: 12.346 s - in org.apache.sling.launchpad.webapp.integrationtest.indexing.FullTextIndexingTest
[INFO] Running org.apache.sling.launchpad.webapp.integrationtest.EventsCounterTest
[INFO] %configMgr.pluginTitle: applyConfiguration: Deleting configuration org.apache.sling.servlets.get.impl.version.VersionInfoServlet
[INFO] Tests run: 1, Failures: 0, Errors: 0, Skipped: 0, Time elapsed: 0.02 s - in org.apache.sling.launchpad.webapp.integrationtest.EventsCounterTest
[INFO] Running org.apache.sling.launchpad.webapp.integrationtest.VersionInfoServletTest
05.02.2020 13:36:55 *ERROR* fromDocuments: Error accessing document bundle://c6108d8a-8368-4557-8cfb-7e0538eb22c8_104.0:0/OSGI-INF/metatype/com.composum.sling.clientlibs.service.ClientlibConfigurationService.properties
: XML parsing exception while reading metadata: name expected (position:START_TAG <null>@7:218
in bundle://c6108d8a-8368-4557-8cfb-7e0538eb22c8_104.0:0/OSGI-INF/metatype/com.composum.sling.clientlibs.service.ClientlibConfigurationService.properties)

[INFO] Tests run: 3, Failures: 0, Errors: 0, Skipped: 0, Time elapsed: 3.299 s - in org.apache.sling.launchpad.webapp.integrationtest.VersionInfoServletTest
[INFO] Running org.apache.sling.launchpad.webapp.integrationtest.WebdavUploadTest
[INFO] Tests run: 4, Failures: 0, Errors: 0, Skipped: 0, Time elapsed: 0.355 s - in org.apache.sling.launchpad.webapp.integrationtest.WebdavUploadTest
[INFO] Running org.apache.sling.launchpad.webapp.integrationtest.SlingWebDavServletTest
[INFO] Tests run: 2, Failures: 0, Errors: 0, Skipped: 0, Time elapsed: 0.191 s - in org.apache.sling.launchpad.webapp.integrationtest.SlingWebDavServletTest
[INFO] Running org.apache.sling.launchpad.webapp.integrationtest.login.AnonymousAccessTest
[INFO] Tests run: 4, Failures: 0, Errors: 0, Skipped: 0, Time elapsed: 0.167 s - in org.apache.sling.launchpad.webapp.integrationtest.login.AnonymousAccessTest
[INFO] Running org.apache.sling.launchpad.webapp.integrationtest.login.AuthRequestLoginTest
[INFO] Tests run: 1, Failures: 0, Errors: 0, Skipped: 0, Time elapsed: 0.033 s - in org.apache.sling.launchpad.webapp.integrationtest.login.AuthRequestLoginTest
[INFO] Running org.apache.sling.launchpad.webapp.integrationtest.login.RedirectOnLoginErrorTest
[INFO] Tests run: 2, Failures: 0, Errors: 0, Skipped: 0, Time elapsed: 0.004 s - in org.apache.sling.launchpad.webapp.integrationtest.login.RedirectOnLoginErrorTest
[INFO] Running org.apache.sling.launchpad.webapp.integrationtest.login.RedirectOnLogoutTest
[INFO] Tests run: 1, Failures: 0, Errors: 0, Skipped: 0, Time elapsed: 0.012 s - in org.apache.sling.launchpad.webapp.integrationtest.login.RedirectOnLogoutTest
[INFO] Running org.apache.sling.launchpad.webapp.integrationtest.NodetypeRenderingTest
[INFO] Tests run: 7, Failures: 0, Errors: 0, Skipped: 0, Time elapsed: 0.752 s - in org.apache.sling.launchpad.webapp.integrationtest.NodetypeRenderingTest
[INFO] Running org.apache.sling.launchpad.webapp.integrationtest.xml.SaxTest
[INFO] Tests run: 1, Failures: 0, Errors: 0, Skipped: 0, Time elapsed: 0 s - in org.apache.sling.launchpad.webapp.integrationtest.xml.SaxTest
[INFO] Running org.apache.sling.launchpad.webapp.integrationtest.xml.XPathTest
[INFO] Tests run: 1, Failures: 0, Errors: 0, Skipped: 0, Time elapsed: 0.105 s - in org.apache.sling.launchpad.webapp.integrationtest.xml.XPathTest
[INFO] Running org.apache.sling.launchpad.webapp.integrationtest.xml.DomTest
[INFO] Tests run: 1, Failures: 0, Errors: 0, Skipped: 0, Time elapsed: 0.001 s - in org.apache.sling.launchpad.webapp.integrationtest.xml.DomTest
[INFO] Running org.apache.sling.launchpad.webapp.integrationtest.auth.AuthenticationResponseCodeTest
[INFO] Tests run: 10, Failures: 0, Errors: 0, Skipped: 0, Time elapsed: 0.062 s - in org.apache.sling.launchpad.webapp.integrationtest.auth.AuthenticationResponseCodeTest
[INFO] Running org.apache.sling.launchpad.webapp.integrationtest.ResourceDecoratorTest
[INFO] Tests run: 1, Failures: 0, Errors: 0, Skipped: 0, Time elapsed: 0.052 s - in org.apache.sling.launchpad.webapp.integrationtest.ResourceDecoratorTest
[INFO] Running org.apache.sling.launchpad.webapp.integrationtest.NodeTypeBasedRenderingTest
[INFO] Tests run: 7, Failures: 0, Errors: 0, Skipped: 0, Time elapsed: 1.527 s - in org.apache.sling.launchpad.webapp.integrationtest.NodeTypeBasedRenderingTest
[INFO] Running org.apache.sling.launchpad.webapp.jsp.TagFileTest
[INFO] Tests run: 1, Failures: 0, Errors: 0, Skipped: 0, Time elapsed: 0.319 s - in org.apache.sling.launchpad.webapp.jsp.TagFileTest
[INFO] 
[INFO] Results:
[INFO] 
[WARNING] Tests run: 660, Failures: 0, Errors: 0, Skipped: 1
[INFO] 
[INFO] 
[INFO] --- slingstart-maven-plugin:1.7.16:stop (stop-container) @ org.apache.sling.launchpad.testing
---
[INFO] Stopping 1 Launchpad instances
[INFO] Stopping Launchpad '_-41000'
05.02.2020 13:37:01.561 *INFO * [Apache Sling Terminator] Java VM is shutting down
05.02.2020 13:37:01.562 *INFO * [Apache Sling Terminator] Stopping Apache Sling
Warning: Nashorn engine is planned to be removed from a future JDK release
Warning: Nashorn engine is planned to be removed from a future JDK release
[DEBUG] [ServiceReference 676 from bundle 95 : org.apache.sling.jcr.davex:1.3.10 ref=[javax.servlet.Servlet]
properties={objectClass=[javax.servlet.Servlet], osgi.http.whiteboard.context.select=(osgi.http.whiteboard.context.name=DavExAuthHttpContext),
osgi.http.whiteboard.servlet.pattern=/server/*, service.bundleid=95, service.description=Sling
JcrRemoting Servlet, service.id=676, service.scope=singleton, service.vendor=The Apache Software
Foundation, servlet.init.createAbsoluteURI=true, servlet.init.csrf-protection=disabled, servlet.init.protectedhandlers-config=org.apache.jackrabbit.server.remoting.davex.AclRemoveHandler,
servlet.init.resource-path-prefix=/server, sling.auth.requirements=-/server}] Ignoring unmatching
Servlet service
[DEBUG] [ServiceReference 149 from bundle 60 : org.apache.sling.launchpad.test-services:12.0.0.SNAPSHOT
ref=[javax.servlet.Servlet] properties={component.id=52, component.name=org.apache.sling.launchpad.testservices.servlets.R6WhiteboardServlet,
objectClass=[javax.servlet.Servlet], osgi.http.whiteboard.context.select=(osgi.http.whiteboard.context.name=org.apache.sling),
osgi.http.whiteboard.servlet.pattern=/whiteboard_r6, service.bundleid=60, service.id=149,
service.pid=org.apache.sling.launchpad.testservices.servlets.R6WhiteboardServlet, service.scope=bundle,
service.vendor=The Apache Software Foundation}] Ignoring unmatching Servlet service
[DEBUG] [ServiceReference 357 from bundle 144 : org.apache.sling.engine:2.6.22 ref=[javax.servlet.Servlet]
properties={component.id=250, component.name=org.apache.sling.engine.impl.SlingMainServlet,
objectClass=[javax.servlet.Servlet], osgi.http.whiteboard.context.select=(osgi.http.whiteboard.context.name=org.apache.sling),
osgi.http.whiteboard.servlet.pattern=/, service.bundleid=144, service.description=Apache Sling
Engine Main Servlet, service.id=357, service.scope=singleton, service.vendor=The Apache Software
Foundation, servlet-name=ApacheSling/2.6, sling.additional.response.headers=[Ljava.lang.String;@744669ad,
sling.max.calls=1000, sling.max.inclusions=50, sling.max.record.requests=20, sling.trace.allow=false}]
Ignoring unmatching Servlet service
[DEBUG] [ServiceReference 375 from bundle 144 : org.apache.sling.engine:2.6.22 ref=[javax.servlet.Filter]
properties={component.id=255, component.name=org.apache.sling.engine.parameters, file.max=-1,
file.threshold=256000, objectClass=[javax.servlet.Filter], osgi.http.whiteboard.context.select=(osgi.http.whiteboard.context.name=org.apache.sling),
osgi.http.whiteboard.filter.pattern=/, request.max=-1, service.bundleid=144, service.id=375,
service.ranking=2147483647, service.scope=bundle, sling.default.max.parameters=10000, sling.default.parameter.checkForAdditionalContainerParameters=false,
sling.default.parameter.encoding=ISO-8859-1}] Ignoring unmatching Filter service
[DEBUG] [ServiceReference 590 from bundle 144 : org.apache.sling.engine:2.6.22 ref=[javax.servlet.Filter]
properties={component.id=254, component.name=org.apache.sling.engine.impl.log.RequestLoggerFilter,
objectClass=[javax.servlet.Filter], osgi.http.whiteboard.context.select=(osgi.http.whiteboard.context.name=org.apache.sling),
osgi.http.whiteboard.filter.pattern=/, service.bundleid=144, service.description=Request Logger
Filter, service.id=590, service.ranking=32768, service.scope=bundle, service.vendor=The Apache
Software Foundation}] Ignoring unmatching Filter service
[INFO] Apachde Felix Http Whiteboard Service stopped
[DEBUG] [ServiceReference 1178 from bundle 39 : org.apache.felix.healthcheck.core:2.0.6 ref=[javax.servlet.Servlet]
properties={objectClass=[javax.servlet.Servlet], osgi.http.whiteboard.context.select=(osgi.http.whiteboard.context.name=internal.http.serviceunavailablefilter),
osgi.http.whiteboard.servlet.pattern=/, service.bundleid=39, service.id=1178, service.ranking=0,
service.scope=singleton}] Ignoring unmatching Servlet service
[INFO] Stopped Jetty.
05.02.2020 13:37:08.877 *INFO * [Sling Notifier] Apache Sling has been stopped
[INFO] 
[INFO] --- ianal-maven-plugin:1.0-alpha-1:verify-legal-files (default) @ org.apache.sling.launchpad.testing
---
WARNING: An illegal reflective access operation has occurred
WARNING: Illegal reflective access by org.codehaus.groovy.reflection.CachedConstructor (file:/home/jenkins/.m2/repository/org/codehaus/groovy/groovy-all-minimal/1.5.6/groovy-all-minimal-1.5.6.jar)
to constructor java.io.File(java.lang.String,java.io.File)
WARNING: Please consider reporting this to the maintainers of org.codehaus.groovy.reflection.CachedConstructor
WARNING: Use --illegal-access=warn to enable warnings of further illegal reflective access
operations
WARNING: All illegal access operations will be denied in a future release
[INFO] Checking legal files in: org.apache.sling.launchpad.testing-12-SNAPSHOT.jar
[INFO] Checking legal files in: org.apache.sling.launchpad.testing-12-SNAPSHOT-sources.jar
[INFO] 
[INFO] --- apache-rat-plugin:0.11:check (default) @ org.apache.sling.launchpad.testing ---
Cancelling nested steps due to timeout
Sending interrupt signal to process
[INFO] 51 implicit excludes (use -debug for more details).
[INFO] Exclude: DEPENDENCIES
[INFO] Exclude: src/main/appended-resources/META-INF/*
[INFO] Exclude: velocity.log
[INFO] Exclude: target/*
[INFO] Exclude: README.md
[INFO] Exclude: maven-eclipse.xml
[INFO] Exclude: .*
[INFO] Exclude: .*/**
[INFO] Exclude: **/*.json
[INFO] Exclude: DEPENDENCIES
[INFO] Exclude: **/*.rej
[INFO] Exclude: hs_err_*.log
[INFO] Exclude: **/repository/index/*/index-details.txt
[INFO] Exclude: bnd.bnd
[INFO] 7 resources included (use -debug for more details)
script returned exit code 143
[Pipeline] }
[withMaven] One or multiple Maven executions have been ignored by the Jenkins Pipeline Maven
Plugin because they have been interrupted before completion (1). See Pipeline Maven Plugin
FAQ for more details.
[Pipeline] // withMaven
[Pipeline] }
[Pipeline] // stage
[Pipeline] }
[Pipeline] // timeout
[Pipeline] stage
[Pipeline] { (Notifications)
[Pipeline] echo
Status change is BROKEN, notifications will be sent.
[Pipeline] emailext
Mime
  • Unnamed multipart/mixed (inline, None, 0 bytes)
View raw message