sling-dev mailing list archives

Site index · List index
Message view « Date » · « Thread »
Top « Date » · « Thread »
From Apache Jenkins Server <jenk...@builds.apache.org>
Subject [Jenkins] Sling » sling-org-apache-sling-launchpad-testing » master #437 is BROKEN
Date Sat, 07 Dec 2019 11:34:40 GMT
Please see https://builds.apache.org/job/Sling/job/sling-org-apache-sling-launchpad-testing/job/master/437/
for details.

No further emails will be sent until the status of the build is changed.
Build log follows below:

[...truncated 1315 lines...]
[WARNING] Tests run: 1, Failures: 0, Errors: 0, Skipped: 1, Time elapsed: 0.001 s - in org.apache.sling.launchpad.webapp.integrationtest.servlets.post.PostServletPrivilegesUpdateTest
[INFO] Running org.apache.sling.launchpad.webapp.integrationtest.servlets.post.PostStatusTest
[INFO] Tests run: 4, Failures: 0, Errors: 0, Skipped: 0, Time elapsed: 0.02 s - in org.apache.sling.launchpad.webapp.integrationtest.servlets.post.PostStatusTest
[INFO] Running org.apache.sling.launchpad.webapp.integrationtest.servlets.post.PostResponseCreatorTest
[INFO] Tests run: 1, Failures: 0, Errors: 0, Skipped: 0, Time elapsed: 0.006 s - in org.apache.sling.launchpad.webapp.integrationtest.servlets.post.PostResponseCreatorTest
[INFO] Running org.apache.sling.launchpad.webapp.integrationtest.servlets.post.SlingSessionInfoTest
[INFO] Tests run: 2, Failures: 0, Errors: 0, Skipped: 0, Time elapsed: 0.007 s - in org.apache.sling.launchpad.webapp.integrationtest.servlets.post.SlingSessionInfoTest
[INFO] Running org.apache.sling.launchpad.webapp.integrationtest.servlets.post.PostServletCreateTest
[INFO] Tests run: 16, Failures: 0, Errors: 0, Skipped: 0, Time elapsed: 0.303 s - in org.apache.sling.launchpad.webapp.integrationtest.servlets.post.PostServletCreateTest
[INFO] Running org.apache.sling.launchpad.webapp.integrationtest.servlets.post.PostServletNopTest
[INFO] Tests run: 6, Failures: 0, Errors: 0, Skipped: 0, Time elapsed: 0.027 s - in org.apache.sling.launchpad.webapp.integrationtest.servlets.post.PostServletNopTest
[INFO] Running org.apache.sling.launchpad.webapp.integrationtest.servlets.post.PostServletAtCopyTest
[INFO] Tests run: 10, Failures: 0, Errors: 0, Skipped: 0, Time elapsed: 0.352 s - in org.apache.sling.launchpad.webapp.integrationtest.servlets.post.PostServletAtCopyTest
[INFO] Running org.apache.sling.launchpad.webapp.integrationtest.servlets.post.SlingPostProcessorTest
[INFO] Tests run: 1, Failures: 0, Errors: 0, Skipped: 0, Time elapsed: 0.016 s - in org.apache.sling.launchpad.webapp.integrationtest.servlets.post.SlingPostProcessorTest
[INFO] Running org.apache.sling.launchpad.webapp.integrationtest.servlets.post.PostServletAtMoveTest
[INFO] Tests run: 9, Failures: 0, Errors: 0, Skipped: 0, Time elapsed: 0.33 s - in org.apache.sling.launchpad.webapp.integrationtest.servlets.post.PostServletAtMoveTest
[INFO] Running org.apache.sling.launchpad.webapp.integrationtest.servlets.post.CustomPostOperationTest
[INFO] Tests run: 2, Failures: 0, Errors: 0, Skipped: 0, Time elapsed: 0.109 s - in org.apache.sling.launchpad.webapp.integrationtest.servlets.post.CustomPostOperationTest
[INFO] Running org.apache.sling.launchpad.webapp.integrationtest.servlets.post.PostServletUpdateTest
[INFO] Tests run: 7, Failures: 0, Errors: 0, Skipped: 0, Time elapsed: 0.202 s - in org.apache.sling.launchpad.webapp.integrationtest.servlets.post.PostServletUpdateTest
[INFO] Running org.apache.sling.launchpad.webapp.integrationtest.servlets.post.SlingDefaultValuesTest
[INFO] Tests run: 5, Failures: 0, Errors: 0, Skipped: 0, Time elapsed: 0.188 s - in org.apache.sling.launchpad.webapp.integrationtest.servlets.post.SlingDefaultValuesTest
[INFO] Running org.apache.sling.launchpad.webapp.integrationtest.servlets.post.ReferenceTypeHintTest
[INFO] Tests run: 2, Failures: 0, Errors: 0, Skipped: 0, Time elapsed: 0.339 s - in org.apache.sling.launchpad.webapp.integrationtest.servlets.post.ReferenceTypeHintTest
[INFO] Running org.apache.sling.launchpad.webapp.integrationtest.servlets.post.PostServletVersionableTest
[INFO] Tests run: 26, Failures: 0, Errors: 0, Skipped: 0, Time elapsed: 1.797 s - in org.apache.sling.launchpad.webapp.integrationtest.servlets.post.PostServletVersionableTest
[INFO] Running org.apache.sling.launchpad.webapp.integrationtest.servlets.post.PostServletImportTest
[INFO] Tests run: 19, Failures: 0, Errors: 0, Skipped: 0, Time elapsed: 1.256 s - in org.apache.sling.launchpad.webapp.integrationtest.servlets.post.PostServletImportTest
[INFO] Running org.apache.sling.launchpad.webapp.integrationtest.servlets.post.PostServletAtDeleteTest
[INFO] Tests run: 2, Failures: 0, Errors: 0, Skipped: 0, Time elapsed: 0.106 s - in org.apache.sling.launchpad.webapp.integrationtest.servlets.post.PostServletAtDeleteTest
[INFO] Running org.apache.sling.launchpad.webapp.integrationtest.servlets.resolution.WarSelectorServletTest
[INFO] Tests run: 3, Failures: 0, Errors: 0, Skipped: 0, Time elapsed: 0.286 s - in org.apache.sling.launchpad.webapp.integrationtest.servlets.resolution.WarSelectorServletTest
[INFO] Running org.apache.sling.launchpad.webapp.integrationtest.servlets.resolution.PathsServletTest
Dec 07, 2019 11:34:01 AM org.apache.sling.launchpad.testservices.servlets.TestServlet doGet
SEVERE: test JUL message
Dec 07, 2019 11:34:01 AM org.apache.sling.launchpad.testservices.servlets.TestServlet doGet
SEVERE: test JUL message
[INFO] Tests run: 2, Failures: 0, Errors: 0, Skipped: 0, Time elapsed: 0.2 s - in org.apache.sling.launchpad.webapp.integrationtest.servlets.resolution.PathsServletTest
[INFO] Running org.apache.sling.launchpad.webapp.integrationtest.servlets.resolution.PrefixTest
Dec 07, 2019 11:34:01 AM org.apache.sling.launchpad.testservices.servlets.TestServlet doGet
SEVERE: test JUL message
Dec 07, 2019 11:34:01 AM org.apache.sling.launchpad.testservices.servlets.TestServlet doGet
SEVERE: test JUL message
Dec 07, 2019 11:34:01 AM org.apache.sling.launchpad.testservices.servlets.TestServlet doGet
SEVERE: test JUL message
[INFO] Tests run: 3, Failures: 0, Errors: 0, Skipped: 0, Time elapsed: 0.279 s - in org.apache.sling.launchpad.webapp.integrationtest.servlets.resolution.PrefixTest
[INFO] Running org.apache.sling.launchpad.webapp.integrationtest.servlets.resolution.ExtensionServletTest
Dec 07, 2019 11:34:01 AM org.apache.sling.launchpad.testservices.servlets.TestServlet doGet
SEVERE: test JUL message
Dec 07, 2019 11:34:01 AM org.apache.sling.launchpad.testservices.servlets.TestServlet doGet
SEVERE: test JUL message
[INFO] Tests run: 3, Failures: 0, Errors: 0, Skipped: 0, Time elapsed: 0.27 s - in org.apache.sling.launchpad.webapp.integrationtest.servlets.resolution.ExtensionServletTest
[INFO] Running org.apache.sling.launchpad.webapp.integrationtest.servlets.resolution.PutMethodServletTest
[INFO] Tests run: 2, Failures: 0, Errors: 0, Skipped: 0, Time elapsed: 0.17 s - in org.apache.sling.launchpad.webapp.integrationtest.servlets.resolution.PutMethodServletTest
[INFO] Running org.apache.sling.launchpad.webapp.integrationtest.servlets.resolution.SelectorServletTest
Dec 07, 2019 11:34:02 AM org.apache.sling.launchpad.testservices.servlets.TestServlet doGet
SEVERE: test JUL message
Dec 07, 2019 11:34:02 AM org.apache.sling.launchpad.testservices.servlets.TestServlet doGet
SEVERE: test JUL message
[INFO] Tests run: 4, Failures: 0, Errors: 0, Skipped: 0, Time elapsed: 0.357 s - in org.apache.sling.launchpad.webapp.integrationtest.servlets.resolution.SelectorServletTest
[INFO] Running org.apache.sling.launchpad.webapp.integrationtest.servlets.resolution.RequestUriOptingServletTest
Dec 07, 2019 11:34:02 AM org.apache.sling.launchpad.testservices.servlets.TestServlet doGet
SEVERE: test JUL message
Dec 07, 2019 11:34:02 AM org.apache.sling.launchpad.testservices.servlets.TestServlet doGet
SEVERE: test JUL message
[INFO] Tests run: 4, Failures: 0, Errors: 0, Skipped: 0, Time elapsed: 0.341 s - in org.apache.sling.launchpad.webapp.integrationtest.servlets.resolution.RequestUriOptingServletTest
[INFO] Running org.apache.sling.launchpad.webapp.integrationtest.servlets.resolution.HtmlDefaultServletTest
[INFO] %configMgr.pluginTitle: applyConfiguration: Deleting configuration org.apache.sling.launchpad.testservices.servlets.HtmlDefaultServlet
Dec 07, 2019 11:34:05 AM org.apache.sling.launchpad.testservices.servlets.TestServlet doGet
SEVERE: test JUL message
[INFO] %configMgr.pluginTitle: applyConfiguration: Deleting configuration org.apache.sling.launchpad.testservices.servlets.HtmlDefaultServlet
[INFO] Tests run: 2, Failures: 0, Errors: 0, Skipped: 0, Time elapsed: 6.264 s - in org.apache.sling.launchpad.webapp.integrationtest.servlets.resolution.HtmlDefaultServletTest
[INFO] Running org.apache.sling.launchpad.webapp.integrationtest.servlets.resolution.PathsServletWithNodeTest
Dec 07, 2019 11:34:09 AM org.apache.sling.launchpad.testservices.servlets.TestServlet doGet
SEVERE: test JUL message
[INFO] Tests run: 1, Failures: 0, Errors: 0, Skipped: 0, Time elapsed: 0.118 s - in org.apache.sling.launchpad.webapp.integrationtest.servlets.resolution.PathsServletWithNodeTest
[INFO] Running org.apache.sling.launchpad.webapp.integrationtest.servlets.resolution.RequestObjectTest
Dec 07, 2019 11:34:09 AM org.apache.sling.launchpad.testservices.servlets.TestServlet doGet
SEVERE: test JUL message
Dec 07, 2019 11:34:09 AM org.apache.sling.launchpad.testservices.servlets.TestServlet doGet
SEVERE: test JUL message
Dec 07, 2019 11:34:09 AM org.apache.sling.launchpad.testservices.servlets.TestServlet doGet
SEVERE: test JUL message
Dec 07, 2019 11:34:09 AM org.apache.sling.launchpad.testservices.servlets.TestServlet doGet
SEVERE: test JUL message
[INFO] Tests run: 1, Failures: 0, Errors: 0, Skipped: 0, Time elapsed: 0.105 s - in org.apache.sling.launchpad.webapp.integrationtest.servlets.resolution.RequestObjectTest
[INFO] Running org.apache.sling.launchpad.webapp.integrationtest.servlets.resolution.PrioritiesTest
Dec 07, 2019 11:34:09 AM org.apache.sling.launchpad.testservices.servlets.TestServlet doGet
SEVERE: test JUL message
[INFO] Tests run: 1, Failures: 0, Errors: 0, Skipped: 0, Time elapsed: 0.073 s - in org.apache.sling.launchpad.webapp.integrationtest.servlets.resolution.PrioritiesTest
[INFO] Running org.apache.sling.launchpad.webapp.integrationtest.servlets.resolver.errorhandler.ErrorHandlingTest
[INFO] Tests run: 10, Failures: 0, Errors: 0, Skipped: 0, Time elapsed: 7.635 s - in org.apache.sling.launchpad.webapp.integrationtest.servlets.resolver.errorhandler.ErrorHandlingTest
[INFO] Running org.apache.sling.launchpad.webapp.integrationtest.servlets.HeadServletTest
[INFO] Tests run: 6, Failures: 0, Errors: 0, Skipped: 0, Time elapsed: 0.035 s - in org.apache.sling.launchpad.webapp.integrationtest.servlets.HeadServletTest
[INFO] Running org.apache.sling.launchpad.webapp.integrationtest.servlets.R6WhiteboardServletTest
[INFO] Tests run: 1, Failures: 0, Errors: 0, Skipped: 0, Time elapsed: 0.001 s - in org.apache.sling.launchpad.webapp.integrationtest.servlets.R6WhiteboardServletTest
[INFO] Running org.apache.sling.launchpad.webapp.integrationtest.ScriptBuiltinObjectsTest
[INFO] Tests run: 1, Failures: 0, Errors: 0, Skipped: 0, Time elapsed: 0.086 s - in org.apache.sling.launchpad.webapp.integrationtest.ScriptBuiltinObjectsTest
[INFO] Running org.apache.sling.launchpad.webapp.integrationtest.WriteableResourcesProxyTest
[INFO] Tests run: 1, Failures: 0, Errors: 0, Skipped: 0, Time elapsed: 0.019 s - in org.apache.sling.launchpad.webapp.integrationtest.WriteableResourcesProxyTest
[INFO] Running org.apache.sling.launchpad.webapp.integrationtest.ValueFromTest
[INFO] Tests run: 3, Failures: 0, Errors: 0, Skipped: 0, Time elapsed: 0.05 s - in org.apache.sling.launchpad.webapp.integrationtest.ValueFromTest
[INFO] Running org.apache.sling.launchpad.webapp.integrationtest.LaunchpadConfigInstallerTest
[INFO] Tests run: 1, Failures: 0, Errors: 0, Skipped: 0, Time elapsed: 0 s - in org.apache.sling.launchpad.webapp.integrationtest.LaunchpadConfigInstallerTest
[INFO] Running org.apache.sling.launchpad.webapp.integrationtest.GetStarTest
[INFO] Tests run: 2, Failures: 0, Errors: 0, Skipped: 0, Time elapsed: 0.037 s - in org.apache.sling.launchpad.webapp.integrationtest.GetStarTest
[INFO] Running org.apache.sling.launchpad.webapp.integrationtest.jaxb.JaxbMarshallingTest
[INFO] Tests run: 1, Failures: 0, Errors: 0, Skipped: 0, Time elapsed: 0.168 s - in org.apache.sling.launchpad.webapp.integrationtest.jaxb.JaxbMarshallingTest
[INFO] Running org.apache.sling.launchpad.webapp.integrationtest.DavExDisabledAnonAccessTest
[INFO] Tests run: 2, Failures: 0, Errors: 0, Skipped: 0, Time elapsed: 0.642 s - in org.apache.sling.launchpad.webapp.integrationtest.DavExDisabledAnonAccessTest
[INFO] Running org.apache.sling.launchpad.webapp.integrationtest.CreateNodeTest
[INFO] Tests run: 6, Failures: 0, Errors: 0, Skipped: 0, Time elapsed: 0.181 s - in org.apache.sling.launchpad.webapp.integrationtest.CreateNodeTest
[INFO] Running org.apache.sling.launchpad.webapp.integrationtest.ImmediateScriptActivationTest
[INFO] Tests run: 2, Failures: 0, Errors: 0, Skipped: 0, Time elapsed: 2.77 s - in org.apache.sling.launchpad.webapp.integrationtest.ImmediateScriptActivationTest
[INFO] Running org.apache.sling.launchpad.webapp.integrationtest.RangeStreamingTest
[INFO] Tests run: 4, Failures: 0, Errors: 0, Skipped: 0, Time elapsed: 0.521 s - in org.apache.sling.launchpad.webapp.integrationtest.RangeStreamingTest
[INFO] Running org.apache.sling.launchpad.webapp.integrationtest.UploadFileTest
[INFO] Tests run: 4, Failures: 0, Errors: 0, Skipped: 0, Time elapsed: 0.178 s - in org.apache.sling.launchpad.webapp.integrationtest.UploadFileTest
[INFO] Running org.apache.sling.launchpad.webapp.integrationtest.userManager.UpdateUserTest
[INFO] Tests run: 12, Failures: 0, Errors: 0, Skipped: 0, Time elapsed: 0.776 s - in org.apache.sling.launchpad.webapp.integrationtest.userManager.UpdateUserTest
[INFO] Running org.apache.sling.launchpad.webapp.integrationtest.userManager.RemoveAuthorizablesTest
[INFO] Tests run: 11, Failures: 0, Errors: 0, Skipped: 0, Time elapsed: 0.684 s - in org.apache.sling.launchpad.webapp.integrationtest.userManager.RemoveAuthorizablesTest
[INFO] Running org.apache.sling.launchpad.webapp.integrationtest.userManager.UserPrivilegesInfoTest
[INFO] Tests run: 7, Failures: 0, Errors: 0, Skipped: 0, Time elapsed: 1.892 s - in org.apache.sling.launchpad.webapp.integrationtest.userManager.UserPrivilegesInfoTest
[INFO] Running org.apache.sling.launchpad.webapp.integrationtest.userManager.UpdateGroupTest
[INFO] Tests run: 8, Failures: 0, Errors: 0, Skipped: 0, Time elapsed: 1.043 s - in org.apache.sling.launchpad.webapp.integrationtest.userManager.UpdateGroupTest
[INFO] Running org.apache.sling.launchpad.webapp.integrationtest.userManager.CreateUserTest
[ERROR] Tests run: 11, Failures: 1, Errors: 0, Skipped: 0, Time elapsed: 0.325 s <<<
FAILURE! - in org.apache.sling.launchpad.webapp.integrationtest.userManager.CreateUserTest
[ERROR] testAnonymousSelfRegistrationDisabled(org.apache.sling.launchpad.webapp.integrationtest.userManager.CreateUserTest)
 Time elapsed: 0.013 s  <<< FAILURE!
junit.framework.AssertionFailedError: expected:<500> but was:<401>
	at org.apache.sling.launchpad.webapp.integrationtest.userManager.CreateUserTest.testAnonymousSelfRegistrationDisabled(CreateUserTest.java:271)

[INFO] Running org.apache.sling.launchpad.webapp.integrationtest.userManager.CreateGroupTest
[INFO] Tests run: 8, Failures: 0, Errors: 0, Skipped: 0, Time elapsed: 0.262 s - in org.apache.sling.launchpad.webapp.integrationtest.userManager.CreateGroupTest
[INFO] Running org.apache.sling.launchpad.webapp.integrationtest.ServletResolverConfigTest
[INFO] Tests run: 1, Failures: 0, Errors: 0, Skipped: 0, Time elapsed: 0.001 s - in org.apache.sling.launchpad.webapp.integrationtest.ServletResolverConfigTest
[INFO] Running org.apache.sling.launchpad.webapp.integrationtest.accessManager.GetAclTest
[INFO] Tests run: 7, Failures: 0, Errors: 0, Skipped: 0, Time elapsed: 0.908 s - in org.apache.sling.launchpad.webapp.integrationtest.accessManager.GetAclTest
[INFO] Running org.apache.sling.launchpad.webapp.integrationtest.accessManager.AccessPrivilegesInfoTest
[INFO] Tests run: 7, Failures: 0, Errors: 0, Skipped: 0, Time elapsed: 1.442 s - in org.apache.sling.launchpad.webapp.integrationtest.accessManager.AccessPrivilegesInfoTest
[INFO] Running org.apache.sling.launchpad.webapp.integrationtest.accessManager.ModifyAceTest
[INFO] Tests run: 20, Failures: 0, Errors: 0, Skipped: 0, Time elapsed: 2.359 s - in org.apache.sling.launchpad.webapp.integrationtest.accessManager.ModifyAceTest
[INFO] Running org.apache.sling.launchpad.webapp.integrationtest.accessManager.RemoveAcesTest
[INFO] Tests run: 4, Failures: 0, Errors: 0, Skipped: 0, Time elapsed: 0.424 s - in org.apache.sling.launchpad.webapp.integrationtest.accessManager.RemoveAcesTest
[INFO] Running org.apache.sling.launchpad.webapp.integrationtest.issues.SLING2085Test
[INFO] Tests run: 1, Failures: 0, Errors: 0, Skipped: 0, Time elapsed: 0.01 s - in org.apache.sling.launchpad.webapp.integrationtest.issues.SLING2085Test
[INFO] Running org.apache.sling.launchpad.webapp.integrationtest.issues.SLING2522Test
[INFO] Tests run: 1, Failures: 0, Errors: 0, Skipped: 0, Time elapsed: 0.003 s - in org.apache.sling.launchpad.webapp.integrationtest.issues.SLING2522Test
[INFO] Running org.apache.sling.launchpad.webapp.integrationtest.issues.SLING2617Test
[INFO] Tests run: 1, Failures: 0, Errors: 0, Skipped: 0, Time elapsed: 0.113 s - in org.apache.sling.launchpad.webapp.integrationtest.issues.SLING2617Test
[INFO] Running org.apache.sling.launchpad.webapp.integrationtest.issues.SLING457Test
[INFO] Tests run: 2, Failures: 0, Errors: 0, Skipped: 0, Time elapsed: 0.319 s - in org.apache.sling.launchpad.webapp.integrationtest.issues.SLING457Test
[INFO] Running org.apache.sling.launchpad.webapp.integrationtest.issues.SLING2082Test
[INFO] Tests run: 2, Failures: 0, Errors: 0, Skipped: 0, Time elapsed: 0.007 s - in org.apache.sling.launchpad.webapp.integrationtest.issues.SLING2082Test
[INFO] Running org.apache.sling.launchpad.webapp.integrationtest.issues.SLING2094Test
[INFO] Tests run: 2, Failures: 0, Errors: 0, Skipped: 0, Time elapsed: 0.287 s - in org.apache.sling.launchpad.webapp.integrationtest.issues.SLING2094Test
[INFO] Running org.apache.sling.launchpad.webapp.integrationtest.issues.SLING760Test
[INFO] Tests run: 1, Failures: 0, Errors: 0, Skipped: 0, Time elapsed: 0.087 s - in org.apache.sling.launchpad.webapp.integrationtest.issues.SLING760Test
[INFO] Running org.apache.sling.launchpad.webapp.integrationtest.runmodes.InactiveRunModeTest
[INFO] Tests run: 2, Failures: 0, Errors: 0, Skipped: 0, Time elapsed: 0.011 s - in org.apache.sling.launchpad.webapp.integrationtest.runmodes.InactiveRunModeTest
[INFO] Running org.apache.sling.launchpad.webapp.integrationtest.resourceprovider.PlanetsResourceProviderTest
[INFO] Tests run: 4, Failures: 0, Errors: 0, Skipped: 0, Time elapsed: 0.014 s - in org.apache.sling.launchpad.webapp.integrationtest.resourceprovider.PlanetsResourceProviderTest
[INFO] Running org.apache.sling.launchpad.webapp.integrationtest.RedirectTest
[INFO] Tests run: 6, Failures: 0, Errors: 0, Skipped: 0, Time elapsed: 0.123 s - in org.apache.sling.launchpad.webapp.integrationtest.RedirectTest
[INFO] 
[INFO] Results:
[INFO] 
[ERROR] Failures: 
[ERROR]   CreateUserTest.testAnonymousSelfRegistrationDisabled:271 expected:<500> but
was:<401>
[INFO] 
[ERROR] Tests run: 660, Failures: 1, Errors: 0, Skipped: 1
[INFO] 
[INFO] 
[INFO] --- slingstart-maven-plugin:1.7.16:stop (stop-container) @ org.apache.sling.launchpad.testing
---
[INFO] Stopping 1 Launchpad instances
[INFO] Stopping Launchpad '_-41000'
07.12.2019 11:34:33.625 *INFO * [Apache Sling Terminator] Java VM is shutting down
07.12.2019 11:34:33.626 *INFO * [Apache Sling Terminator] Stopping Apache Sling
Warning: Nashorn engine is planned to be removed from a future JDK release
[DEBUG] [ServiceReference 634 from bundle 95 : org.apache.sling.jcr.davex:1.3.10 ref=[javax.servlet.Servlet]
properties={objectClass=[javax.servlet.Servlet], osgi.http.whiteboard.context.select=(osgi.http.whiteboard.context.name=DavExAuthHttpContext),
osgi.http.whiteboard.servlet.pattern=/server/*, service.bundleid=95, service.description=Sling
JcrRemoting Servlet, service.id=634, service.scope=singleton, service.vendor=The Apache Software
Foundation, servlet.init.createAbsoluteURI=true, servlet.init.csrf-protection=disabled, servlet.init.protectedhandlers-config=org.apache.jackrabbit.server.remoting.davex.AclRemoveHandler,
servlet.init.resource-path-prefix=/server, sling.auth.requirements=-/server}] Ignoring unmatching
Servlet service
[DEBUG] [ServiceReference 164 from bundle 60 : org.apache.sling.launchpad.test-services:12.0.0.SNAPSHOT
ref=[javax.servlet.Servlet] properties={component.id=60, component.name=org.apache.sling.launchpad.testservices.servlets.R6WhiteboardServlet,
objectClass=[javax.servlet.Servlet], osgi.http.whiteboard.context.select=(osgi.http.whiteboard.context.name=org.apache.sling),
osgi.http.whiteboard.servlet.pattern=/whiteboard_r6, service.bundleid=60, service.id=164,
service.pid=org.apache.sling.launchpad.testservices.servlets.R6WhiteboardServlet, service.scope=bundle,
service.vendor=The Apache Software Foundation}] Ignoring unmatching Servlet service
[DEBUG] [ServiceReference 429 from bundle 144 : org.apache.sling.engine:2.6.20 ref=[javax.servlet.Servlet]
properties={component.id=264, component.name=org.apache.sling.engine.impl.SlingMainServlet,
objectClass=[javax.servlet.Servlet], osgi.http.whiteboard.context.select=(osgi.http.whiteboard.context.name=org.apache.sling),
osgi.http.whiteboard.servlet.pattern=/, service.bundleid=144, service.description=Apache Sling
Engine Main Servlet, service.id=429, service.scope=singleton, service.vendor=The Apache Software
Foundation, servlet-name=ApacheSling/2.6, sling.additional.response.headers=[Ljava.lang.String;@4b80e37b,
sling.max.calls=1000, sling.max.inclusions=50, sling.max.record.requests=20, sling.trace.allow=false}]
Ignoring unmatching Servlet service
[DEBUG] [ServiceReference 446 from bundle 144 : org.apache.sling.engine:2.6.20 ref=[javax.servlet.Filter]
properties={component.id=268, component.name=org.apache.sling.engine.impl.log.RequestLoggerFilter,
objectClass=[javax.servlet.Filter], osgi.http.whiteboard.context.select=(osgi.http.whiteboard.context.name=org.apache.sling),
osgi.http.whiteboard.filter.pattern=/, service.bundleid=144, service.description=Request Logger
Filter, service.id=446, service.ranking=32768, service.scope=bundle, service.vendor=The Apache
Software Foundation}] Ignoring unmatching Filter service
[DEBUG] [ServiceReference 447 from bundle 144 : org.apache.sling.engine:2.6.20 ref=[javax.servlet.Filter]
properties={component.id=269, component.name=org.apache.sling.engine.parameters, file.max=-1,
file.threshold=256000, objectClass=[javax.servlet.Filter], osgi.http.whiteboard.context.select=(osgi.http.whiteboard.context.name=org.apache.sling),
osgi.http.whiteboard.filter.pattern=/, request.max=-1, service.bundleid=144, service.id=447,
service.ranking=2147483647, service.scope=bundle, sling.default.max.parameters=10000, sling.default.parameter.checkForAdditionalContainerParameters=false,
sling.default.parameter.encoding=ISO-8859-1}] Ignoring unmatching Filter service
[INFO] Apachde Felix Http Whiteboard Service stopped
[DEBUG] [ServiceReference 1119 from bundle 39 : org.apache.felix.healthcheck.core:2.0.6 ref=[javax.servlet.Servlet]
properties={objectClass=[javax.servlet.Servlet], osgi.http.whiteboard.context.select=(osgi.http.whiteboard.context.name=internal.http.serviceunavailablefilter),
osgi.http.whiteboard.servlet.pattern=/, service.bundleid=39, service.id=1119, service.ranking=0,
service.scope=singleton}] Ignoring unmatching Servlet service
[INFO] Stopped Jetty.
07.12.2019 11:34:35.588 *INFO * [Sling Notifier] Apache Sling has been stopped
[INFO] 
[INFO] --- ianal-maven-plugin:1.0-alpha-1:verify-legal-files (default) @ org.apache.sling.launchpad.testing
---
WARNING: An illegal reflective access operation has occurred
WARNING: Illegal reflective access by org.codehaus.groovy.reflection.CachedConstructor (file:/home/jenkins/.m2/repository/org/codehaus/groovy/groovy-all-minimal/1.5.6/groovy-all-minimal-1.5.6.jar)
to constructor java.io.File(java.lang.String,java.io.File)
WARNING: Please consider reporting this to the maintainers of org.codehaus.groovy.reflection.CachedConstructor
WARNING: Use --illegal-access=warn to enable warnings of further illegal reflective access
operations
WARNING: All illegal access operations will be denied in a future release
[INFO] Checking legal files in: org.apache.sling.launchpad.testing-12-SNAPSHOT.jar
[INFO] Checking legal files in: org.apache.sling.launchpad.testing-12-SNAPSHOT-sources.jar
[INFO] 
[INFO] --- apache-rat-plugin:0.11:check (default) @ org.apache.sling.launchpad.testing ---
[INFO] 51 implicit excludes (use -debug for more details).
[INFO] Exclude: DEPENDENCIES
[INFO] Exclude: src/main/appended-resources/META-INF/*
[INFO] Exclude: velocity.log
[INFO] Exclude: target/*
[INFO] Exclude: README.md
[INFO] Exclude: maven-eclipse.xml
[INFO] Exclude: .*
[INFO] Exclude: .*/**
[INFO] Exclude: **/*.json
[INFO] Exclude: DEPENDENCIES
[INFO] Exclude: **/*.rej
[INFO] Exclude: hs_err_*.log
[INFO] Exclude: **/repository/index/*/index-details.txt
[INFO] Exclude: bnd.bnd
[INFO] 7 resources included (use -debug for more details)
[INFO] Rat check: Summary of files. Unapproved: 0 unknown: 0 generated: 0 approved: 6 licence.
[INFO] 
[INFO] --- maven-failsafe-plugin:2.21.0:verify (default) @ org.apache.sling.launchpad.testing
---
[INFO] ------------------------------------------------------------------------
[INFO] BUILD FAILURE
[INFO] ------------------------------------------------------------------------
[INFO] Total time:  03:28 min
[INFO] Finished at: 2019-12-07T11:34:36Z
[INFO] ------------------------------------------------------------------------
[INFO] [jenkins-event-spy] Generated /home/jenkins/jenkins-slave/workspace/e-sling-launchpad-testing_master@tmp/withMaven3de6d4ad/maven-spy-20191207-113107-930530656337189351460.log
[ERROR] Failed to execute goal org.apache.maven.plugins:maven-failsafe-plugin:2.21.0:verify
(default) on project org.apache.sling.launchpad.testing: There are test failures.
[ERROR] 
[ERROR] Please refer to /home/jenkins/jenkins-slave/workspace/e-sling-launchpad-testing_master/target/failsafe-reports
for the individual test results.
[ERROR] Please refer to dump files (if any exist) [date]-jvmRun[N].dump, [date].dumpstream
and [date]-jvmRun[N].dumpstream.
[ERROR] -> [Help 1]
[ERROR] 
[ERROR] To see the full stack trace of the errors, re-run Maven with the -e switch.
[ERROR] Re-run Maven using the -X switch to enable full debug logging.
[ERROR] 
[ERROR] For more information about the errors and possible solutions, please read the following
articles:
[ERROR] [Help 1] http://cwiki.apache.org/confluence/display/MAVEN/MojoFailureException
[Pipeline] }
[withMaven] Publishers: Pipeline Graph Publisher: 51 ms, JGiven Publisher: 2 ms
[Pipeline] // withMaven
[Pipeline] }
[Pipeline] // stage
[Pipeline] }
[Pipeline] // timeout
[Pipeline] stage
[Pipeline] { (Notifications)
[Pipeline] echo
Status change is BROKEN, notifications will be sent.
[Pipeline] emailext
Mime
  • Unnamed multipart/mixed (inline, None, 0 bytes)
View raw message