sling-dev mailing list archives

Site index · List index
Message view « Date » · « Thread »
Top « Date » · « Thread »
From "Tommaso Teofili (Jira)" <j...@apache.org>
Subject [jira] [Created] (SLING-8793) Content Distribution Core doesn't build with java 11
Date Mon, 21 Oct 2019 11:30:00 GMT
Tommaso Teofili created SLING-8793:
--------------------------------------

             Summary: Content Distribution Core doesn't build with java 11
                 Key: SLING-8793
                 URL: https://issues.apache.org/jira/browse/SLING-8793
             Project: Sling
          Issue Type: Bug
          Components: Content Distribution
            Reporter: Tommaso Teofili


When running _mvn clean install_ on _org.apache.sling.distribution.core_ I get a build failure
like the following:
{noformat}
[INFO] BUILD FAILURE
[INFO] ------------------------------------------------------------------------
[INFO] Total time: 01:07 min
[INFO] Finished at: 2019-10-21T13:28:53+02:00
[INFO] ------------------------------------------------------------------------
[ERROR] Failed to execute goal org.apache.maven.plugins:maven-enforcer-plugin:1.4.1:enforce
(enforce-java) on project org.apache.sling.distribution.core: Execution enforce-java of goal
org.apache.maven.plugins:maven-enforcer-plugin:1.4.1:enforce failed: An API incompatibility
was encountered while executing org.apache.maven.plugins:maven-enforcer-plugin:1.4.1:enforce:
java.lang.ExceptionInInitializerError: null
[ERROR] -----------------------------------------------------
[ERROR] realm =    plugin>org.apache.maven.plugins:maven-enforcer-plugin:1.4.1
[ERROR] strategy = org.codehaus.plexus.classworlds.strategy.SelfFirstStrategy
[ERROR] urls[0] = file:/Users/teofili/.m2/repository/org/apache/maven/plugins/maven-enforcer-plugin/1.4.1/maven-enforcer-plugin-1.4.1.jar
[ERROR] urls[1] = file:/Users/teofili/.m2/repository/backport-util-concurrent/backport-util-concurrent/3.1/backport-util-concurrent-3.1.jar
[ERROR] urls[2] = file:/Users/teofili/.m2/repository/org/codehaus/plexus/plexus-interpolation/1.11/plexus-interpolation-1.11.jar
[ERROR] urls[3] = file:/Users/teofili/.m2/repository/org/slf4j/slf4j-jdk14/1.5.6/slf4j-jdk14-1.5.6.jar
[ERROR] urls[4] = file:/Users/teofili/.m2/repository/org/slf4j/jcl-over-slf4j/1.5.6/jcl-over-slf4j-1.5.6.jar
[ERROR] urls[5] = file:/Users/teofili/.m2/repository/org/apache/maven/reporting/maven-reporting-api/2.2.1/maven-reporting-api-2.2.1.jar
[ERROR] urls[6] = file:/Users/teofili/.m2/repository/org/apache/maven/doxia/doxia-sink-api/1.1/doxia-sink-api-1.1.jar
[ERROR] urls[7] = file:/Users/teofili/.m2/repository/org/apache/maven/doxia/doxia-logging-api/1.1/doxia-logging-api-1.1.jar
[ERROR] urls[8] = file:/Users/teofili/.m2/repository/commons-cli/commons-cli/1.2/commons-cli-1.2.jar
[ERROR] urls[9] = file:/Users/teofili/.m2/repository/org/codehaus/plexus/plexus-interactivity-api/1.0-alpha-4/plexus-interactivity-api-1.0-alpha-4.jar
[ERROR] urls[10] = file:/Users/teofili/.m2/repository/org/sonatype/plexus/plexus-sec-dispatcher/1.3/plexus-sec-dispatcher-1.3.jar
[ERROR] urls[11] = file:/Users/teofili/.m2/repository/org/sonatype/plexus/plexus-cipher/1.4/plexus-cipher-1.4.jar
[ERROR] urls[12] = file:/Users/teofili/.m2/repository/org/codehaus/plexus/plexus-utils/3.0.22/plexus-utils-3.0.22.jar
[ERROR] urls[13] = file:/Users/teofili/.m2/repository/commons-lang/commons-lang/2.3/commons-lang-2.3.jar
[ERROR] urls[14] = file:/Users/teofili/.m2/repository/org/apache/maven/enforcer/enforcer-api/1.4.1/enforcer-api-1.4.1.jar
[ERROR] urls[15] = file:/Users/teofili/.m2/repository/org/apache/maven/enforcer/enforcer-rules/1.4.1/enforcer-rules-1.4.1.jar
[ERROR] urls[16] = file:/Users/teofili/.m2/repository/org/apache/maven/shared/maven-common-artifact-filters/1.4/maven-common-artifact-filters-1.4.jar
[ERROR] urls[17] = file:/Users/teofili/.m2/repository/org/beanshell/bsh/2.0b4/bsh-2.0b4.jar
[ERROR] urls[18] = file:/Users/teofili/.m2/repository/org/apache/maven/shared/maven-dependency-tree/2.2/maven-dependency-tree-2.2.jar
[ERROR] urls[19] = file:/Users/teofili/.m2/repository/org/codehaus/plexus/plexus-component-annotations/1.5.5/plexus-component-annotations-1.5.5.jar
[ERROR] urls[20] = file:/Users/teofili/.m2/repository/org/eclipse/aether/aether-util/0.9.0.M2/aether-util-0.9.0.M2.jar
[ERROR] urls[21] = file:/Users/teofili/.m2/repository/org/codehaus/plexus/plexus-i18n/1.0-beta-6/plexus-i18n-1.0-beta-6.jar
[ERROR] urls[22] = file:/Users/teofili/.m2/repository/org/apache/maven/plugin-testing/maven-plugin-testing-harness/1.3/maven-plugin-testing-harness-1.3.jar
[ERROR] urls[23] = file:/Users/teofili/.m2/repository/org/codehaus/plexus/plexus-archiver/2.2/plexus-archiver-2.2.jar
[ERROR] urls[24] = file:/Users/teofili/.m2/repository/org/codehaus/plexus/plexus-io/2.0.4/plexus-io-2.0.4.jar
[ERROR] urls[25] = file:/Users/teofili/.m2/repository/junit/junit/4.11/junit-4.11.jar
[ERROR] urls[26] = file:/Users/teofili/.m2/repository/org/hamcrest/hamcrest-core/1.3/hamcrest-core-1.3.jar
[ERROR] Number of foreign imports: 1
[ERROR] import: Entry[import  from realm ClassRealm[project>org.apache.sling:org.apache.sling.distribution.core:0.4.1-SNAPSHOT,
parent: ClassRealm[maven.api, parent: null]]]
[ERROR] 
[ERROR] -----------------------------------------------------
[ERROR] : begin 0, end 3, length 2
[ERROR] -> [Help 1]
[ERROR] 
[ERROR] To see the full stack trace of the errors, re-run Maven with the -e switch.
[ERROR] Re-run Maven using the -X switch to enable full debug logging.
[ERROR] 
[ERROR] For more information about the errors and possible solutions, please read the following
articles:
[ERROR] [Help 1] http://cwiki.apache.org/confluence/display/MAVEN/PluginContainerException

{noformat}



--
This message was sent by Atlassian Jira
(v8.3.4#803005)

Mime
View raw message