sling-dev mailing list archives

Site index · List index
Message view « Date » · « Thread »
Top « Date » · « Thread »
From Apache Jenkins Server <jenk...@builds.apache.org>
Subject [Jenkins] Sling » sling-org-apache-sling-launchpad-testing » master #308 is BROKEN
Date Tue, 10 Sep 2019 12:59:55 GMT
Please see https://builds.apache.org/job/Sling/job/sling-org-apache-sling-launchpad-testing/job/master/308/
for details.

No further emails will be sent until the status of the build is changed.
Build log follows below:

[...truncated 3859 lines...]
[INFO] Tests run: 10, Failures: 0, Errors: 0, Skipped: 0, Time elapsed: 0.405 s - in org.apache.sling.launchpad.webapp.integrationtest.servlets.post.PostServletAtCopyTest
[INFO] Running org.apache.sling.launchpad.webapp.integrationtest.servlets.post.SlingPostProcessorTest
[INFO] Tests run: 1, Failures: 0, Errors: 0, Skipped: 0, Time elapsed: 0.016 s - in org.apache.sling.launchpad.webapp.integrationtest.servlets.post.SlingPostProcessorTest
[INFO] Running org.apache.sling.launchpad.webapp.integrationtest.servlets.post.PostServletAtMoveTest
[INFO] Tests run: 9, Failures: 0, Errors: 0, Skipped: 0, Time elapsed: 0.314 s - in org.apache.sling.launchpad.webapp.integrationtest.servlets.post.PostServletAtMoveTest
[INFO] Running org.apache.sling.launchpad.webapp.integrationtest.servlets.post.CustomPostOperationTest
[INFO] Tests run: 2, Failures: 0, Errors: 0, Skipped: 0, Time elapsed: 0.091 s - in org.apache.sling.launchpad.webapp.integrationtest.servlets.post.CustomPostOperationTest
[INFO] Running org.apache.sling.launchpad.webapp.integrationtest.servlets.post.PostServletUpdateTest
[INFO] Tests run: 7, Failures: 0, Errors: 0, Skipped: 0, Time elapsed: 0.235 s - in org.apache.sling.launchpad.webapp.integrationtest.servlets.post.PostServletUpdateTest
[INFO] Running org.apache.sling.launchpad.webapp.integrationtest.servlets.post.SlingDefaultValuesTest
[INFO] Tests run: 5, Failures: 0, Errors: 0, Skipped: 0, Time elapsed: 0.193 s - in org.apache.sling.launchpad.webapp.integrationtest.servlets.post.SlingDefaultValuesTest
[INFO] Running org.apache.sling.launchpad.webapp.integrationtest.servlets.post.ReferenceTypeHintTest
[INFO] Tests run: 2, Failures: 0, Errors: 0, Skipped: 0, Time elapsed: 0.613 s - in org.apache.sling.launchpad.webapp.integrationtest.servlets.post.ReferenceTypeHintTest
[INFO] Running org.apache.sling.launchpad.webapp.integrationtest.servlets.post.PostServletVersionableTest
[INFO] Tests run: 26, Failures: 0, Errors: 0, Skipped: 0, Time elapsed: 1.908 s - in org.apache.sling.launchpad.webapp.integrationtest.servlets.post.PostServletVersionableTest
[INFO] Running org.apache.sling.launchpad.webapp.integrationtest.servlets.post.PostServletImportTest
[INFO] Tests run: 19, Failures: 0, Errors: 0, Skipped: 0, Time elapsed: 1.313 s - in org.apache.sling.launchpad.webapp.integrationtest.servlets.post.PostServletImportTest
[INFO] Running org.apache.sling.launchpad.webapp.integrationtest.servlets.post.PostServletAtDeleteTest
[INFO] Tests run: 2, Failures: 0, Errors: 0, Skipped: 0, Time elapsed: 0.104 s - in org.apache.sling.launchpad.webapp.integrationtest.servlets.post.PostServletAtDeleteTest
[INFO] Running org.apache.sling.launchpad.webapp.integrationtest.servlets.resolution.WarSelectorServletTest
[INFO] Tests run: 3, Failures: 0, Errors: 0, Skipped: 0, Time elapsed: 0.287 s - in org.apache.sling.launchpad.webapp.integrationtest.servlets.resolution.WarSelectorServletTest
[INFO] Running org.apache.sling.launchpad.webapp.integrationtest.servlets.resolution.PathsServletTest
Sep 10, 2019 12:59:12 PM org.apache.sling.launchpad.testservices.servlets.TestServlet doGet
SEVERE: test JUL message
Sep 10, 2019 12:59:12 PM org.apache.sling.launchpad.testservices.servlets.TestServlet doGet
SEVERE: test JUL message
[INFO] Tests run: 2, Failures: 0, Errors: 0, Skipped: 0, Time elapsed: 0.166 s - in org.apache.sling.launchpad.webapp.integrationtest.servlets.resolution.PathsServletTest
[INFO] Running org.apache.sling.launchpad.webapp.integrationtest.servlets.resolution.PrefixTest
Sep 10, 2019 12:59:12 PM org.apache.sling.launchpad.testservices.servlets.TestServlet doGet
SEVERE: test JUL message
Sep 10, 2019 12:59:12 PM org.apache.sling.launchpad.testservices.servlets.TestServlet doGet
SEVERE: test JUL message
Sep 10, 2019 12:59:12 PM org.apache.sling.launchpad.testservices.servlets.TestServlet doGet
SEVERE: test JUL message
[INFO] Tests run: 3, Failures: 0, Errors: 0, Skipped: 0, Time elapsed: 0.241 s - in org.apache.sling.launchpad.webapp.integrationtest.servlets.resolution.PrefixTest
[INFO] Running org.apache.sling.launchpad.webapp.integrationtest.servlets.resolution.ExtensionServletTest
Sep 10, 2019 12:59:12 PM org.apache.sling.launchpad.testservices.servlets.TestServlet doGet
SEVERE: test JUL message
Sep 10, 2019 12:59:12 PM org.apache.sling.launchpad.testservices.servlets.TestServlet doGet
SEVERE: test JUL message
[INFO] Tests run: 3, Failures: 0, Errors: 0, Skipped: 0, Time elapsed: 0.24 s - in org.apache.sling.launchpad.webapp.integrationtest.servlets.resolution.ExtensionServletTest
[INFO] Running org.apache.sling.launchpad.webapp.integrationtest.servlets.resolution.PutMethodServletTest
[INFO] Tests run: 2, Failures: 0, Errors: 0, Skipped: 0, Time elapsed: 0.165 s - in org.apache.sling.launchpad.webapp.integrationtest.servlets.resolution.PutMethodServletTest
[INFO] Running org.apache.sling.launchpad.webapp.integrationtest.servlets.resolution.SelectorServletTest
Sep 10, 2019 12:59:13 PM org.apache.sling.launchpad.testservices.servlets.TestServlet doGet
SEVERE: test JUL message
Sep 10, 2019 12:59:13 PM org.apache.sling.launchpad.testservices.servlets.TestServlet doGet
SEVERE: test JUL message
[INFO] Tests run: 4, Failures: 0, Errors: 0, Skipped: 0, Time elapsed: 0.327 s - in org.apache.sling.launchpad.webapp.integrationtest.servlets.resolution.SelectorServletTest
[INFO] Running org.apache.sling.launchpad.webapp.integrationtest.servlets.resolution.RequestUriOptingServletTest
Sep 10, 2019 12:59:13 PM org.apache.sling.launchpad.testservices.servlets.TestServlet doGet
SEVERE: test JUL message
Sep 10, 2019 12:59:13 PM org.apache.sling.launchpad.testservices.servlets.TestServlet doGet
SEVERE: test JUL message
[INFO] Tests run: 4, Failures: 0, Errors: 0, Skipped: 0, Time elapsed: 0.33 s - in org.apache.sling.launchpad.webapp.integrationtest.servlets.resolution.RequestUriOptingServletTest
[INFO] Running org.apache.sling.launchpad.webapp.integrationtest.servlets.resolution.HtmlDefaultServletTest
Sep 10, 2019 12:59:13 PM org.apache.sling.launchpad.testservices.servlets.TestServlet doGet
SEVERE: test JUL message
Sep 10, 2019 12:59:17 PM org.apache.sling.launchpad.testservices.servlets.TestServlet doGet
SEVERE: test JUL message
Sep 10, 2019 12:59:17 PM org.apache.sling.launchpad.testservices.servlets.TestServlet doGet
SEVERE: test JUL message
[INFO] Tests run: 2, Failures: 0, Errors: 0, Skipped: 0, Time elapsed: 6.553 s - in org.apache.sling.launchpad.webapp.integrationtest.servlets.resolution.HtmlDefaultServletTest
[INFO] Running org.apache.sling.launchpad.webapp.integrationtest.servlets.resolution.PathsServletWithNodeTest
Sep 10, 2019 12:59:20 PM org.apache.sling.launchpad.testservices.servlets.TestServlet doGet
SEVERE: test JUL message
[INFO] Tests run: 1, Failures: 0, Errors: 0, Skipped: 0, Time elapsed: 0.087 s - in org.apache.sling.launchpad.webapp.integrationtest.servlets.resolution.PathsServletWithNodeTest
[INFO] Running org.apache.sling.launchpad.webapp.integrationtest.servlets.resolution.RequestObjectTest
Sep 10, 2019 12:59:20 PM org.apache.sling.launchpad.testservices.servlets.TestServlet doGet
SEVERE: test JUL message
Sep 10, 2019 12:59:20 PM org.apache.sling.launchpad.testservices.servlets.TestServlet doGet
SEVERE: test JUL message
Sep 10, 2019 12:59:20 PM org.apache.sling.launchpad.testservices.servlets.TestServlet doGet
SEVERE: test JUL message
Sep 10, 2019 12:59:20 PM org.apache.sling.launchpad.testservices.servlets.TestServlet doGet
SEVERE: test JUL message
[INFO] Tests run: 1, Failures: 0, Errors: 0, Skipped: 0, Time elapsed: 0.089 s - in org.apache.sling.launchpad.webapp.integrationtest.servlets.resolution.RequestObjectTest
[INFO] Running org.apache.sling.launchpad.webapp.integrationtest.servlets.resolution.PrioritiesTest
Sep 10, 2019 12:59:20 PM org.apache.sling.launchpad.testservices.servlets.TestServlet doGet
SEVERE: test JUL message
[INFO] Tests run: 1, Failures: 0, Errors: 0, Skipped: 0, Time elapsed: 0.069 s - in org.apache.sling.launchpad.webapp.integrationtest.servlets.resolution.PrioritiesTest
[INFO] Running org.apache.sling.launchpad.webapp.integrationtest.servlets.resolver.errorhandler.ErrorHandlingTest
[INFO] Tests run: 10, Failures: 0, Errors: 0, Skipped: 0, Time elapsed: 9.616 s - in org.apache.sling.launchpad.webapp.integrationtest.servlets.resolver.errorhandler.ErrorHandlingTest
[INFO] Running org.apache.sling.launchpad.webapp.integrationtest.servlets.HeadServletTest
[INFO] Tests run: 6, Failures: 0, Errors: 0, Skipped: 0, Time elapsed: 0.032 s - in org.apache.sling.launchpad.webapp.integrationtest.servlets.HeadServletTest
[INFO] Running org.apache.sling.launchpad.webapp.integrationtest.servlets.R6WhiteboardServletTest
[INFO] Tests run: 1, Failures: 0, Errors: 0, Skipped: 0, Time elapsed: 0 s - in org.apache.sling.launchpad.webapp.integrationtest.servlets.R6WhiteboardServletTest
[INFO] Running org.apache.sling.launchpad.webapp.integrationtest.ScriptBuiltinObjectsTest
[INFO] Tests run: 1, Failures: 0, Errors: 0, Skipped: 0, Time elapsed: 0.091 s - in org.apache.sling.launchpad.webapp.integrationtest.ScriptBuiltinObjectsTest
[INFO] Running org.apache.sling.launchpad.webapp.integrationtest.WriteableResourcesProxyTest
[INFO] Tests run: 1, Failures: 0, Errors: 0, Skipped: 0, Time elapsed: 0.016 s - in org.apache.sling.launchpad.webapp.integrationtest.WriteableResourcesProxyTest
[INFO] Running org.apache.sling.launchpad.webapp.integrationtest.ValueFromTest
[INFO] Tests run: 3, Failures: 0, Errors: 0, Skipped: 0, Time elapsed: 0.06 s - in org.apache.sling.launchpad.webapp.integrationtest.ValueFromTest
[INFO] Running org.apache.sling.launchpad.webapp.integrationtest.LaunchpadConfigInstallerTest
[INFO] Tests run: 1, Failures: 0, Errors: 0, Skipped: 0, Time elapsed: 0.001 s - in org.apache.sling.launchpad.webapp.integrationtest.LaunchpadConfigInstallerTest
[INFO] Running org.apache.sling.launchpad.webapp.integrationtest.GetStarTest
[INFO] Tests run: 2, Failures: 0, Errors: 0, Skipped: 0, Time elapsed: 0.075 s - in org.apache.sling.launchpad.webapp.integrationtest.GetStarTest
[INFO] Running org.apache.sling.launchpad.webapp.integrationtest.jaxb.JaxbMarshallingTest
[INFO] Tests run: 1, Failures: 0, Errors: 0, Skipped: 0, Time elapsed: 0.209 s - in org.apache.sling.launchpad.webapp.integrationtest.jaxb.JaxbMarshallingTest
[INFO] Running org.apache.sling.launchpad.webapp.integrationtest.DavExDisabledAnonAccessTest
[INFO] Tests run: 2, Failures: 0, Errors: 0, Skipped: 0, Time elapsed: 0.859 s - in org.apache.sling.launchpad.webapp.integrationtest.DavExDisabledAnonAccessTest
[INFO] Running org.apache.sling.launchpad.webapp.integrationtest.CreateNodeTest
[INFO] Tests run: 6, Failures: 0, Errors: 0, Skipped: 0, Time elapsed: 0.145 s - in org.apache.sling.launchpad.webapp.integrationtest.CreateNodeTest
[INFO] Running org.apache.sling.launchpad.webapp.integrationtest.ImmediateScriptActivationTest
[INFO] Tests run: 2, Failures: 0, Errors: 0, Skipped: 0, Time elapsed: 2.864 s - in org.apache.sling.launchpad.webapp.integrationtest.ImmediateScriptActivationTest
[INFO] Running org.apache.sling.launchpad.webapp.integrationtest.RangeStreamingTest
[INFO] Tests run: 4, Failures: 0, Errors: 0, Skipped: 0, Time elapsed: 0.427 s - in org.apache.sling.launchpad.webapp.integrationtest.RangeStreamingTest
[INFO] Running org.apache.sling.launchpad.webapp.integrationtest.UploadFileTest
[INFO] Tests run: 4, Failures: 0, Errors: 0, Skipped: 0, Time elapsed: 0.202 s - in org.apache.sling.launchpad.webapp.integrationtest.UploadFileTest
[INFO] Running org.apache.sling.launchpad.webapp.integrationtest.userManager.UpdateUserTest
[INFO] Tests run: 12, Failures: 0, Errors: 0, Skipped: 0, Time elapsed: 0.842 s - in org.apache.sling.launchpad.webapp.integrationtest.userManager.UpdateUserTest
[INFO] Running org.apache.sling.launchpad.webapp.integrationtest.userManager.RemoveAuthorizablesTest
[INFO] Tests run: 11, Failures: 0, Errors: 0, Skipped: 0, Time elapsed: 0.665 s - in org.apache.sling.launchpad.webapp.integrationtest.userManager.RemoveAuthorizablesTest
[INFO] Running org.apache.sling.launchpad.webapp.integrationtest.userManager.UserPrivilegesInfoTest
[INFO] Tests run: 7, Failures: 0, Errors: 0, Skipped: 0, Time elapsed: 1.993 s - in org.apache.sling.launchpad.webapp.integrationtest.userManager.UserPrivilegesInfoTest
[INFO] Running org.apache.sling.launchpad.webapp.integrationtest.userManager.UpdateGroupTest
[INFO] Tests run: 8, Failures: 0, Errors: 0, Skipped: 0, Time elapsed: 1.014 s - in org.apache.sling.launchpad.webapp.integrationtest.userManager.UpdateGroupTest
[INFO] Running org.apache.sling.launchpad.webapp.integrationtest.userManager.CreateUserTest
[ERROR] Tests run: 11, Failures: 1, Errors: 0, Skipped: 0, Time elapsed: 0.348 s <<<
FAILURE! - in org.apache.sling.launchpad.webapp.integrationtest.userManager.CreateUserTest
[ERROR] testAnonymousSelfRegistrationDisabled(org.apache.sling.launchpad.webapp.integrationtest.userManager.CreateUserTest)
 Time elapsed: 0.019 s  <<< FAILURE!
junit.framework.AssertionFailedError: expected:<500> but was:<401>
	at org.apache.sling.launchpad.webapp.integrationtest.userManager.CreateUserTest.testAnonymousSelfRegistrationDisabled(CreateUserTest.java:271)

[INFO] Running org.apache.sling.launchpad.webapp.integrationtest.userManager.CreateGroupTest
[INFO] Tests run: 8, Failures: 0, Errors: 0, Skipped: 0, Time elapsed: 0.257 s - in org.apache.sling.launchpad.webapp.integrationtest.userManager.CreateGroupTest
[INFO] Running org.apache.sling.launchpad.webapp.integrationtest.ServletResolverConfigTest
[INFO] Tests run: 1, Failures: 0, Errors: 0, Skipped: 0, Time elapsed: 0 s - in org.apache.sling.launchpad.webapp.integrationtest.ServletResolverConfigTest
[INFO] Running org.apache.sling.launchpad.webapp.integrationtest.accessManager.GetAclTest
[INFO] Tests run: 7, Failures: 0, Errors: 0, Skipped: 0, Time elapsed: 0.882 s - in org.apache.sling.launchpad.webapp.integrationtest.accessManager.GetAclTest
[INFO] Running org.apache.sling.launchpad.webapp.integrationtest.accessManager.AccessPrivilegesInfoTest
[INFO] Tests run: 7, Failures: 0, Errors: 0, Skipped: 0, Time elapsed: 1.496 s - in org.apache.sling.launchpad.webapp.integrationtest.accessManager.AccessPrivilegesInfoTest
[INFO] Running org.apache.sling.launchpad.webapp.integrationtest.accessManager.ModifyAceTest
[INFO] Tests run: 20, Failures: 0, Errors: 0, Skipped: 0, Time elapsed: 2.373 s - in org.apache.sling.launchpad.webapp.integrationtest.accessManager.ModifyAceTest
[INFO] Running org.apache.sling.launchpad.webapp.integrationtest.accessManager.RemoveAcesTest
[INFO] Tests run: 4, Failures: 0, Errors: 0, Skipped: 0, Time elapsed: 0.501 s - in org.apache.sling.launchpad.webapp.integrationtest.accessManager.RemoveAcesTest
[INFO] Running org.apache.sling.launchpad.webapp.integrationtest.issues.SLING2085Test
[INFO] Tests run: 1, Failures: 0, Errors: 0, Skipped: 0, Time elapsed: 0.008 s - in org.apache.sling.launchpad.webapp.integrationtest.issues.SLING2085Test
[INFO] Running org.apache.sling.launchpad.webapp.integrationtest.issues.SLING2522Test
[INFO] Tests run: 1, Failures: 0, Errors: 0, Skipped: 0, Time elapsed: 0.003 s - in org.apache.sling.launchpad.webapp.integrationtest.issues.SLING2522Test
[INFO] Running org.apache.sling.launchpad.webapp.integrationtest.issues.SLING2617Test
[INFO] Tests run: 1, Failures: 0, Errors: 0, Skipped: 0, Time elapsed: 0.246 s - in org.apache.sling.launchpad.webapp.integrationtest.issues.SLING2617Test
[INFO] Running org.apache.sling.launchpad.webapp.integrationtest.issues.SLING457Test
[INFO] Tests run: 2, Failures: 0, Errors: 0, Skipped: 0, Time elapsed: 0.452 s - in org.apache.sling.launchpad.webapp.integrationtest.issues.SLING457Test
[INFO] Running org.apache.sling.launchpad.webapp.integrationtest.issues.SLING2082Test
[INFO] Tests run: 2, Failures: 0, Errors: 0, Skipped: 0, Time elapsed: 0.007 s - in org.apache.sling.launchpad.webapp.integrationtest.issues.SLING2082Test
[INFO] Running org.apache.sling.launchpad.webapp.integrationtest.issues.SLING2094Test
[INFO] Tests run: 2, Failures: 0, Errors: 0, Skipped: 0, Time elapsed: 0.448 s - in org.apache.sling.launchpad.webapp.integrationtest.issues.SLING2094Test
[INFO] Running org.apache.sling.launchpad.webapp.integrationtest.issues.SLING760Test
[INFO] Tests run: 1, Failures: 0, Errors: 0, Skipped: 0, Time elapsed: 0.171 s - in org.apache.sling.launchpad.webapp.integrationtest.issues.SLING760Test
[INFO] Running org.apache.sling.launchpad.webapp.integrationtest.runmodes.InactiveRunModeTest
[INFO] Tests run: 2, Failures: 0, Errors: 0, Skipped: 0, Time elapsed: 0.014 s - in org.apache.sling.launchpad.webapp.integrationtest.runmodes.InactiveRunModeTest
[INFO] Running org.apache.sling.launchpad.webapp.integrationtest.resourceprovider.PlanetsResourceProviderTest
[INFO] Tests run: 4, Failures: 0, Errors: 0, Skipped: 0, Time elapsed: 0.019 s - in org.apache.sling.launchpad.webapp.integrationtest.resourceprovider.PlanetsResourceProviderTest
[INFO] Running org.apache.sling.launchpad.webapp.integrationtest.RedirectTest
[INFO] Tests run: 6, Failures: 0, Errors: 0, Skipped: 0, Time elapsed: 0.138 s - in org.apache.sling.launchpad.webapp.integrationtest.RedirectTest
[INFO] 
[INFO] Results:
[INFO] 
[ERROR] Failures: 
[ERROR]   CreateUserTest.testAnonymousSelfRegistrationDisabled:271 expected:<500> but
was:<401>
[INFO] 
[ERROR] Tests run: 660, Failures: 1, Errors: 0, Skipped: 1
[INFO] 
[INFO] 
[INFO] --- jacoco-maven-plugin:0.7.9:merge (merge-unit-and-it) @ org.apache.sling.launchpad.testing
---
[INFO] Loading execution data file /home/jenkins/jenkins-slave/workspace/e-sling-launchpad-testing_master/target/jacoco-it.exec
[INFO] Writing merged execution data to /home/jenkins/jenkins-slave/workspace/e-sling-launchpad-testing_master/target/jacoco-merged.exec
[INFO] 
[INFO] --- slingstart-maven-plugin:1.7.16:stop (stop-container) @ org.apache.sling.launchpad.testing
---
[INFO] Stopping 1 Launchpad instances
[INFO] Stopping Launchpad '_-41000'
10.09.2019 12:59:48.129 *INFO * [Apache Sling Terminator] Java VM is shutting down
10.09.2019 12:59:48.129 *INFO * [Apache Sling Terminator] Stopping Apache Sling
10.09.2019 12:59:50.076 *INFO * [Sling Notifier] Apache Sling has been stopped
[INFO] 
[INFO] --- ianal-maven-plugin:1.0-alpha-1:verify-legal-files (default) @ org.apache.sling.launchpad.testing
---
[INFO] Checking legal files in: org.apache.sling.launchpad.testing-12-SNAPSHOT.jar
[INFO] Checking legal files in: org.apache.sling.launchpad.testing-12-SNAPSHOT-sources.jar
[INFO] 
[INFO] --- apache-rat-plugin:0.11:check (default) @ org.apache.sling.launchpad.testing ---
[INFO] 51 implicit excludes (use -debug for more details).
[INFO] Exclude: DEPENDENCIES
[INFO] Exclude: src/main/appended-resources/META-INF/*
[INFO] Exclude: velocity.log
[INFO] Exclude: target/*
[INFO] Exclude: README.md
[INFO] Exclude: maven-eclipse.xml
[INFO] Exclude: .*
[INFO] Exclude: .*/**
[INFO] Exclude: **/*.json
[INFO] Exclude: DEPENDENCIES
[INFO] Exclude: **/*.rej
[INFO] Exclude: hs_err_*.log
[INFO] Exclude: **/repository/index/*/index-details.txt
[INFO] Exclude: bnd.bnd
[INFO] 7 resources included (use -debug for more details)
[INFO] Rat check: Summary of files. Unapproved: 0 unknown: 0 generated: 0 approved: 6 licence.
[INFO] 
[INFO] --- jacoco-maven-plugin:0.7.9:report (report) @ org.apache.sling.launchpad.testing
---
[INFO] Skipping JaCoCo execution due to missing execution data file.
[INFO] 
[INFO] --- jacoco-maven-plugin:0.7.9:report-integration (report-integration) @ org.apache.sling.launchpad.testing
---
[INFO] Loading execution data file /home/jenkins/jenkins-slave/workspace/e-sling-launchpad-testing_master/target/jacoco-it.exec
[INFO] Analyzed bundle 'Apache Sling Launchpad Testing' with 0 classes
[INFO] 
[INFO] --- jacoco-maven-plugin:0.7.9:report (report-merged) @ org.apache.sling.launchpad.testing
---
[INFO] Loading execution data file /home/jenkins/jenkins-slave/workspace/e-sling-launchpad-testing_master/target/jacoco-merged.exec
[INFO] Analyzed bundle 'Apache Sling Launchpad Testing' with 0 classes
[INFO] 
[INFO] --- maven-failsafe-plugin:2.21.0:verify (default) @ org.apache.sling.launchpad.testing
---
[INFO] 
[INFO] ------------------------------------------------------------------------
[INFO] Skipping Apache Sling Launchpad Testing
[INFO] This project has been banned from the build due to previous failures.
[INFO] ------------------------------------------------------------------------
[INFO] ------------------------------------------------------------------------
[INFO] BUILD FAILURE
[INFO] ------------------------------------------------------------------------
[INFO] Total time:  04:50 min
[INFO] Finished at: 2019-09-10T12:59:52Z
[INFO] ------------------------------------------------------------------------
[INFO] [jenkins-event-spy] Generated /home/jenkins/jenkins-slave/workspace/e-sling-launchpad-testing_master@tmp/withMavenbdcbeb84/maven-spy-20190910-125502-96642605128299413749.log
[ERROR] Failed to execute goal org.apache.maven.plugins:maven-failsafe-plugin:2.21.0:verify
(default) on project org.apache.sling.launchpad.testing: There are test failures.
[ERROR] 
[ERROR] Please refer to /home/jenkins/jenkins-slave/workspace/e-sling-launchpad-testing_master/target/failsafe-reports
for the individual test results.
[ERROR] Please refer to dump files (if any exist) [date]-jvmRun[N].dump, [date].dumpstream
and [date]-jvmRun[N].dumpstream.
[ERROR] -> [Help 1]
[ERROR] 
[ERROR] To see the full stack trace of the errors, re-run Maven with the -e switch.
[ERROR] Re-run Maven using the -X switch to enable full debug logging.
[ERROR] 
[ERROR] For more information about the errors and possible solutions, please read the following
articles:
[ERROR] [Help 1] http://cwiki.apache.org/confluence/display/MAVEN/MojoFailureException
[Pipeline] echo
Marking build unstable due to missing SonarCloud onboarding. See https://cwiki.apache.org/confluence/display/SLING/SonarCloud+analysis
for steps to fix.
[Pipeline] }
[withMaven] Publishers: 
[Pipeline] // withMaven
[Pipeline] }
[Pipeline] // withCredentials
[Pipeline] }
[Pipeline] // stage
[Pipeline] }
[Pipeline] // timeout
[Pipeline] stage
[Pipeline] { (Notifications)
[Pipeline] echo
Status change is BROKEN, notifications will be sent.
[Pipeline] emailext
Mime
  • Unnamed multipart/mixed (inline, None, 0 bytes)
View raw message