sling-dev mailing list archives

Site index · List index
Message view « Date » · « Thread »
Top « Date » · « Thread »
From Apache Jenkins Server <jenk...@builds.apache.org>
Subject [Jenkins] Sling » sling-org-apache-sling-launchpad-testing » master #247 is BROKEN
Date Sun, 28 Jul 2019 02:52:02 GMT
Please see https://builds.apache.org/job/Sling/job/sling-org-apache-sling-launchpad-testing/job/master/247/
for details.

No further emails will be sent until the status of the build is changed.
Build log follows below:

[...truncated 1117 lines...]
[INFO] Running org.apache.sling.launchpad.webapp.integrationtest.servlets.post.PostServletOutputContentTypeTest
[INFO] Tests run: 6, Failures: 0, Errors: 0, Skipped: 0, Time elapsed: 0.138 s - in org.apache.sling.launchpad.webapp.integrationtest.servlets.post.PostServletOutputContentTypeTest
[INFO] Running org.apache.sling.launchpad.webapp.integrationtest.servlets.post.PostServletCreateTest
[INFO] Tests run: 16, Failures: 0, Errors: 0, Skipped: 0, Time elapsed: 0.452 s - in org.apache.sling.launchpad.webapp.integrationtest.servlets.post.PostServletCreateTest
[INFO] Running org.apache.sling.launchpad.webapp.integrationtest.servlets.post.PostServletAtDeleteTest
[INFO] Tests run: 2, Failures: 0, Errors: 0, Skipped: 0, Time elapsed: 0.167 s - in org.apache.sling.launchpad.webapp.integrationtest.servlets.post.PostServletAtDeleteTest
[INFO] Running org.apache.sling.launchpad.webapp.integrationtest.runmodes.InactiveRunModeTest
[INFO] Tests run: 2, Failures: 0, Errors: 0, Skipped: 0, Time elapsed: 0.042 s - in org.apache.sling.launchpad.webapp.integrationtest.runmodes.InactiveRunModeTest
[INFO] Running org.apache.sling.launchpad.webapp.integrationtest.teleporter.BasicTeleporterTest
[INFO] Tests run: 2, Failures: 0, Errors: 0, Skipped: 0, Time elapsed: 0.702 s - in org.apache.sling.launchpad.webapp.integrationtest.teleporter.BasicTeleporterTest
[INFO] Running org.apache.sling.launchpad.webapp.integrationtest.teleporter.LocalServiceTeleporterTest
[INFO] Tests run: 1, Failures: 0, Errors: 0, Skipped: 0, Time elapsed: 0.181 s - in org.apache.sling.launchpad.webapp.integrationtest.teleporter.LocalServiceTeleporterTest
[INFO] Running org.apache.sling.launchpad.webapp.integrationtest.teleporter.LdapFilterTeleporterTest
[INFO] Tests run: 2, Failures: 0, Errors: 0, Skipped: 0, Time elapsed: 0.349 s - in org.apache.sling.launchpad.webapp.integrationtest.teleporter.LdapFilterTeleporterTest
[INFO] Running org.apache.sling.launchpad.webapp.integrationtest.teleporter.TeleporterOptionsTest
[INFO] Tests run: 1, Failures: 0, Errors: 0, Skipped: 0, Time elapsed: 0.001 s - in org.apache.sling.launchpad.webapp.integrationtest.teleporter.TeleporterOptionsTest
[INFO] Running org.apache.sling.launchpad.webapp.integrationtest.teleporter.EmbeddedDependenciesTeleporterTest
[INFO] Tests run: 2, Failures: 0, Errors: 0, Skipped: 0, Time elapsed: 0.277 s - in org.apache.sling.launchpad.webapp.integrationtest.teleporter.EmbeddedDependenciesTeleporterTest
[INFO] Running org.apache.sling.launchpad.webapp.integrationtest.teleporter.TeleportedResourcesFolderTest
[INFO] Tests run: 3, Failures: 0, Errors: 0, Skipped: 0, Time elapsed: 0.451 s - in org.apache.sling.launchpad.webapp.integrationtest.teleporter.TeleportedResourcesFolderTest
[INFO] Running org.apache.sling.launchpad.webapp.integrationtest.teleporter.MultipleRulesTeleporterTest
[INFO] Tests run: 2, Failures: 0, Errors: 0, Skipped: 0, Time elapsed: 0.335 s - in org.apache.sling.launchpad.webapp.integrationtest.teleporter.MultipleRulesTeleporterTest
[INFO] Running org.apache.sling.launchpad.webapp.integrationtest.teleporter.ServicesPresentTest
[INFO] Tests run: 1, Failures: 0, Errors: 0, Skipped: 0, Time elapsed: 0.147 s - in org.apache.sling.launchpad.webapp.integrationtest.teleporter.ServicesPresentTest
[INFO] Running org.apache.sling.launchpad.webapp.integrationtest.teleporter.TeleportedResourcesSingleTest
[INFO] Tests run: 3, Failures: 0, Errors: 0, Skipped: 0, Time elapsed: 0.437 s - in org.apache.sling.launchpad.webapp.integrationtest.teleporter.TeleportedResourcesSingleTest
[INFO] Running org.apache.sling.launchpad.webapp.integrationtest.RedirectTest
[INFO] Tests run: 6, Failures: 0, Errors: 0, Skipped: 0, Time elapsed: 0.164 s - in org.apache.sling.launchpad.webapp.integrationtest.RedirectTest
[INFO] Running org.apache.sling.launchpad.webapp.integrationtest.FiltersTest
[INFO] Tests run: 1, Failures: 0, Errors: 0, Skipped: 0, Time elapsed: 0.001 s - in org.apache.sling.launchpad.webapp.integrationtest.FiltersTest
[INFO] Running org.apache.sling.launchpad.webapp.integrationtest.provisioning.EmbeddedModelTest
[INFO] Tests run: 2, Failures: 0, Errors: 0, Skipped: 0, Time elapsed: 0.345 s - in org.apache.sling.launchpad.webapp.integrationtest.provisioning.EmbeddedModelTest
[INFO] Running org.apache.sling.launchpad.webapp.integrationtest.HttpPingTest
[INFO] Tests run: 2, Failures: 0, Errors: 0, Skipped: 0, Time elapsed: 0.004 s - in org.apache.sling.launchpad.webapp.integrationtest.HttpPingTest
[INFO] Running org.apache.sling.launchpad.webapp.integrationtest.WebdavOptionsTest
[INFO] Tests run: 2, Failures: 0, Errors: 0, Skipped: 0, Time elapsed: 0.014 s - in org.apache.sling.launchpad.webapp.integrationtest.WebdavOptionsTest
[INFO] Running org.apache.sling.launchpad.webapp.integrationtest.ScriptBindingsValuesProviderTest
[INFO] Tests run: 3, Failures: 0, Errors: 0, Skipped: 0, Time elapsed: 0.562 s - in org.apache.sling.launchpad.webapp.integrationtest.ScriptBindingsValuesProviderTest
[INFO] Running org.apache.sling.launchpad.webapp.integrationtest.ExportedPackagesTest
[INFO] Tests run: 3, Failures: 0, Errors: 0, Skipped: 0, Time elapsed: 0.016 s - in org.apache.sling.launchpad.webapp.integrationtest.ExportedPackagesTest
[INFO] Running org.apache.sling.launchpad.webapp.integrationtest.CreateNodeTest
[INFO] Tests run: 6, Failures: 0, Errors: 0, Skipped: 0, Time elapsed: 0.204 s - in org.apache.sling.launchpad.webapp.integrationtest.CreateNodeTest
[INFO] Running org.apache.sling.launchpad.webapp.integrationtest.crud.CrudTest
[INFO] Tests run: 1, Failures: 0, Errors: 0, Skipped: 0, Time elapsed: 0.193 s - in org.apache.sling.launchpad.webapp.integrationtest.crud.CrudTest
[INFO] Running org.apache.sling.launchpad.webapp.integrationtest.InitialContentTest
[INFO] Tests run: 5, Failures: 0, Errors: 0, Skipped: 0, Time elapsed: 0.04 s - in org.apache.sling.launchpad.webapp.integrationtest.InitialContentTest
[INFO] Running org.apache.sling.launchpad.webapp.integrationtest.PropertyRenderingTest
[INFO] Tests run: 10, Failures: 0, Errors: 0, Skipped: 0, Time elapsed: 0.327 s - in org.apache.sling.launchpad.webapp.integrationtest.PropertyRenderingTest
[INFO] Running org.apache.sling.launchpad.webapp.integrationtest.resourceprovider.PlanetsResourceProviderTest
[INFO] Tests run: 4, Failures: 0, Errors: 0, Skipped: 0, Time elapsed: 0.031 s - in org.apache.sling.launchpad.webapp.integrationtest.resourceprovider.PlanetsResourceProviderTest
[INFO] Running org.apache.sling.launchpad.webapp.integrationtest.UploadFileTest
[INFO] Tests run: 4, Failures: 0, Errors: 0, Skipped: 0, Time elapsed: 0.302 s - in org.apache.sling.launchpad.webapp.integrationtest.UploadFileTest
[INFO] Running org.apache.sling.launchpad.webapp.integrationtest.installer.InstallManyBundlesTest
[INFO] Tests run: 2, Failures: 0, Errors: 0, Skipped: 0, Time elapsed: 13.186 s - in org.apache.sling.launchpad.webapp.integrationtest.installer.InstallManyBundlesTest
[INFO] Running org.apache.sling.launchpad.webapp.integrationtest.installer.ServerSideInstallerTest
[INFO] Tests run: 3, Failures: 0, Errors: 0, Skipped: 0, Time elapsed: 0.596 s - in org.apache.sling.launchpad.webapp.integrationtest.installer.ServerSideInstallerTest
[INFO] Running org.apache.sling.launchpad.webapp.integrationtest.ForwardTest
[INFO] Tests run: 5, Failures: 0, Errors: 0, Skipped: 0, Time elapsed: 2.215 s - in org.apache.sling.launchpad.webapp.integrationtest.ForwardTest
[INFO] Running org.apache.sling.launchpad.webapp.integrationtest.IncludeTest
[INFO] Tests run: 5, Failures: 0, Errors: 0, Skipped: 0, Time elapsed: 2.227 s - in org.apache.sling.launchpad.webapp.integrationtest.IncludeTest
[INFO] Running org.apache.sling.launchpad.webapp.integrationtest.SlingWebDavServletTest
[INFO] Tests run: 2, Failures: 0, Errors: 0, Skipped: 0, Time elapsed: 0.474 s - in org.apache.sling.launchpad.webapp.integrationtest.SlingWebDavServletTest
[INFO] Running org.apache.sling.launchpad.webapp.integrationtest.ServletResolverConfigTest
[INFO] Tests run: 1, Failures: 0, Errors: 0, Skipped: 0, Time elapsed: 0.001 s - in org.apache.sling.launchpad.webapp.integrationtest.ServletResolverConfigTest
[INFO] Running org.apache.sling.launchpad.webapp.integrationtest.DavExDisabledAnonAccessTest
[INFO] Tests run: 2, Failures: 0, Errors: 0, Skipped: 0, Time elapsed: 1.148 s - in org.apache.sling.launchpad.webapp.integrationtest.DavExDisabledAnonAccessTest
[INFO] Running org.apache.sling.launchpad.webapp.integrationtest.VersionInfoServletTest
[INFO] Tests run: 3, Failures: 0, Errors: 0, Skipped: 0, Time elapsed: 3.297 s - in org.apache.sling.launchpad.webapp.integrationtest.VersionInfoServletTest
[INFO] Running org.apache.sling.launchpad.webapp.integrationtest.auth.AuthenticationResponseCodeTest
[INFO] Tests run: 10, Failures: 0, Errors: 0, Skipped: 0, Time elapsed: 0.071 s - in org.apache.sling.launchpad.webapp.integrationtest.auth.AuthenticationResponseCodeTest
[INFO] Running org.apache.sling.launchpad.webapp.integrationtest.WebdavDeleteTest
[INFO] Tests run: 1, Failures: 0, Errors: 0, Skipped: 0, Time elapsed: 0.169 s - in org.apache.sling.launchpad.webapp.integrationtest.WebdavDeleteTest
[INFO] Running org.apache.sling.launchpad.webapp.integrationtest.userManager.UserPrivilegesInfoTest
[INFO] Tests run: 7, Failures: 0, Errors: 0, Skipped: 0, Time elapsed: 2.027 s - in org.apache.sling.launchpad.webapp.integrationtest.userManager.UserPrivilegesInfoTest
[INFO] Running org.apache.sling.launchpad.webapp.integrationtest.userManager.UpdateGroupTest
[INFO] Tests run: 8, Failures: 0, Errors: 0, Skipped: 0, Time elapsed: 1.411 s - in org.apache.sling.launchpad.webapp.integrationtest.userManager.UpdateGroupTest
[INFO] Running org.apache.sling.launchpad.webapp.integrationtest.userManager.CreateUserTest
[INFO] Tests run: 11, Failures: 0, Errors: 0, Skipped: 0, Time elapsed: 0.379 s - in org.apache.sling.launchpad.webapp.integrationtest.userManager.CreateUserTest
[INFO] Running org.apache.sling.launchpad.webapp.integrationtest.userManager.UpdateUserTest
[INFO] Tests run: 12, Failures: 0, Errors: 0, Skipped: 0, Time elapsed: 0.911 s - in org.apache.sling.launchpad.webapp.integrationtest.userManager.UpdateUserTest
[INFO] Running org.apache.sling.launchpad.webapp.integrationtest.userManager.RemoveAuthorizablesTest
[INFO] Tests run: 11, Failures: 0, Errors: 0, Skipped: 0, Time elapsed: 0.918 s - in org.apache.sling.launchpad.webapp.integrationtest.userManager.RemoveAuthorizablesTest
[INFO] Running org.apache.sling.launchpad.webapp.integrationtest.userManager.CreateGroupTest
[INFO] Tests run: 8, Failures: 0, Errors: 0, Skipped: 0, Time elapsed: 0.32 s - in org.apache.sling.launchpad.webapp.integrationtest.userManager.CreateGroupTest
[INFO] Running org.apache.sling.launchpad.webapp.integrationtest.accessManager.GetAclTest
[INFO] Tests run: 7, Failures: 0, Errors: 0, Skipped: 0, Time elapsed: 1.131 s - in org.apache.sling.launchpad.webapp.integrationtest.accessManager.GetAclTest
[INFO] Running org.apache.sling.launchpad.webapp.integrationtest.accessManager.ModifyAceTest
[INFO] Tests run: 20, Failures: 0, Errors: 0, Skipped: 0, Time elapsed: 2.655 s - in org.apache.sling.launchpad.webapp.integrationtest.accessManager.ModifyAceTest
[INFO] Running org.apache.sling.launchpad.webapp.integrationtest.accessManager.RemoveAcesTest
[INFO] Tests run: 4, Failures: 0, Errors: 0, Skipped: 0, Time elapsed: 0.598 s - in org.apache.sling.launchpad.webapp.integrationtest.accessManager.RemoveAcesTest
[INFO] Running org.apache.sling.launchpad.webapp.integrationtest.accessManager.AccessPrivilegesInfoTest
[INFO] Tests run: 7, Failures: 0, Errors: 0, Skipped: 0, Time elapsed: 1.406 s - in org.apache.sling.launchpad.webapp.integrationtest.accessManager.AccessPrivilegesInfoTest
[INFO] Running org.apache.sling.launchpad.webapp.integrationtest.MkdirTest
[INFO] Tests run: 2, Failures: 0, Errors: 0, Skipped: 0, Time elapsed: 0.117 s - in org.apache.sling.launchpad.webapp.integrationtest.MkdirTest
[INFO] Running org.apache.sling.launchpad.webapp.integrationtest.resourceresolver.ResourceResolverApiTest
[INFO] Tests run: 8, Failures: 0, Errors: 0, Skipped: 0, Time elapsed: 1.269 s - in org.apache.sling.launchpad.webapp.integrationtest.resourceresolver.ResourceResolverApiTest
[INFO] Running org.apache.sling.launchpad.webapp.integrationtest.resourceresolver.ResourceResolverGeneralTest
[INFO] Tests run: 62, Failures: 0, Errors: 0, Skipped: 0, Time elapsed: 40.54 s - in org.apache.sling.launchpad.webapp.integrationtest.resourceresolver.ResourceResolverGeneralTest
[INFO] Running org.apache.sling.launchpad.webapp.integrationtest.ImmediateScriptActivationTest
[INFO] Tests run: 2, Failures: 0, Errors: 0, Skipped: 0, Time elapsed: 1.976 s - in org.apache.sling.launchpad.webapp.integrationtest.ImmediateScriptActivationTest
[INFO] Running org.apache.sling.launchpad.webapp.integrationtest.login.AuthRequestLoginTest
[INFO] Tests run: 1, Failures: 0, Errors: 0, Skipped: 0, Time elapsed: 0.022 s - in org.apache.sling.launchpad.webapp.integrationtest.login.AuthRequestLoginTest
[INFO] Running org.apache.sling.launchpad.webapp.integrationtest.login.RedirectOnLoginErrorTest
[INFO] Tests run: 2, Failures: 0, Errors: 0, Skipped: 0, Time elapsed: 0.004 s - in org.apache.sling.launchpad.webapp.integrationtest.login.RedirectOnLoginErrorTest
[INFO] Running org.apache.sling.launchpad.webapp.integrationtest.login.AnonymousAccessTest
[INFO] Tests run: 4, Failures: 0, Errors: 0, Skipped: 0, Time elapsed: 0.143 s - in org.apache.sling.launchpad.webapp.integrationtest.login.AnonymousAccessTest
[INFO] Running org.apache.sling.launchpad.webapp.integrationtest.login.RedirectOnLogoutTest
[INFO] Tests run: 1, Failures: 0, Errors: 0, Skipped: 0, Time elapsed: 0.003 s - in org.apache.sling.launchpad.webapp.integrationtest.login.RedirectOnLogoutTest
[INFO] Running org.apache.sling.launchpad.webapp.integrationtest.JspForwardTest
[INFO] Tests run: 6, Failures: 0, Errors: 0, Skipped: 0, Time elapsed: 2.157 s - in org.apache.sling.launchpad.webapp.integrationtest.JspForwardTest
[INFO] Running org.apache.sling.launchpad.webapp.integrationtest.FileUploadTest
[INFO] Tests run: 1, Failures: 0, Errors: 0, Skipped: 0, Time elapsed: 0.038 s - in org.apache.sling.launchpad.webapp.integrationtest.FileUploadTest
[INFO] Running org.apache.sling.launchpad.webapp.integrationtest.xml.XPathTest
[INFO] Tests run: 1, Failures: 0, Errors: 0, Skipped: 0, Time elapsed: 0.161 s - in org.apache.sling.launchpad.webapp.integrationtest.xml.XPathTest
[INFO] Running org.apache.sling.launchpad.webapp.integrationtest.xml.DomTest
[INFO] Tests run: 1, Failures: 0, Errors: 0, Skipped: 0, Time elapsed: 0.008 s - in org.apache.sling.launchpad.webapp.integrationtest.xml.DomTest
[INFO] Running org.apache.sling.launchpad.webapp.integrationtest.xml.SaxTest
[INFO] Tests run: 1, Failures: 0, Errors: 0, Skipped: 0, Time elapsed: 0 s - in org.apache.sling.launchpad.webapp.integrationtest.xml.SaxTest
[INFO] Running org.apache.sling.launchpad.webapp.integrationtest.EspLoadTest
[INFO] Tests run: 2, Failures: 0, Errors: 0, Skipped: 0, Time elapsed: 0.291 s - in org.apache.sling.launchpad.webapp.integrationtest.EspLoadTest
[INFO] Running org.apache.sling.launchpad.webapp.integrationtest.NodeTypeBasedRenderingTest
[INFO] Tests run: 7, Failures: 0, Errors: 0, Skipped: 0, Time elapsed: 1.155 s - in org.apache.sling.launchpad.webapp.integrationtest.NodeTypeBasedRenderingTest
[INFO] Running org.apache.sling.launchpad.webapp.integrationtest.JspIncludeTest
[INFO] Tests run: 9, Failures: 0, Errors: 0, Skipped: 0, Time elapsed: 7.223 s - in org.apache.sling.launchpad.webapp.integrationtest.JspIncludeTest
[INFO] Running org.apache.sling.launchpad.webapp.integrationtest.ExecuteScriptTest
[INFO] Tests run: 2, Failures: 0, Errors: 0, Skipped: 0, Time elapsed: 0.299 s - in org.apache.sling.launchpad.webapp.integrationtest.ExecuteScriptTest
[INFO] Running org.apache.sling.launchpad.webapp.integrationtest.ResourceSuperTypeTest
[INFO] Tests run: 2, Failures: 0, Errors: 0, Skipped: 0, Time elapsed: 0.47 s - in org.apache.sling.launchpad.webapp.integrationtest.ResourceSuperTypeTest
[INFO] Running org.apache.sling.launchpad.webapp.integrationtest.VersionParameterTest
[INFO] Tests run: 1, Failures: 0, Errors: 0, Skipped: 0, Time elapsed: 1.164 s - in org.apache.sling.launchpad.webapp.integrationtest.VersionParameterTest
[INFO] Running org.apache.sling.launchpad.webapp.integrationtest.LaunchpadConfigInstallerTest
[INFO] Tests run: 1, Failures: 0, Errors: 0, Skipped: 0, Time elapsed: 0.001 s - in org.apache.sling.launchpad.webapp.integrationtest.LaunchpadConfigInstallerTest
[INFO] Running org.apache.sling.launchpad.webapp.integrationtest.ServerSideScriptsTest
[INFO] Tests run: 1, Failures: 0, Errors: 0, Skipped: 0, Time elapsed: 2.409 s - in org.apache.sling.launchpad.webapp.integrationtest.ServerSideScriptsTest
[INFO] Running org.apache.sling.launchpad.webapp.integrationtest.JsonRenderingTest
[INFO] Tests run: 17, Failures: 0, Errors: 0, Skipped: 0, Time elapsed: 0.905 s - in org.apache.sling.launchpad.webapp.integrationtest.JsonRenderingTest
[INFO] Running org.apache.sling.launchpad.webapp.integrationtest.WebDavDoubleSlashTest
[INFO] Tests run: 2, Failures: 0, Errors: 0, Skipped: 0, Time elapsed: 0.068 s - in org.apache.sling.launchpad.webapp.integrationtest.WebDavDoubleSlashTest
[INFO] Running org.apache.sling.launchpad.webapp.integrationtest.RequestAttributeTest
[INFO] Tests run: 1, Failures: 0, Errors: 0, Skipped: 0, Time elapsed: 0.227 s - in org.apache.sling.launchpad.webapp.integrationtest.RequestAttributeTest
[INFO] Running org.apache.sling.launchpad.webapp.integrationtest.ResourceDecoratorTest
[INFO] Tests run: 1, Failures: 0, Errors: 0, Skipped: 0, Time elapsed: 0.065 s - in org.apache.sling.launchpad.webapp.integrationtest.ResourceDecoratorTest
[INFO] Running org.apache.sling.launchpad.webapp.integrationtest.SlingResourceTypeRenderingTest
[INFO] Tests run: 9, Failures: 0, Errors: 0, Skipped: 0, Time elapsed: 1.228 s - in org.apache.sling.launchpad.webapp.integrationtest.SlingResourceTypeRenderingTest
[INFO] Running org.apache.sling.launchpad.webapp.integrationtest.repository.SystemUsersTest
[INFO] Tests run: 2, Failures: 0, Errors: 0, Skipped: 0, Time elapsed: 0.302 s - in org.apache.sling.launchpad.webapp.integrationtest.repository.SystemUsersTest
[INFO] Running org.apache.sling.launchpad.webapp.integrationtest.repository.RepoinitPathTest
[INFO] Tests run: 1, Failures: 0, Errors: 0, Skipped: 0, Time elapsed: 0.071 s - in org.apache.sling.launchpad.webapp.integrationtest.repository.RepoinitPathTest
[INFO] Running org.apache.sling.launchpad.webapp.integrationtest.repository.RepositoryNameTest
[INFO] Tests run: 1, Failures: 0, Errors: 0, Skipped: 0, Time elapsed: 0.022 s - in org.apache.sling.launchpad.webapp.integrationtest.repository.RepositoryNameTest
[INFO] Running org.apache.sling.launchpad.webapp.integrationtest.repository.RepositoryInitializersTest
[INFO] Tests run: 1, Failures: 0, Errors: 0, Skipped: 0, Time elapsed: 0.001 s - in org.apache.sling.launchpad.webapp.integrationtest.repository.RepositoryInitializersTest
[INFO] Running org.apache.sling.launchpad.webapp.integrationtest.GetWithSuffixTest
[INFO] Tests run: 4, Failures: 0, Errors: 0, Skipped: 0, Time elapsed: 0.396 s - in org.apache.sling.launchpad.webapp.integrationtest.GetWithSuffixTest
[INFO] Running org.apache.sling.launchpad.webapp.integrationtest.SyntheticResourceTest
[INFO] Tests run: 1, Failures: 0, Errors: 0, Skipped: 0, Time elapsed: 0.079 s - in org.apache.sling.launchpad.webapp.integrationtest.SyntheticResourceTest
[INFO] Running org.apache.sling.launchpad.webapp.integrationtest.JspScriptingTest
[INFO] Tests run: 7, Failures: 0, Errors: 0, Skipped: 0, Time elapsed: 1.6 s - in org.apache.sling.launchpad.webapp.integrationtest.JspScriptingTest
[INFO] Running org.apache.sling.launchpad.webapp.integrationtest.scripting.htl.HtlTest
[INFO] Tests run: 3, Failures: 0, Errors: 0, Skipped: 0, Time elapsed: 1.293 s - in org.apache.sling.launchpad.webapp.integrationtest.scripting.htl.HtlTest
[INFO] Running org.apache.sling.launchpad.webapp.integrationtest.scripting.SlingJSPTaglibTest
[INFO] Tests run: 1, Failures: 0, Errors: 0, Skipped: 0, Time elapsed: 0.991 s - in org.apache.sling.launchpad.webapp.integrationtest.scripting.SlingJSPTaglibTest
[INFO] Running org.apache.sling.launchpad.webapp.integrationtest.scripting.StandaloneScriptExecutionTest
[INFO] Tests run: 1, Failures: 0, Errors: 0, Skipped: 0, Time elapsed: 0.076 s - in org.apache.sling.launchpad.webapp.integrationtest.scripting.StandaloneScriptExecutionTest
[INFO] Running org.apache.sling.launchpad.webapp.integrationtest.StreamServletTest
[INFO] Tests run: 4, Failures: 0, Errors: 0, Skipped: 0, Time elapsed: 0.307 s - in org.apache.sling.launchpad.webapp.integrationtest.StreamServletTest
[INFO] Running org.apache.sling.launchpad.webapp.integrationtest.GeneratedNodeNameTest
[INFO] Tests run: 6, Failures: 0, Errors: 0, Skipped: 0, Time elapsed: 0.179 s - in org.apache.sling.launchpad.webapp.integrationtest.GeneratedNodeNameTest
[INFO] Running org.apache.sling.launchpad.webapp.integrationtest.BundleContentTest
[INFO] Tests run: 4, Failures: 0, Errors: 0, Skipped: 0, Time elapsed: 0.027 s - in org.apache.sling.launchpad.webapp.integrationtest.BundleContentTest
[INFO] Running org.apache.sling.launchpad.webapp.integrationtest.ValueFromTest
[INFO] Tests run: 3, Failures: 0, Errors: 0, Skipped: 0, Time elapsed: 0.067 s - in org.apache.sling.launchpad.webapp.integrationtest.ValueFromTest
[INFO] 
[INFO] Results:
[INFO] 
[ERROR] Failures: 
[ERROR]   DavExIntegrationTest.testDescriptor:54 expected:<2.0> but was:<null>
[ERROR] Errors: 
[ERROR]   DavExIntegrationTest.testReadNode:75 » ItemNotFound Not Found
[INFO] 
[ERROR] Tests run: 660, Failures: 1, Errors: 1, Skipped: 1
[INFO] 
[INFO] 
[INFO] --- slingstart-maven-plugin:1.7.16:stop (stop-container) @ org.apache.sling.launchpad.testing
---
[INFO] Stopping 1 Launchpad instances
[INFO] Stopping Launchpad '_-41000'
28.07.2019 02:51:49.509 *INFO * [Apache Sling Terminator] Java VM is shutting down
28.07.2019 02:51:49.510 *INFO * [Apache Sling Terminator] Stopping Apache Sling
28.07.2019 02:51:57.307 *INFO * [Sling Notifier] Apache Sling has been stopped
[INFO] 
[INFO] --- ianal-maven-plugin:1.0-alpha-1:verify-legal-files (default) @ org.apache.sling.launchpad.testing
---
WARNING: An illegal reflective access operation has occurred
WARNING: Illegal reflective access by org.codehaus.groovy.reflection.CachedConstructor (file:/home/jenkins/.m2/repository/org/codehaus/groovy/groovy-all-minimal/1.5.6/groovy-all-minimal-1.5.6.jar)
to constructor java.io.File(java.lang.String,java.io.File)
WARNING: Please consider reporting this to the maintainers of org.codehaus.groovy.reflection.CachedConstructor
WARNING: Use --illegal-access=warn to enable warnings of further illegal reflective access
operations
WARNING: All illegal access operations will be denied in a future release
[INFO] Checking legal files in: org.apache.sling.launchpad.testing-12-SNAPSHOT.jar
[INFO] Checking legal files in: org.apache.sling.launchpad.testing-12-SNAPSHOT-sources.jar
[INFO] 
[INFO] --- apache-rat-plugin:0.11:check (default) @ org.apache.sling.launchpad.testing ---
[INFO] 51 implicit excludes (use -debug for more details).
[INFO] Exclude: DEPENDENCIES
[INFO] Exclude: src/main/appended-resources/META-INF/*
[INFO] Exclude: velocity.log
[INFO] Exclude: target/*
[INFO] Exclude: README.md
[INFO] Exclude: maven-eclipse.xml
[INFO] Exclude: .*
[INFO] Exclude: .*/**
[INFO] Exclude: **/*.json
[INFO] Exclude: DEPENDENCIES
[INFO] Exclude: **/*.rej
[INFO] Exclude: hs_err_*.log
[INFO] Exclude: **/repository/index/*/index-details.txt
[INFO] Exclude: bnd.bnd
[INFO] 7 resources included (use -debug for more details)
[INFO] Rat check: Summary of files. Unapproved: 0 unknown: 0 generated: 0 approved: 6 licence.
[INFO] 
[INFO] --- maven-failsafe-plugin:2.21.0:verify (default) @ org.apache.sling.launchpad.testing
---
[INFO] ------------------------------------------------------------------------
[INFO] BUILD FAILURE
[INFO] ------------------------------------------------------------------------
[INFO] Total time:  03:50 min
[INFO] Finished at: 2019-07-28T02:51:59Z
[INFO] ------------------------------------------------------------------------
[INFO] [jenkins-event-spy] Generated /home/jenkins/jenkins-slave/workspace/e-sling-launchpad-testing_master@tmp/withMaven0548979f/maven-spy-20190728-024808-79916782715920584233871.log
[ERROR] Failed to execute goal org.apache.maven.plugins:maven-failsafe-plugin:2.21.0:verify
(default) on project org.apache.sling.launchpad.testing: There are test failures.
[ERROR] 
[ERROR] Please refer to /home/jenkins/jenkins-slave/workspace/e-sling-launchpad-testing_master/target/failsafe-reports
for the individual test results.
[ERROR] Please refer to dump files (if any exist) [date]-jvmRun[N].dump, [date].dumpstream
and [date]-jvmRun[N].dumpstream.
[ERROR] -> [Help 1]
[ERROR] 
[ERROR] To see the full stack trace of the errors, re-run Maven with the -e switch.
[ERROR] Re-run Maven using the -X switch to enable full debug logging.
[ERROR] 
[ERROR] For more information about the errors and possible solutions, please read the following
articles:
[ERROR] [Help 1] http://cwiki.apache.org/confluence/display/MAVEN/MojoFailureException
[Pipeline] }
[withMaven] Publishers: Pipeline Graph Publisher: 2 ms, JGiven Publisher: 1 ms
[Pipeline] // withMaven
[Pipeline] }
[Pipeline] // stage
[Pipeline] }
[Pipeline] // timeout
[Pipeline] stage
[Pipeline] { (Notifications)
[Pipeline] echo
Status change is BROKEN, notifications will be sent.
[Pipeline] emailext
Mime
  • Unnamed multipart/mixed (inline, None, 0 bytes)
View raw message