sling-dev mailing list archives

Site index · List index
Message view « Date » · « Thread »
Top « Date » · « Thread »
From Apache Jenkins Server <jenk...@builds.apache.org>
Subject [Jenkins] Sling » sling-org-apache-sling-launchpad-testing » master #130 is BROKEN
Date Sun, 05 May 2019 02:47:27 GMT
Please see https://builds.apache.org/job/Sling/job/sling-org-apache-sling-launchpad-testing/job/master/130/
for details.

No further emails will be sent until the status of the build is changed.
Build log follows below:

[...truncated 1841 lines...]
[ERROR]   SlingResourceTypeRenderingTest.testEspHtml:38->RenderingTestBase.uploadTestScript:32->HttpTestBase.uploadTestScript:489
Test file not found:/integration-test/rendering-test.esp
[ERROR]   SlingResourceTypeRenderingTest.testEspHtmlInAppsFolder:70->HttpTestBase.uploadTestScript:489
Test file not found:/integration-test/rendering-test.esp
[ERROR]   SlingResourceTypeRenderingTest.testEspHtmlWithSelectors:103->RenderingTestBase.uploadTestScript:32->HttpTestBase.uploadTestScript:489
Test file not found:/integration-test/rendering-test.esp
[ERROR]   SlingResourceTypeRenderingTest.testEspJavaCode:50->RenderingTestBase.uploadTestScript:32->HttpTestBase.uploadTestScript:489
Test file not found:/integration-test/rendering-test.esp
[ERROR]   SlingResourceTypeRenderingTest.testEspJs:154->RenderingTestBase.uploadTestScript:32->HttpTestBase.uploadTestScript:489
Test file not found:/integration-test/rendering-test.esp
[ERROR]   SlingResourceTypeRenderingTest.testEspPlain:177->RenderingTestBase.uploadTestScript:32->HttpTestBase.uploadTestScript:489
Test file not found:/integration-test/rendering-test.esp
[ERROR]   SlingResourceTypeRenderingTest.testEspXml:166->RenderingTestBase.uploadTestScript:32->HttpTestBase.uploadTestScript:489
Test file not found:/integration-test/rendering-test.esp
[ERROR]   StreamServletTest.testHtmlFile:47->runTest:32->RenderingTestBase.uploadTestScript:32->HttpTestBase.uploadTestScript:489
Test file not found:/integration-test/testfile.html
[ERROR]   StreamServletTest.testJavascriptFile:51->runTest:32->RenderingTestBase.uploadTestScript:32->HttpTestBase.uploadTestScript:489
Test file not found:/integration-test/testfile.js
[ERROR]   StreamServletTest.testJsonFile:55->runTest:32->RenderingTestBase.uploadTestScript:32->HttpTestBase.uploadTestScript:489
Test file not found:/integration-test/testfile.json
[ERROR]   StreamServletTest.testPlainTextFile:43->runTest:32->RenderingTestBase.uploadTestScript:32->HttpTestBase.uploadTestScript:489
Test file not found:/integration-test/testfile.txt
[ERROR]   WebdavUploadTest.testPngUpload:111->uploadAndCheck:83 Local resource not found:
/integration-test/sling-logo.png
[ERROR]   WebdavUploadTest.testTextUpload:99->uploadAndCheck:83 Local resource not found:
/integration-test/testfile.txt
[ERROR]   WebdavUploadTest.testXmlUpload:103->uploadAndCheck:83 Local resource not found:
/integration-test/testfile.xml
[ERROR]   WebdavUploadTest.testZipUpload:107->uploadAndCheck:83 Local resource not found:
/integration-test/testfile.zip
[ERROR]   AccessPrivilegesInfoTest.setup:63 Test file not found:/integration-test/accessmanager/privileges-info.json.esp
[ERROR]   AccessPrivilegesInfoTest.setup:63 Test file not found:/integration-test/accessmanager/privileges-info.json.esp
[ERROR]   AccessPrivilegesInfoTest.setup:63 Test file not found:/integration-test/accessmanager/privileges-info.json.esp
[ERROR]   AccessPrivilegesInfoTest.setup:63 Test file not found:/integration-test/accessmanager/privileges-info.json.esp
[ERROR]   AccessPrivilegesInfoTest.setup:63 Test file not found:/integration-test/accessmanager/privileges-info.json.esp
[ERROR]   AccessPrivilegesInfoTest.setup:63 Test file not found:/integration-test/accessmanager/privileges-info.json.esp
[ERROR]   AccessPrivilegesInfoTest.setup:63 Test file not found:/integration-test/accessmanager/privileges-info.json.esp
[ERROR]   CrudTest.testCreate:55->RenderingTestBase.uploadTestScript:32->HttpTestBase.uploadTestScript:489
Test file not found:/integration-test/crud/crud-test.jsp
[ERROR]   SLING2094Test.setUp:38->RenderingTestBase.uploadTestScript:32->HttpTestBase.uploadTestScript:489
Test file not found:/integration-test/issues/sling2094/custom-error-page.jsp
[ERROR]   SLING2094Test.setUp:38->RenderingTestBase.uploadTestScript:32->HttpTestBase.uploadTestScript:489
Test file not found:/integration-test/issues/sling2094/custom-error-page.jsp
[ERROR]   SLING2617Test.testDateBeanProperties:39->HttpTestBase.uploadTestScript:489 Test
file not found:/integration-test/issues/sling2617/bean-set-get.jsp
[ERROR]   SLING457Test.setUp:65->HttpTestBase.uploadTestScript:489 Test file not found:/integration-test/issues/sling457/a-foo.html.jsp
[ERROR]   SLING457Test.setUp:65->HttpTestBase.uploadTestScript:489 Test file not found:/integration-test/issues/sling457/a-foo.html.jsp
[ERROR]   SLING760Test.testEscapedErrorMessages:38->HttpTestBase.uploadTestScript:489 Test
file not found:/integration-test/issues/sling760/throw-with-markup.esp
[ERROR]   StandaloneScriptExecutionTest.testScriptExecution:29->HttpTestBase.uploadTestScript:489
Test file not found:/integration-test/standalone-test.ecma
[ERROR]   PostServletCreateTest.testCreatingNodeUnderFile:235 Local test file /integration-test/testfile.txt
must be found
[ERROR]   ErrorHandlingTest.setUp:60->RenderingTestBase.uploadTestScript:32->HttpTestBase.uploadTestScript:489
Test file not found:/integration-test/servlets/errorhandler/404.jsp
[ERROR]   ErrorHandlingTest.setUp:60->RenderingTestBase.uploadTestScript:32->HttpTestBase.uploadTestScript:489
Test file not found:/integration-test/servlets/errorhandler/404.jsp
[ERROR]   ErrorHandlingTest.setUp:60->RenderingTestBase.uploadTestScript:32->HttpTestBase.uploadTestScript:489
Test file not found:/integration-test/servlets/errorhandler/404.jsp
[ERROR]   ErrorHandlingTest.setUp:60->RenderingTestBase.uploadTestScript:32->HttpTestBase.uploadTestScript:489
Test file not found:/integration-test/servlets/errorhandler/404.jsp
[ERROR]   ErrorHandlingTest.setUp:60->RenderingTestBase.uploadTestScript:32->HttpTestBase.uploadTestScript:489
Test file not found:/integration-test/servlets/errorhandler/404.jsp
[ERROR]   ErrorHandlingTest.setUp:60->RenderingTestBase.uploadTestScript:32->HttpTestBase.uploadTestScript:489
Test file not found:/integration-test/servlets/errorhandler/404.jsp
[ERROR]   ErrorHandlingTest.setUp:60->RenderingTestBase.uploadTestScript:32->HttpTestBase.uploadTestScript:489
Test file not found:/integration-test/servlets/errorhandler/404.jsp
[ERROR]   ErrorHandlingTest.setUp:60->RenderingTestBase.uploadTestScript:32->HttpTestBase.uploadTestScript:489
Test file not found:/integration-test/servlets/errorhandler/404.jsp
[ERROR]   ErrorHandlingTest.setUp:60->RenderingTestBase.uploadTestScript:32->HttpTestBase.uploadTestScript:489
Test file not found:/integration-test/servlets/errorhandler/404.jsp
[ERROR]   ErrorHandlingTest.setUp:60->RenderingTestBase.uploadTestScript:32->HttpTestBase.uploadTestScript:489
Test file not found:/integration-test/servlets/errorhandler/404.jsp
[ERROR]   UserPrivilegesInfoTest.setup:58 Test file not found:/integration-test/usermanager/privileges-info.json.esp
[ERROR]   UserPrivilegesInfoTest.setup:58 Test file not found:/integration-test/usermanager/privileges-info.json.esp
[ERROR]   UserPrivilegesInfoTest.setup:58 Test file not found:/integration-test/usermanager/privileges-info.json.esp
[ERROR]   UserPrivilegesInfoTest.setup:58 Test file not found:/integration-test/usermanager/privileges-info.json.esp
[ERROR]   UserPrivilegesInfoTest.setup:58 Test file not found:/integration-test/usermanager/privileges-info.json.esp
[ERROR]   UserPrivilegesInfoTest.setup:58 Test file not found:/integration-test/usermanager/privileges-info.json.esp
[ERROR]   UserPrivilegesInfoTest.setup:58 Test file not found:/integration-test/usermanager/privileges-info.json.esp
[ERROR] Errors: 
[ERROR]   BundleContentTest.testBundleContentParentFromMultipleBundles:51 NoClassDefFound
[ERROR] org.apache.sling.launchpad.webapp.integrationtest.EventsCounterTest.org.apache.sling.launchpad.webapp.integrationtest.EventsCounterTest
[ERROR]   Run 1: EventsCounterTest.setupClass:46 NoClassDefFound org/apache/sling/launchpad/web...
[ERROR]   Run 2: EventsCounterTest.cleanup:53 » IllegalArgument host parameter is null
[INFO] 
[ERROR]   MappingEventsProxyTest.runWriteableResourcesTest:26 NoClassDefFound org/apache...
[ERROR]   PropertyRenderingTest.testMultiValuedTextJson:95 NoClassDefFound org/apache/sl...
[ERROR]   PropertyRenderingTest.testTextJson:74 NoClassDefFound org/apache/sling/launchp...
[ERROR]   RedirectTest.testRedirectJson:206 NoClassDefFound org/apache/sling/launchpad/w...
[ERROR]   RedirectTest.testRedirectJson2:230 NoClassDefFound org/apache/sling/launchpad/...
[ERROR]   ServerSideScriptsTest.initializationError » NoClassDefFound org/apache/sling/l...
[ERROR]   ServletResolverConfigTest.testCacheDisabled:33 NoClassDefFound org/apache/slin...
[ERROR]   VanityPathTest.setUp:56->resetMappingEventCount:60 NoClassDefFound org/apache/...
[ERROR]   VanityPathTest.setUp:56->resetMappingEventCount:60 NoClassDefFound org/apache/...
[ERROR]   VanityPathTest.setUp:56->resetMappingEventCount:60 NoClassDefFound org/apache/...
[ERROR]   VanityPathTest.setUp:56->resetMappingEventCount:60 NoClassDefFound org/apache/...
[ERROR]   VanityPathTest.setUp:56->resetMappingEventCount:60 NoClassDefFound org/apache/...
[ERROR]   VersionInfoServletTest.testHarrayVersionsList:86 NoClassDefFound org/apache/sl...
[ERROR]   VersionInfoServletTest.testStandardVersionsList:67 NoClassDefFound org/apache/...
[ERROR]   VersionParameterTest.testVersionParameter:70->createVersionableNode:64->getProp:87
NoClassDefFound
[ERROR]   WriteableResourcesProxyTest.runWriteableResourcesTest:26 NoClassDefFound org/a...
[ERROR]   GetAclTest.testEffectiveAclForUser:118 NoClassDefFound org/apache/sling/launch...
[ERROR]   GetAclTest.testEffectiveAclMergeForUser_FewerPrivilegesGrantedOnChild:248 NoClassDefFound
[ERROR]   GetAclTest.testEffectiveAclMergeForUser_MorePrivilegesGrantedOnChild:303 NoClassDefFound
[ERROR]   GetAclTest.testEffectiveAclMergeForUser_ReplacePrivilegeOnChild:193 NoClassDefFound
[ERROR]   GetAclTest.testEffectiveAclMergeForUser_SubsetOfPrivilegesDeniedOnChild2:358 NoClassDefFound
[ERROR]   GetAclTest.testEffectiveAclMergeForUser_SupersetOfPrivilegesDeniedOnChild:431 NoClassDefFound
[ERROR]   GetAclTest.testEffectiveAclMergeForUser_SupersetOfPrivilegesDeniedOnChild2:486 NoClassDefFound
[ERROR]   ModifyAceTest.testAddAceOrderByAfter:718->createAceOrderTestFolderWithOneAce:861
NoClassDefFound
[ERROR]   ModifyAceTest.testAddAceOrderByBefore:683->createAceOrderTestFolderWithOneAce:861
NoClassDefFound
[ERROR]   ModifyAceTest.testAddAceOrderByFirst:618->createAceOrderTestFolderWithOneAce:861
NoClassDefFound
[ERROR]   ModifyAceTest.testAddAceOrderByLast:650->createAceOrderTestFolderWithOneAce:861
NoClassDefFound
[ERROR]   ModifyAceTest.testAddAceOrderByNumeric:751->createAceOrderTestFolderWithOneAce:861
NoClassDefFound
[ERROR]   ModifyAceTest.testAddAceWithRestriction:1083->createAceOrderTestFolderWithOneAce:861
NoClassDefFound
[ERROR]   ModifyAceTest.testMergeAceForUser:239 NoClassDefFound org/apache/sling/launchp...
[ERROR]   ModifyAceTest.testMergeAceForUserCombineAggregatePrivilege:450 NoClassDefFound
[ERROR]   ModifyAceTest.testMergeAceForUserDenyPrivilegeAfterGrantPrivilege:547 NoClassDefFound
[ERROR]   ModifyAceTest.testMergeAceForUserGrantAggregatePrivilegePartsAfterDenyAggregatePrivilege:1052
NoClassDefFound
[ERROR]   ModifyAceTest.testMergeAceForUserGrantNestedAggregatePrivilegeAfterDenySuperAggregatePrivilege:981
NoClassDefFound
[ERROR]   ModifyAceTest.testMergeAceForUserSplitAggregatePrincipal:349 NoClassDefFound o...
[ERROR]   ModifyAceTest.testModifyAceForGroup:189 NoClassDefFound org/apache/sling/launc...
[ERROR]   ModifyAceTest.testModifyAceForUser:122 NoClassDefFound org/apache/sling/launch...
[ERROR]   ModifyAceTest.testModifyAceResponseAsJSON:936 NoClassDefFound org/apache/sling...
[ERROR]   ModifyAceTest.testUpdateAcePreservePosition:812->createAceOrderTestFolderWithOneAce:861
NoClassDefFound
[ERROR]   ModifyAceTest.testUpdateAceToMergeNewRestriction:1140->createAceOrderTestFolderWithOneAce:861
NoClassDefFound
[ERROR]   ModifyAceTest.testUpdateAceToRemoveRestriction:1217->createAceOrderTestFolderWithOneAce:861
NoClassDefFound
[ERROR]   ModifyAceTest.testUpdateAceToRemoveRestrictionWithConflict:1286->createAceOrderTestFolderWithOneAce:861
NoClassDefFound
[ERROR]   RemoveAcesTest.testRemoveAce:143->createFolderWithAces:100 NoClassDefFound org...
[ERROR]   RemoveAcesTest.testRemoveAceCustomPostResponse:167->createFolderWithAces:100
NoClassDefFound
[ERROR]   RemoveAcesTest.testRemoveAces:182->createFolderWithAces:100 NoClassDefFound or...
[ERROR]   RemoveAcesTest.testRemoveAcesResponseAsJSON:207->createFolderWithAces:100 NoClassDefFound
[ERROR]   InstallManyBundlesTest.installAndUpgradeBundleManyTimes:154->installAndCheckBundle:144->assertActiveBundle:99
NoClassDefFound
[ERROR]   InstallManyBundlesTest.installManyBundles:174->installAndCheckBundle:144->assertActiveBundle:99
NoClassDefFound
[ERROR]   ServerSideInstallerTest.org.apache.sling.launchpad.webapp.integrationtest.installer.ServerSideInstallerTest
» Runtime
[ERROR]   EmbeddedModelTest.org.apache.sling.launchpad.webapp.integrationtest.provisioning.EmbeddedModelTest
» Runtime
[ERROR]   RepoinitPathTest.org.apache.sling.launchpad.webapp.integrationtest.repository.RepoinitPathTest
» Runtime
[ERROR]   RepositoryNameTest.checkOakName:45 NoClassDefFound org/apache/sling/launchpad/...
[ERROR]   SystemUsersTest.org.apache.sling.launchpad.webapp.integrationtest.repository.SystemUsersTest
» Runtime
[ERROR]   ResourceResolverApiTest.org.apache.sling.launchpad.webapp.integrationtest.resourceresolver.ResourceResolverApiTest
» Runtime
[ERROR]   ResourceResolverGeneralTest.org.apache.sling.launchpad.webapp.integrationtest.resourceresolver.ResourceResolverGeneralTest
» Runtime
[ERROR]   SlingJSPTaglibTest.setUp:45 NoClassDefFound org/apache/sling/launchpad/webapp/...
[ERROR]   HtlTest.testScriptWithJavaUseBean:49 » IllegalArgument The content cannot be n...
[ERROR]   HtlTest.testScriptWithJsUseBean:34 » IllegalArgument The content cannot be nul...
[ERROR]   HtlTest.testScriptWithModelUseBean:64 » IllegalArgument The content cannot be ...
[ERROR]   PostServletAtDeleteTest.testDeleteOnly:63 NoClassDefFound org/apache/sling/lau...
[ERROR]   PostServletAtDeleteTest.testDeleteWithModify:85 NoClassDefFound org/apache/sli...
[ERROR]   PostServletCopyTest.testCopyNodeMultipleSourceReplace:415 NoClassDefFound org/...
[ERROR]   PostServletImportTest.testImportAutoCheckoutNodes:300->getTestFile:91 NullPointer
[ERROR]   PostServletImportTest.testImportCheckinNodes:242->getTestFile:91 NullPointer
[ERROR]   PostServletImportTest.testImportJCRXMLFromFile:679->getTestFile:91 NullPointer
[ERROR]   PostServletImportTest.testImportJSONFromFile:374->getTestFile:91 NullPointer
[ERROR]   PostServletImportTest.testImportJSONFromFileWithoutOptionalName:404->getTestFile:91
NullPointer
[ERROR]   PostServletImportTest.testImportJSONFromRequestParam:439->getStreamAsString:69
NullPointer
[ERROR]   PostServletImportTest.testImportJSONFromRequestParamWithoutOptionalName:469->getStreamAsString:69
NullPointer
[ERROR]   PostServletImportTest.testImportJSONWithUTF8Content:801->getStreamAsString:76
» NullPointer
[ERROR]   PostServletImportTest.testImportJarFromFile:649->getTestFile:91 NullPointer
[ERROR]   PostServletImportTest.testImportNodeWithAlreadyUsedExactName:774->importNodeWithExactName:710->getStreamAsString:69
NullPointer
[ERROR]   PostServletImportTest.testImportNodeWithExactName:742->importNodeWithExactName:710->getStreamAsString:69
NullPointer
[ERROR]   PostServletImportTest.testImportNodeWithInvalidExactName:758->getStreamAsString:69
NullPointer
[ERROR]   PostServletImportTest.testImportReplace:146->getTestFile:91 NullPointer
[ERROR]   PostServletImportTest.testImportReplaceProperties:185->getStreamAsString:69 NullPointer
[ERROR]   PostServletImportTest.testImportXMLFromFile:501->getTestFile:91 NullPointer
[ERROR]   PostServletImportTest.testImportXMLFromFileWithoutOptionalName:528->getTestFile:91
NullPointer
[ERROR]   PostServletImportTest.testImportXMLFromRequestParam:560->getStreamAsString:69
NullPointer
[ERROR]   PostServletImportTest.testImportXMLFromRequestParamWithoutOptionalName:587->getStreamAsString:69
NullPointer
[ERROR]   PostServletImportTest.testImportZipFromFile:620->getTestFile:91 NullPointer
[ERROR]   PostServletMoveTest.testMoveNodeMultipleSourceReplace:444 NoClassDefFound org/...
[ERROR]   PostServletOrderTest.testOrderAfter:112->verifyOrder:197 NoClassDefFound org/a...
[ERROR]   PostServletOrderTest.testOrderBefore:98->verifyOrder:197 NoClassDefFound org/a...
[ERROR]   PostServletOrderTest.testOrderFirst:70->verifyOrder:197 NoClassDefFound org/ap...
[ERROR]   PostServletOrderTest.testOrderIntOOB:168->verifyOrder:197 NoClassDefFound org/...
[ERROR]   PostServletOrderTest.testOrderIntToBack:126->verifyOrder:197 NoClassDefFound
o...
[ERROR]   PostServletOrderTest.testOrderIntToFront:140->verifyOrder:197 NoClassDefFound
...
[ERROR]   PostServletOrderTest.testOrderIntZero:154->verifyOrder:197 NoClassDefFound org...
[ERROR]   PostServletOrderTest.testOrderLast:84->verifyOrder:197 NoClassDefFound org/apa...
[ERROR]   PostServletOrderTest.testStandardOrder:56->verifyOrder:197 NoClassDefFound org...
[ERROR]   PostServletUpdateTest.testMixinTypes:147 NoClassDefFound org/apache/sling/laun...
[ERROR]   PostServletUpdateTest.testUpdatingNodetype:186 NoClassDefFound org/apache/slin...
[ERROR]   ReferenceTypeHintTest.testReferenceTypesCreatedFromPath:108->verifyReferences:115->getPropertyArray:146
NoClassDefFound
[ERROR]   ReferenceTypeHintTest.testReferenceTypesCreatedFromUuids:90->verifyReferences:115->getPropertyArray:146
NoClassDefFound
[ERROR]   HtmlDefaultServletTest.testHtmlExtension:78 NoClassDefFound org/apache/sling/l...
[ERROR]   HtmlDefaultServletTest.testJsonExtension:93 NoClassDefFound org/apache/sling/l...
[ERROR]   BasicTeleporterTest.org.apache.sling.launchpad.webapp.integrationtest.teleporter.BasicTeleporterTest
» Runtime
[ERROR]   EmbeddedDependenciesTeleporterTest.org.apache.sling.launchpad.webapp.integrationtest.teleporter.EmbeddedDependenciesTeleporterTest
» Runtime
[ERROR]   LdapFilterTeleporterTest.org.apache.sling.launchpad.webapp.integrationtest.teleporter.LdapFilterTeleporterTest
» Runtime
[ERROR]   LocalServiceTeleporterTest.org.apache.sling.launchpad.webapp.integrationtest.teleporter.LocalServiceTeleporterTest
» Runtime
[ERROR]   MultipleRulesTeleporterTest.initializationError » NoClassDefFound Lorg/apache/...
[ERROR]   ServicesPresentTest.org.apache.sling.launchpad.webapp.integrationtest.teleporter.ServicesPresentTest
» Runtime
[ERROR]   TeleportedResourcesFolderTest.org.apache.sling.launchpad.webapp.integrationtest.teleporter.TeleportedResourcesFolderTest
» Runtime
[ERROR]   TeleportedResourcesSingleTest.org.apache.sling.launchpad.webapp.integrationtest.teleporter.TeleportedResourcesSingleTest
» Runtime
[ERROR]   TeleporterOptionsTest.testOptions:46 » Runtime Unable to instantiate org.apach...
[ERROR]   CreateGroupTest.testAuthorizedCreateGroup:117 NoClassDefFound org/apache/sling...
[ERROR]   CreateGroupTest.testCreateGroup:82 NoClassDefFound org/apache/sling/launchpad/...
[ERROR]   CreateGroupTest.testCreateGroupResponseAsJSON:194 NoClassDefFound org/apache/s...
[ERROR]   CreateGroupTest.testCreateGroupWithExtraProperties:173 NoClassDefFound org/apa...
[ERROR]   CreateUserTest.testAuthorizedCreateUser:151 NoClassDefFound org/apache/sling/l...
[ERROR]   CreateUserTest.testCreateUser:98 NoClassDefFound org/apache/sling/launchpad/we...
[ERROR]   CreateUserTest.testCreateUserResponseAsJSON:292 NoClassDefFound org/apache/sli...
[ERROR]   CreateUserTest.testCreateUserWithExtraProperties:247 NoClassDefFound org/apach...
[ERROR]   RemoveAuthorizablesTest.testRemoveAuthorizablesResponseAsJSON:263 NoClassDefFound
[ERROR]   UpdateGroupTest.testAuthorizedUpdateGroup:129 NoClassDefFound org/apache/sling...
[ERROR]   UpdateGroupTest.testAuthorizedUpdateGroupMembers:248->getTestGroupMembers:297
NoClassDefFound
[ERROR]   UpdateGroupTest.testNotAuthorizedUpdateGroupMembers:203->getTestGroupMembers:297
NoClassDefFound
[ERROR]   UpdateGroupTest.testUpdateGroup:87 NoClassDefFound org/apache/sling/launchpad/...
[ERROR]   UpdateGroupTest.testUpdateGroupMembers:158->getTestGroupMembers:297 NoClassDefFound
[ERROR]   UpdateGroupTest.testUpdateGroupResponseAsJSON:318 NoClassDefFound org/apache/s...
[ERROR]   UpdateUserTest.testAuthorizedUpdateUser:212 NoClassDefFound org/apache/sling/l...
[ERROR]   UpdateUserTest.testUpdateUser:94 NoClassDefFound org/apache/sling/launchpad/we...
[ERROR]   UpdateUserTest.testUpdateUserDeleteProperties:129 NoClassDefFound org/apache/s...
[ERROR]   UpdateUserTest.testUpdateUserResponseAsJSON:327 NoClassDefFound org/apache/sli...
[INFO] 
[ERROR] Tests run: 580, Failures: 114, Errors: 127, Skipped: 1
[INFO] 
[INFO] 
[INFO] --- slingstart-maven-plugin:1.7.16:stop (stop-container) @ org.apache.sling.launchpad.testing
---
[INFO] Stopping 1 Launchpad instances
[INFO] Stopping Launchpad '_-41000'
05.05.2019 02:46:07.345 *INFO * [Apache Sling Terminator] Java VM is shutting down
05.05.2019 02:46:07.346 *INFO * [Apache Sling Terminator] Stopping Apache Sling
05.05.2019 02:46:09.672 *INFO * [Sling Notifier] Apache Sling has been stopped
[INFO] 
[INFO] --- ianal-maven-plugin:1.0-alpha-1:verify-legal-files (default) @ org.apache.sling.launchpad.testing
---
[INFO] Checking legal files in: org.apache.sling.launchpad.testing-12-SNAPSHOT.jar
[INFO] Checking legal files in: org.apache.sling.launchpad.testing-12-SNAPSHOT-sources.jar
[INFO] 
[INFO] --- apache-rat-plugin:0.11:check (default) @ org.apache.sling.launchpad.testing ---
[INFO] 51 implicit excludes (use -debug for more details).
[INFO] Exclude: DEPENDENCIES
[INFO] Exclude: src/main/appended-resources/META-INF/*
[INFO] Exclude: velocity.log
[INFO] Exclude: target/*
[INFO] Exclude: README.md
[INFO] Exclude: maven-eclipse.xml
[INFO] Exclude: .*
[INFO] Exclude: .*/**
[INFO] Exclude: **/*.json
[INFO] Exclude: DEPENDENCIES
[INFO] Exclude: **/*.rej
[INFO] Exclude: hs_err_*.log
[INFO] Exclude: **/repository/index/*/index-details.txt
[INFO] Exclude: bnd.bnd
[INFO] 7 resources included (use -debug for more details)
[INFO] Rat check: Summary of files. Unapproved: 0 unknown: 0 generated: 0 approved: 6 licence.
[INFO] 
[INFO] --- maven-failsafe-plugin:2.21.0:verify (default) @ org.apache.sling.launchpad.testing
---
[INFO] ------------------------------------------------------------------------
[INFO] BUILD FAILURE
[INFO] ------------------------------------------------------------------------
[INFO] Total time:  03:57 min
[INFO] Finished at: 2019-05-05T02:46:11Z
[INFO] ------------------------------------------------------------------------
[INFO] [jenkins-event-spy] Generated /home/jenkins/jenkins-slave/workspace/e-sling-launchpad-testing_master@tmp/withMaven2d4e020b/maven-spy-20190505-024213-3861312863589379416951.log
[ERROR] Failed to execute goal org.apache.maven.plugins:maven-failsafe-plugin:2.21.0:verify
(default) on project org.apache.sling.launchpad.testing: There are test failures.
[ERROR] 
[ERROR] Please refer to /home/jenkins/jenkins-slave/workspace/e-sling-launchpad-testing_master/target/failsafe-reports
for the individual test results.
[ERROR] Please refer to dump files (if any exist) [date]-jvmRun[N].dump, [date].dumpstream
and [date]-jvmRun[N].dumpstream.
[ERROR] -> [Help 1]
[ERROR] 
[ERROR] To see the full stack trace of the errors, re-run Maven with the -e switch.
[ERROR] Re-run Maven using the -X switch to enable full debug logging.
[ERROR] 
[ERROR] For more information about the errors and possible solutions, please read the following
articles:
[ERROR] [Help 1] http://cwiki.apache.org/confluence/display/MAVEN/MojoFailureException
[Pipeline] }
[withMaven] junitPublisher - Archive test results for Maven artifact org.apache.sling:org.apache.sling.launchpad.testing:slingstart:12-SNAPSHOT
generated by maven-surefire-plugin:test (default-test): target/surefire-reports/*.xml
Recording test results
None of the test reports contained any result
[withMaven] junitPublisher - Archive test results for Maven artifact org.apache.sling:org.apache.sling.launchpad.testing:slingstart:12-SNAPSHOT
generated by maven-failsafe-plugin:integration-test (default): target/failsafe-reports/*.xml
Recording test results
[withMaven] Publishers: Pipeline Graph Publisher: 8 ms, Generated Artifacts Publisher: 595
ms, Junit Publisher: 68796 ms, Dependencies Fingerprint Publisher: 2390 ms, JGiven Publisher:
2 ms, Open Task Scanner Publisher: 155 ms
[Pipeline] // withMaven
[Pipeline] }
[Pipeline] // stage
[Pipeline] }
[Pipeline] // timeout
[Pipeline] stage
[Pipeline] { (Notifications)
[Pipeline] echo
Status change is BROKEN, notifications will be sent.
[Pipeline] emailext
Mime
  • Unnamed multipart/mixed (inline, None, 0 bytes)
View raw message