sling-dev mailing list archives

Site index · List index
Message view « Date » · « Thread »
Top « Date » · « Thread »
From Apache Jenkins Server <jenk...@builds.apache.org>
Subject [Jenkins] Sling » sling-org-apache-sling-launchpad-testing » master #23 is BROKEN
Date Thu, 21 Feb 2019 14:55:01 GMT
Please see https://builds.apache.org/job/Sling/job/sling-org-apache-sling-launchpad-testing/job/master/23/
for details.

No further emails will be sent until the status of the build is changed.
Build log follows below:

[...truncated 35433 lines...]
[ERROR]   PostServletVersionableTest.setUp:42->HttpTestBase.setUp:184->HttpTestBase.waitForSlingStartup:221
Sling services not available. Already checked in earlier tests.
[ERROR]   PostServletVersionableTest.setUp:42->HttpTestBase.setUp:184->HttpTestBase.waitForSlingStartup:221
Sling services not available. Already checked in earlier tests.
[ERROR]   PostServletVersionableTest.setUp:42->HttpTestBase.setUp:184->HttpTestBase.waitForSlingStartup:221
Sling services not available. Already checked in earlier tests.
[ERROR]   PostServletVersionableTest.setUp:42->HttpTestBase.setUp:184->HttpTestBase.waitForSlingStartup:221
Sling services not available. Already checked in earlier tests.
[ERROR]   PostServletVersionableTest.setUp:42->HttpTestBase.setUp:184->HttpTestBase.waitForSlingStartup:221
Sling services not available. Already checked in earlier tests.
[ERROR]   PostServletVersionableTest.setUp:42->HttpTestBase.setUp:184->HttpTestBase.waitForSlingStartup:221
Sling services not available. Already checked in earlier tests.
[ERROR]   PostServletVersionableTest.setUp:42->HttpTestBase.setUp:184->HttpTestBase.waitForSlingStartup:221
Sling services not available. Already checked in earlier tests.
[ERROR]   PostServletVersionableTest.setUp:42->HttpTestBase.setUp:184->HttpTestBase.waitForSlingStartup:221
Sling services not available. Already checked in earlier tests.
[ERROR]   PostServletVersionableTest.setUp:42->HttpTestBase.setUp:184->HttpTestBase.waitForSlingStartup:221
Sling services not available. Already checked in earlier tests.
[ERROR]   PostServletVersionableTest.setUp:42->HttpTestBase.setUp:184->HttpTestBase.waitForSlingStartup:221
Sling services not available. Already checked in earlier tests.
[ERROR]   PostServletVersionableTest.setUp:42->HttpTestBase.setUp:184->HttpTestBase.waitForSlingStartup:221
Sling services not available. Already checked in earlier tests.
[ERROR]   PostServletVersionableTest.setUp:42->HttpTestBase.setUp:184->HttpTestBase.waitForSlingStartup:221
Sling services not available. Already checked in earlier tests.
[ERROR]   PostStatusTest>HttpTestBase.setUp:184->HttpTestBase.waitForSlingStartup:221
Sling services not available. Already checked in earlier tests.
[ERROR]   PostStatusTest>HttpTestBase.setUp:184->HttpTestBase.waitForSlingStartup:221
Sling services not available. Already checked in earlier tests.
[ERROR]   PostStatusTest>HttpTestBase.setUp:184->HttpTestBase.waitForSlingStartup:221
Sling services not available. Already checked in earlier tests.
[ERROR]   PostStatusTest>HttpTestBase.setUp:184->HttpTestBase.waitForSlingStartup:221
Sling services not available. Already checked in earlier tests.
[ERROR]   PostToRootTest>HttpTestBase.setUp:184->HttpTestBase.waitForSlingStartup:221
Sling services not available. Already checked in earlier tests.
[ERROR]   ReferenceTypeHintTest.setUp:51->HttpTestBase.setUp:184->HttpTestBase.waitForSlingStartup:221
Sling services not available. Already checked in earlier tests.
[ERROR]   ReferenceTypeHintTest.setUp:51->HttpTestBase.setUp:184->HttpTestBase.waitForSlingStartup:221
Sling services not available. Already checked in earlier tests.
[ERROR]   SlingAutoPropertiesTest.setUp:41->HttpTestBase.setUp:184->HttpTestBase.waitForSlingStartup:221
Sling services not available. Already checked in earlier tests.
[ERROR]   SlingAutoPropertiesTest.setUp:41->HttpTestBase.setUp:184->HttpTestBase.waitForSlingStartup:221
Sling services not available. Already checked in earlier tests.
[ERROR]   SlingAutoPropertiesTest.setUp:41->HttpTestBase.setUp:184->HttpTestBase.waitForSlingStartup:221
Sling services not available. Already checked in earlier tests.
[ERROR]   SlingDateValuesTest.setUp:57->HttpTestBase.setUp:184->HttpTestBase.waitForSlingStartup:221
Sling services not available. Already checked in earlier tests.
[ERROR]   SlingDateValuesTest.setUp:57->HttpTestBase.setUp:184->HttpTestBase.waitForSlingStartup:221
Sling services not available. Already checked in earlier tests.
[ERROR]   SlingDefaultValuesTest.setUp:38->HttpTestBase.setUp:184->HttpTestBase.waitForSlingStartup:221
Sling services not available. Already checked in earlier tests.
[ERROR]   SlingDefaultValuesTest.setUp:38->HttpTestBase.setUp:184->HttpTestBase.waitForSlingStartup:221
Sling services not available. Already checked in earlier tests.
[ERROR]   SlingDefaultValuesTest.setUp:38->HttpTestBase.setUp:184->HttpTestBase.waitForSlingStartup:221
Sling services not available. Already checked in earlier tests.
[ERROR]   SlingDefaultValuesTest.setUp:38->HttpTestBase.setUp:184->HttpTestBase.waitForSlingStartup:221
Sling services not available. Already checked in earlier tests.
[ERROR]   SlingDefaultValuesTest.setUp:38->HttpTestBase.setUp:184->HttpTestBase.waitForSlingStartup:221
Sling services not available. Already checked in earlier tests.
[ERROR]   SlingSessionInfoTest>HttpTestBase.setUp:184->HttpTestBase.waitForSlingStartup:221
Sling services not available. Already checked in earlier tests.
[ERROR]   SlingSessionInfoTest>HttpTestBase.setUp:184->HttpTestBase.waitForSlingStartup:221
Sling services not available. Already checked in earlier tests.
[ERROR]   ExtensionServletTest>ResolutionTestBase.setUp:51->HttpTestBase.setUp:184->HttpTestBase.waitForSlingStartup:221
Sling services not available. Already checked in earlier tests.
[ERROR]   ExtensionServletTest>ResolutionTestBase.setUp:51->HttpTestBase.setUp:184->HttpTestBase.waitForSlingStartup:221
Sling services not available. Already checked in earlier tests.
[ERROR]   ExtensionServletTest>ResolutionTestBase.setUp:51->HttpTestBase.setUp:184->HttpTestBase.waitForSlingStartup:221
Sling services not available. Already checked in earlier tests.
[ERROR]   HtmlDefaultServletTest.setUp:33->ResolutionTestBase.setUp:51->HttpTestBase.setUp:184->HttpTestBase.waitForSlingStartup:221
Sling services not available. Already checked in earlier tests.
[ERROR]   HtmlDefaultServletTest.setUp:33->ResolutionTestBase.setUp:51->HttpTestBase.setUp:184->HttpTestBase.waitForSlingStartup:221
Sling services not available. Already checked in earlier tests.
[ERROR]   PathsServletTest>ResolutionTestBase.setUp:51->HttpTestBase.setUp:184->HttpTestBase.waitForSlingStartup:221
Sling services not available. Already checked in earlier tests.
[ERROR]   PathsServletTest>ResolutionTestBase.setUp:51->HttpTestBase.setUp:184->HttpTestBase.waitForSlingStartup:221
Sling services not available. Already checked in earlier tests.
[ERROR]   PathsServletWithNodeTest.setUp:35->ResolutionTestBase.setUp:51->HttpTestBase.setUp:184->HttpTestBase.waitForSlingStartup:221
Sling services not available. Already checked in earlier tests.
[ERROR]   PrefixTest>ResolutionTestBase.setUp:51->HttpTestBase.setUp:184->HttpTestBase.waitForSlingStartup:221
Sling services not available. Already checked in earlier tests.
[ERROR]   PrefixTest>ResolutionTestBase.setUp:51->HttpTestBase.setUp:184->HttpTestBase.waitForSlingStartup:221
Sling services not available. Already checked in earlier tests.
[ERROR]   PrefixTest>ResolutionTestBase.setUp:51->HttpTestBase.setUp:184->HttpTestBase.waitForSlingStartup:221
Sling services not available. Already checked in earlier tests.
[ERROR]   PrioritiesTest>ResolutionTestBase.setUp:51->HttpTestBase.setUp:184->HttpTestBase.waitForSlingStartup:221
Sling services not available. Already checked in earlier tests.
[ERROR]   PutMethodServletTest>ResolutionTestBase.setUp:51->HttpTestBase.setUp:184->HttpTestBase.waitForSlingStartup:221
Sling services not available. Already checked in earlier tests.
[ERROR]   PutMethodServletTest>ResolutionTestBase.setUp:51->HttpTestBase.setUp:184->HttpTestBase.waitForSlingStartup:221
Sling services not available. Already checked in earlier tests.
[ERROR]   RequestObjectTest.setUp:56->ResolutionTestBase.setUp:51->HttpTestBase.setUp:184->HttpTestBase.waitForSlingStartup:221
Sling services not available. Already checked in earlier tests.
[ERROR]   RequestUriOptingServletTest>ResolutionTestBase.setUp:51->HttpTestBase.setUp:184->HttpTestBase.waitForSlingStartup:221
Sling services not available. Already checked in earlier tests.
[ERROR]   RequestUriOptingServletTest>ResolutionTestBase.setUp:51->HttpTestBase.setUp:184->HttpTestBase.waitForSlingStartup:221
Sling services not available. Already checked in earlier tests.
[ERROR]   RequestUriOptingServletTest>ResolutionTestBase.setUp:51->HttpTestBase.setUp:184->HttpTestBase.waitForSlingStartup:221
Sling services not available. Already checked in earlier tests.
[ERROR]   RequestUriOptingServletTest>ResolutionTestBase.setUp:51->HttpTestBase.setUp:184->HttpTestBase.waitForSlingStartup:221
Sling services not available. Already checked in earlier tests.
[ERROR]   SelectorServletTest>ResolutionTestBase.setUp:51->HttpTestBase.setUp:184->HttpTestBase.waitForSlingStartup:221
Sling services not available. Already checked in earlier tests.
[ERROR]   SelectorServletTest>ResolutionTestBase.setUp:51->HttpTestBase.setUp:184->HttpTestBase.waitForSlingStartup:221
Sling services not available. Already checked in earlier tests.
[ERROR]   SelectorServletTest>ResolutionTestBase.setUp:51->HttpTestBase.setUp:184->HttpTestBase.waitForSlingStartup:221
Sling services not available. Already checked in earlier tests.
[ERROR]   SelectorServletTest>ResolutionTestBase.setUp:51->HttpTestBase.setUp:184->HttpTestBase.waitForSlingStartup:221
Sling services not available. Already checked in earlier tests.
[ERROR]   WarSelectorServletTest>ResolutionTestBase.setUp:51->HttpTestBase.setUp:184->HttpTestBase.waitForSlingStartup:221
Sling services not available. Already checked in earlier tests.
[ERROR]   WarSelectorServletTest>ResolutionTestBase.setUp:51->HttpTestBase.setUp:184->HttpTestBase.waitForSlingStartup:221
Sling services not available. Already checked in earlier tests.
[ERROR]   WarSelectorServletTest>ResolutionTestBase.setUp:51->HttpTestBase.setUp:184->HttpTestBase.waitForSlingStartup:221
Sling services not available. Already checked in earlier tests.
[ERROR]   ErrorHandlingTest.setUp:56->HttpTestBase.setUp:184->HttpTestBase.waitForSlingStartup:221
Sling services not available. Already checked in earlier tests.
[ERROR]   ErrorHandlingTest.setUp:56->HttpTestBase.setUp:184->HttpTestBase.waitForSlingStartup:221
Sling services not available. Already checked in earlier tests.
[ERROR]   ErrorHandlingTest.setUp:56->HttpTestBase.setUp:184->HttpTestBase.waitForSlingStartup:221
Sling services not available. Already checked in earlier tests.
[ERROR]   ErrorHandlingTest.setUp:56->HttpTestBase.setUp:184->HttpTestBase.waitForSlingStartup:221
Sling services not available. Already checked in earlier tests.
[ERROR]   ErrorHandlingTest.setUp:56->HttpTestBase.setUp:184->HttpTestBase.waitForSlingStartup:221
Sling services not available. Already checked in earlier tests.
[ERROR]   ErrorHandlingTest.setUp:56->HttpTestBase.setUp:184->HttpTestBase.waitForSlingStartup:221
Sling services not available. Already checked in earlier tests.
[ERROR]   ErrorHandlingTest.setUp:56->HttpTestBase.setUp:184->HttpTestBase.waitForSlingStartup:221
Sling services not available. Already checked in earlier tests.
[ERROR]   ErrorHandlingTest.setUp:56->HttpTestBase.setUp:184->HttpTestBase.waitForSlingStartup:221
Sling services not available. Already checked in earlier tests.
[ERROR]   ErrorHandlingTest.setUp:56->HttpTestBase.setUp:184->HttpTestBase.waitForSlingStartup:221
Sling services not available. Already checked in earlier tests.
[ERROR]   ErrorHandlingTest.setUp:56->HttpTestBase.setUp:184->HttpTestBase.waitForSlingStartup:221
Sling services not available. Already checked in earlier tests.
[ERROR]   BasicTeleporterTest.org.apache.sling.launchpad.webapp.integrationtest.teleporter.BasicTeleporterTest
Sling services not available. Already checked in earlier tests.
[ERROR]   EmbeddedDependenciesTeleporterTest.org.apache.sling.launchpad.webapp.integrationtest.teleporter.EmbeddedDependenciesTeleporterTest
Sling services not available. Already checked in earlier tests.
[ERROR]   LdapFilterTeleporterTest.org.apache.sling.launchpad.webapp.integrationtest.teleporter.LdapFilterTeleporterTest
Sling services not available. Already checked in earlier tests.
[ERROR]   LocalServiceTeleporterTest.org.apache.sling.launchpad.webapp.integrationtest.teleporter.LocalServiceTeleporterTest
Sling services not available. Already checked in earlier tests.
[ERROR]   MultipleRulesTeleporterTest.org.apache.sling.launchpad.webapp.integrationtest.teleporter.MultipleRulesTeleporterTest
Sling services not available. Already checked in earlier tests.
[ERROR]   ServicesPresentTest.org.apache.sling.launchpad.webapp.integrationtest.teleporter.ServicesPresentTest
Sling services not available. Already checked in earlier tests.
[ERROR]   TeleportedResourcesFolderTest.org.apache.sling.launchpad.webapp.integrationtest.teleporter.TeleportedResourcesFolderTest
Sling services not available. Already checked in earlier tests.
[ERROR]   TeleportedResourcesSingleTest.org.apache.sling.launchpad.webapp.integrationtest.teleporter.TeleportedResourcesSingleTest
Sling services not available. Already checked in earlier tests.
[ERROR]   CreateGroupTest>HttpTest.setUp:70->HttpTestBase.setUp:184->HttpTestBase.waitForSlingStartup:221
Sling services not available. Already checked in earlier tests.
[ERROR]   CreateGroupTest>HttpTest.setUp:70->HttpTestBase.setUp:184->HttpTestBase.waitForSlingStartup:221
Sling services not available. Already checked in earlier tests.
[ERROR]   CreateGroupTest>HttpTest.setUp:70->HttpTestBase.setUp:184->HttpTestBase.waitForSlingStartup:221
Sling services not available. Already checked in earlier tests.
[ERROR]   CreateGroupTest>HttpTest.setUp:70->HttpTestBase.setUp:184->HttpTestBase.waitForSlingStartup:221
Sling services not available. Already checked in earlier tests.
[ERROR]   CreateGroupTest>HttpTest.setUp:70->HttpTestBase.setUp:184->HttpTestBase.waitForSlingStartup:221
Sling services not available. Already checked in earlier tests.
[ERROR]   CreateGroupTest>HttpTest.setUp:70->HttpTestBase.setUp:184->HttpTestBase.waitForSlingStartup:221
Sling services not available. Already checked in earlier tests.
[ERROR]   CreateGroupTest>HttpTest.setUp:70->HttpTestBase.setUp:184->HttpTestBase.waitForSlingStartup:221
Sling services not available. Already checked in earlier tests.
[ERROR]   CreateGroupTest>HttpTest.setUp:70->HttpTestBase.setUp:184->HttpTestBase.waitForSlingStartup:221
Sling services not available. Already checked in earlier tests.
[ERROR]   CreateUserTest.setup:53 Sling services not available. Already checked in earlier
tests.
[ERROR]   CreateUserTest.setup:53 Sling services not available. Already checked in earlier
tests.
[ERROR]   CreateUserTest.setup:53 Sling services not available. Already checked in earlier
tests.
[ERROR]   CreateUserTest.setup:53 Sling services not available. Already checked in earlier
tests.
[ERROR]   CreateUserTest.setup:53 Sling services not available. Already checked in earlier
tests.
[ERROR]   CreateUserTest.setup:53 Sling services not available. Already checked in earlier
tests.
[ERROR]   CreateUserTest.setup:53 Sling services not available. Already checked in earlier
tests.
[ERROR]   CreateUserTest.setup:53 Sling services not available. Already checked in earlier
tests.
[ERROR]   CreateUserTest.setup:53 Sling services not available. Already checked in earlier
tests.
[ERROR]   CreateUserTest.setup:53 Sling services not available. Already checked in earlier
tests.
[ERROR]   CreateUserTest.setup:53 Sling services not available. Already checked in earlier
tests.
[ERROR]   RemoveAuthorizablesTest>HttpTest.setUp:70->HttpTestBase.setUp:184->HttpTestBase.waitForSlingStartup:221
Sling services not available. Already checked in earlier tests.
[ERROR]   RemoveAuthorizablesTest>HttpTest.setUp:70->HttpTestBase.setUp:184->HttpTestBase.waitForSlingStartup:221
Sling services not available. Already checked in earlier tests.
[ERROR]   RemoveAuthorizablesTest>HttpTest.setUp:70->HttpTestBase.setUp:184->HttpTestBase.waitForSlingStartup:221
Sling services not available. Already checked in earlier tests.
[ERROR]   RemoveAuthorizablesTest>HttpTest.setUp:70->HttpTestBase.setUp:184->HttpTestBase.waitForSlingStartup:221
Sling services not available. Already checked in earlier tests.
[ERROR]   RemoveAuthorizablesTest>HttpTest.setUp:70->HttpTestBase.setUp:184->HttpTestBase.waitForSlingStartup:221
Sling services not available. Already checked in earlier tests.
[ERROR]   RemoveAuthorizablesTest>HttpTest.setUp:70->HttpTestBase.setUp:184->HttpTestBase.waitForSlingStartup:221
Sling services not available. Already checked in earlier tests.
[ERROR]   RemoveAuthorizablesTest>HttpTest.setUp:70->HttpTestBase.setUp:184->HttpTestBase.waitForSlingStartup:221
Sling services not available. Already checked in earlier tests.
[ERROR]   RemoveAuthorizablesTest>HttpTest.setUp:70->HttpTestBase.setUp:184->HttpTestBase.waitForSlingStartup:221
Sling services not available. Already checked in earlier tests.
[ERROR]   RemoveAuthorizablesTest>HttpTest.setUp:70->HttpTestBase.setUp:184->HttpTestBase.waitForSlingStartup:221
Sling services not available. Already checked in earlier tests.
[ERROR]   RemoveAuthorizablesTest>HttpTest.setUp:70->HttpTestBase.setUp:184->HttpTestBase.waitForSlingStartup:221
Sling services not available. Already checked in earlier tests.
[ERROR]   RemoveAuthorizablesTest>HttpTest.setUp:70->HttpTestBase.setUp:184->HttpTestBase.waitForSlingStartup:221
Sling services not available. Already checked in earlier tests.
[ERROR]   UpdateGroupTest>HttpTest.setUp:70->HttpTestBase.setUp:184->HttpTestBase.waitForSlingStartup:221
Sling services not available. Already checked in earlier tests.
[ERROR]   UpdateGroupTest>HttpTest.setUp:70->HttpTestBase.setUp:184->HttpTestBase.waitForSlingStartup:221
Sling services not available. Already checked in earlier tests.
[ERROR]   UpdateGroupTest>HttpTest.setUp:70->HttpTestBase.setUp:184->HttpTestBase.waitForSlingStartup:221
Sling services not available. Already checked in earlier tests.
[ERROR]   UpdateGroupTest>HttpTest.setUp:70->HttpTestBase.setUp:184->HttpTestBase.waitForSlingStartup:221
Sling services not available. Already checked in earlier tests.
[ERROR]   UpdateGroupTest>HttpTest.setUp:70->HttpTestBase.setUp:184->HttpTestBase.waitForSlingStartup:221
Sling services not available. Already checked in earlier tests.
[ERROR]   UpdateGroupTest>HttpTest.setUp:70->HttpTestBase.setUp:184->HttpTestBase.waitForSlingStartup:221
Sling services not available. Already checked in earlier tests.
[ERROR]   UpdateGroupTest>HttpTest.setUp:70->HttpTestBase.setUp:184->HttpTestBase.waitForSlingStartup:221
Sling services not available. Already checked in earlier tests.
[ERROR]   UpdateGroupTest>HttpTest.setUp:70->HttpTestBase.setUp:184->HttpTestBase.waitForSlingStartup:221
Sling services not available. Already checked in earlier tests.
[ERROR]   UpdateUserTest.setup:54 Sling services not available. Already checked in earlier
tests.
[ERROR]   UpdateUserTest.setup:54 Sling services not available. Already checked in earlier
tests.
[ERROR]   UpdateUserTest.setup:54 Sling services not available. Already checked in earlier
tests.
[ERROR]   UpdateUserTest.setup:54 Sling services not available. Already checked in earlier
tests.
[ERROR]   UpdateUserTest.setup:54 Sling services not available. Already checked in earlier
tests.
[ERROR]   UpdateUserTest.setup:54 Sling services not available. Already checked in earlier
tests.
[ERROR]   UpdateUserTest.setup:54 Sling services not available. Already checked in earlier
tests.
[ERROR]   UpdateUserTest.setup:54 Sling services not available. Already checked in earlier
tests.
[ERROR]   UpdateUserTest.setup:54 Sling services not available. Already checked in earlier
tests.
[ERROR]   UpdateUserTest.setup:54 Sling services not available. Already checked in earlier
tests.
[ERROR]   UpdateUserTest.setup:54 Sling services not available. Already checked in earlier
tests.
[ERROR]   UpdateUserTest.setup:54 Sling services not available. Already checked in earlier
tests.
[ERROR]   UserPrivilegesInfoTest.setup:53 Sling services not available. Already checked in
earlier tests.
[ERROR]   UserPrivilegesInfoTest.setup:53 Sling services not available. Already checked in
earlier tests.
[ERROR]   UserPrivilegesInfoTest.setup:53 Sling services not available. Already checked in
earlier tests.
[ERROR]   UserPrivilegesInfoTest.setup:53 Sling services not available. Already checked in
earlier tests.
[ERROR]   UserPrivilegesInfoTest.setup:53 Sling services not available. Already checked in
earlier tests.
[ERROR]   UserPrivilegesInfoTest.setup:53 Sling services not available. Already checked in
earlier tests.
[ERROR]   UserPrivilegesInfoTest.setup:53 Sling services not available. Already checked in
earlier tests.
[ERROR]   DomTest>HttpTestBase.setUp:184->HttpTestBase.waitForSlingStartup:221 Sling
services not available. Already checked in earlier tests.
[ERROR]   SaxTest>HttpTestBase.setUp:184->HttpTestBase.waitForSlingStartup:221 Sling
services not available. Already checked in earlier tests.
[ERROR]   XPathTest>HttpTestBase.setUp:184->HttpTestBase.waitForSlingStartup:221 Sling
services not available. Already checked in earlier tests.
[ERROR]   TagFileTest.setup:54 Sling services not available. Already checked in earlier tests.
[ERROR] Errors: 
[ERROR] org.apache.sling.launchpad.webapp.integrationtest.EventsCounterTest.org.apache.sling.launchpad.webapp.integrationtest.EventsCounterTest
[ERROR]   Run 1: EventsCounterTest.setupClass:45 Sling services not available. Already checked
in earlier tests.
[ERROR]   Run 2: EventsCounterTest.cleanup:53 » IllegalArgument host parameter is null
[INFO] 
[ERROR]   MappingEventsProxyTest.runWriteableResourcesTest:26 » JsonGeneration write(par...
[ERROR] org.apache.sling.launchpad.webapp.integrationtest.WebDavDoubleSlashTest.testDefaultWorkspace(org.apache.sling.launchpad.webapp.integrationtest.WebDavDoubleSlashTest)
[ERROR]   Run 1: WebDavDoubleSlashTest.setup:44 Sling services not available. Already checked
in earlier tests.
[ERROR]   Run 2: WebDavDoubleSlashTest.cleanup:52 » IllegalArgument host parameter is null
[INFO] 
[ERROR] org.apache.sling.launchpad.webapp.integrationtest.WebDavDoubleSlashTest.testEmptyWorkspace(org.apache.sling.launchpad.webapp.integrationtest.WebDavDoubleSlashTest)
[ERROR]   Run 1: WebDavDoubleSlashTest.setup:44 Sling services not available. Already checked
in earlier tests.
[ERROR]   Run 2: WebDavDoubleSlashTest.cleanup:52 » IllegalArgument host parameter is null
[INFO] 
[ERROR]   WriteableResourcesProxyTest.runWriteableResourcesTest:26 » JsonGeneration writ...
[ERROR] org.apache.sling.launchpad.webapp.integrationtest.installer.InstallManyBundlesTest.installAndUpgradeBundleManyTimes(org.apache.sling.launchpad.webapp.integrationtest.installer.InstallManyBundlesTest)
[ERROR]   Run 1: InstallManyBundlesTest.setup:71 Sling services not available. Already checked
in earlier tests.
[ERROR]   Run 2: InstallManyBundlesTest.cleanup:78 » IllegalArgument host parameter is null
[INFO] 
[ERROR] org.apache.sling.launchpad.webapp.integrationtest.installer.InstallManyBundlesTest.installManyBundles(org.apache.sling.launchpad.webapp.integrationtest.installer.InstallManyBundlesTest)
[ERROR]   Run 1: InstallManyBundlesTest.setup:71 Sling services not available. Already checked
in earlier tests.
[ERROR]   Run 2: InstallManyBundlesTest.cleanup:78 » IllegalArgument host parameter is null
[INFO] 
[ERROR] org.apache.sling.launchpad.webapp.integrationtest.login.AnonymousAccessTest.testAdminContent[/ANON_CAN_READ](org.apache.sling.launchpad.webapp.integrationtest.login.AnonymousAccessTest)
[ERROR]   Run 1: AnonymousAccessTest.setUp:64 Sling services not available. Already checked
in earlier tests.
[ERROR]   Run 2: AnonymousAccessTest.cleanup:80 » IllegalArgument host parameter is null
[INFO] 
[ERROR] org.apache.sling.launchpad.webapp.integrationtest.login.AnonymousAccessTest.testAdminContent[](org.apache.sling.launchpad.webapp.integrationtest.login.AnonymousAccessTest)
[ERROR]   Run 1: AnonymousAccessTest.setUp:64 Sling services not available. Already checked
in earlier tests.
[ERROR]   Run 2: AnonymousAccessTest.cleanup:80 » IllegalArgument host parameter is null
[INFO] 
[ERROR] org.apache.sling.launchpad.webapp.integrationtest.login.AnonymousAccessTest.testAnonymousContent[/ANON_CAN_READ](org.apache.sling.launchpad.webapp.integrationtest.login.AnonymousAccessTest)
[ERROR]   Run 1: AnonymousAccessTest.setUp:64 Sling services not available. Already checked
in earlier tests.
[ERROR]   Run 2: AnonymousAccessTest.cleanup:80 » IllegalArgument host parameter is null
[INFO] 
[ERROR] org.apache.sling.launchpad.webapp.integrationtest.login.AnonymousAccessTest.testAnonymousContent[](org.apache.sling.launchpad.webapp.integrationtest.login.AnonymousAccessTest)
[ERROR]   Run 1: AnonymousAccessTest.setUp:64 Sling services not available. Already checked
in earlier tests.
[ERROR]   Run 2: AnonymousAccessTest.cleanup:80 » IllegalArgument host parameter is null
[INFO] 
[ERROR] org.apache.sling.launchpad.webapp.integrationtest.servlets.post.SlingPostProcessorTest.processorsActive(org.apache.sling.launchpad.webapp.integrationtest.servlets.post.SlingPostProcessorTest)
[ERROR]   Run 1: SlingPostProcessorTest.setup:41 Sling services not available. Already checked
in earlier tests.
[ERROR]   Run 2: SlingPostProcessorTest.cleanup:47 » IllegalArgument host parameter is null
[INFO] 
[INFO] 
[ERROR] Tests run: 580, Failures: 566, Errors: 12, Skipped: 1
[INFO] 
[INFO] 
[INFO] --- slingstart-maven-plugin:1.7.16:stop (stop-container) @ org.apache.sling.launchpad.testing
---
[INFO] Stopping 1 Launchpad instances
[INFO] Stopping Launchpad '_-41000'
21.02.2019 14:53:43.312 *INFO * [Apache Sling Terminator] Java VM is shutting down
21.02.2019 14:53:43.312 *INFO * [Apache Sling Terminator] Stopping Apache Sling
21.02.2019 14:53:44.323 *INFO * [Sling Notifier] Apache Sling has been stopped
[INFO] 
[INFO] --- ianal-maven-plugin:1.0-alpha-1:verify-legal-files (default) @ org.apache.sling.launchpad.testing
---
[INFO] Checking legal files in: org.apache.sling.launchpad.testing-12-SNAPSHOT.jar
[INFO] Checking legal files in: org.apache.sling.launchpad.testing-12-SNAPSHOT-sources.jar
[INFO] 
[INFO] --- apache-rat-plugin:0.11:check (default) @ org.apache.sling.launchpad.testing ---
[INFO] 51 implicit excludes (use -debug for more details).
[INFO] Exclude: DEPENDENCIES
[INFO] Exclude: src/main/appended-resources/META-INF/*
[INFO] Exclude: velocity.log
[INFO] Exclude: target/*
[INFO] Exclude: README.md
[INFO] Exclude: maven-eclipse.xml
[INFO] Exclude: .*
[INFO] Exclude: .*/**
[INFO] Exclude: **/*.json
[INFO] Exclude: DEPENDENCIES
[INFO] Exclude: **/*.rej
[INFO] Exclude: hs_err_*.log
[INFO] Exclude: **/repository/index/*/index-details.txt
[INFO] Exclude: bnd.bnd
[INFO] 7 resources included (use -debug for more details)
[INFO] Rat check: Summary of files. Unapproved: 0 unknown: 0 generated: 0 approved: 6 licence.
[INFO] 
[INFO] --- maven-failsafe-plugin:2.21.0:verify (default) @ org.apache.sling.launchpad.testing
---
[INFO] ------------------------------------------------------------------------
[INFO] BUILD FAILURE
[INFO] ------------------------------------------------------------------------
[INFO] Total time:  03:37 min
[INFO] Finished at: 2019-02-21T14:53:45Z
[INFO] ------------------------------------------------------------------------
[INFO] [jenkins-event-spy] Generated /home/jenkins/jenkins-slave/workspace/e-sling-launchpad-testing_master@tmp/withMavendc1c01d4/maven-spy-20190221-145007-1795870420150726716017.log
[ERROR] Failed to execute goal org.apache.maven.plugins:maven-failsafe-plugin:2.21.0:verify
(default) on project org.apache.sling.launchpad.testing: There are test failures.
[ERROR] 
[ERROR] Please refer to /home/jenkins/jenkins-slave/workspace/e-sling-launchpad-testing_master/target/failsafe-reports
for the individual test results.
[ERROR] Please refer to dump files (if any exist) [date]-jvmRun[N].dump, [date].dumpstream
and [date]-jvmRun[N].dumpstream.
[ERROR] -> [Help 1]
[ERROR] 
[ERROR] To see the full stack trace of the errors, re-run Maven with the -e switch.
[ERROR] Re-run Maven using the -X switch to enable full debug logging.
[ERROR] 
[ERROR] For more information about the errors and possible solutions, please read the following
articles:
[ERROR] [Help 1] http://cwiki.apache.org/confluence/display/MAVEN/MojoFailureException
[Pipeline] }
[withMaven] junitPublisher - Archive test results for Maven artifact org.apache.sling:org.apache.sling.launchpad.testing:slingstart:12-SNAPSHOT
generated by maven-surefire-plugin:test (default-test): target/surefire-reports/*.xml
Recording test results
None of the test reports contained any result
[withMaven] junitPublisher - Archive test results for Maven artifact org.apache.sling:org.apache.sling.launchpad.testing:slingstart:12-SNAPSHOT
generated by maven-failsafe-plugin:integration-test (default): target/failsafe-reports/*.xml
Recording test results
[withMaven] Publishers: Pipeline Graph Publisher: 24 ms, Generated Artifacts Publisher: 611
ms, Junit Publisher: 69215 ms, Dependencies Fingerprint Publisher: 2303 ms, JGiven Publisher:
2 ms, Open Task Scanner Publisher: 154 ms
[Pipeline] // withMaven
[Pipeline] }
[Pipeline] // stage
[Pipeline] }
[Pipeline] // timeout
[Pipeline] stage
[Pipeline] { (Notifications)
[Pipeline] echo
Status change is BROKEN, notifications will be sent.
[Pipeline] emailext
Mime
  • Unnamed multipart/mixed (inline, None, 0 bytes)
View raw message