sling-dev mailing list archives

Site index · List index
Message view « Date » · « Thread »
Top « Date » · « Thread »
From "Bertrand Delacretaz (JIRA)" <j...@apache.org>
Subject [jira] [Commented] (SLING-7636) Some login ITs fail
Date Thu, 03 May 2018 16:10:00 GMT

    [ https://issues.apache.org/jira/browse/SLING-7636?page=com.atlassian.jira.plugin.system.issuetabpanels:comment-tabpanel&focusedCommentId=16462674#comment-16462674
] 

Bertrand Delacretaz commented on SLING-7636:
--------------------------------------------

{{AnonymousAccessTest}} is fixed now, SLING-7647 has more details. 

On my box the following IT failures are left:

{code}
[ERROR] Tests run: 1, Failures: 1, Errors: 0, Skipped: 0, Time elapsed: 0.007 s <<<
FAILURE! - in org.apache.sling.launchpad.webapp.integrationtest.servlets.post.PostToRootTest
[ERROR] Tests run: 7, Failures: 5, Errors: 0, Skipped: 0, Time elapsed: 0.474 s <<<
FAILURE! - in org.apache.sling.launchpad.webapp.integrationtest.userManager.UserPrivilegesInfoTest
[ERROR] Tests run: 2, Failures: 1, Errors: 0, Skipped: 0, Time elapsed: 0.004 s <<<
FAILURE! - in org.apache.sling.launchpad.webapp.integrationtest.login.RedirectOnLoginErrorTest
[ERROR] Tests run: 1, Failures: 1, Errors: 0, Skipped: 0, Time elapsed: 0.003 s <<<
FAILURE! - in org.apache.sling.launchpad.webapp.integrationtest.login.AuthRequestLoginTest
{code}

> Some login ITs fail
> -------------------
>
>                 Key: SLING-7636
>                 URL: https://issues.apache.org/jira/browse/SLING-7636
>             Project: Sling
>          Issue Type: Bug
>          Components: Testing
>            Reporter: Robert Munteanu
>            Priority: Major
>              Labels: sling-IT
>
> Some for the Login ITs fail
> * org.apache.sling.launchpad.webapp.integrationtest.login.AuthRequestLoginTest.testForcedLogin
> * org.apache.sling.launchpad.webapp.integrationtest.login.RedirectOnLoginErrorTest.testGetDefaultLoginPage
> * org.apache.sling.launchpad.webapp.integrationtest.login.AnonymousAccessTest.testAnonymousContent
> The common root cause seems to be not finding resources where expected:
> * Expected 20x or 30x status, got 404
> * http://localhost:41000/system/sling/login expected:<200> but was:<404>
> * Expected status 200 for http://localhost:41000/AnonymousAccessTest/1525143663600/test_text_1525143663.txt



--
This message was sent by Atlassian JIRA
(v7.6.3#76005)

Mime
View raw message