sling-dev mailing list archives

Site index · List index
Message view « Date » · « Thread »
Top « Date » · « Thread »
From "Robert Munteanu (JIRA)" <j...@apache.org>
Subject [jira] [Closed] (SLING-7070) Build failure with Java 9 in maven-enforcer-plugin
Date Mon, 04 Sep 2017 19:07:00 GMT

     [ https://issues.apache.org/jira/browse/SLING-7070?page=com.atlassian.jira.plugin.system.issuetabpanels:all-tabpanel
]

Robert Munteanu closed SLING-7070.
----------------------------------

> Build failure with Java 9 in maven-enforcer-plugin
> --------------------------------------------------
>
>                 Key: SLING-7070
>                 URL: https://issues.apache.org/jira/browse/SLING-7070
>             Project: Sling
>          Issue Type: Bug
>          Components: General
>            Reporter: Robert Munteanu
>            Assignee: Robert Munteanu
>             Fix For: Parent 32
>
>
> When building a module project with Java 9 the following error appears:
> {noformat}[ERROR] Failed to execute goal org.apache.maven.plugins:maven-enforcer-plugin:1.4.1:enforce
(enforce-java) on project org.apache.sling.engine: Execution enforce-java of goal org.apache.maven.plugins:maven-enforcer-plugin:1.4.1:enforce
failed: An API incompatibility was encountered while executing org.apache.maven.plugins:maven-enforcer-plugin:1.4.1:enforce:
java.lang.ExceptionInInitializerError: null
> [ERROR] -----------------------------------------------------
> [ERROR] realm =    plugin>org.apache.maven.plugins:maven-enforcer-plugin:1.4.1
> [ERROR] strategy = org.codehaus.plexus.classworlds.strategy.SelfFirstStrategy
> [ERROR] urls[0] = file:/home/robert/.m2/repository/org/apache/maven/plugins/maven-enforcer-plugin/1.4.1/maven-enforcer-plugin-1.4.1.jar
> [ERROR] urls[1] = file:/home/robert/.m2/repository/backport-util-concurrent/backport-util-concurrent/3.1/backport-util-concurrent-3.1.jar
> [ERROR] urls[2] = file:/home/robert/.m2/repository/org/codehaus/plexus/plexus-interpolation/1.11/plexus-interpolation-1.11.jar
> [ERROR] urls[3] = file:/home/robert/.m2/repository/org/slf4j/slf4j-jdk14/1.5.6/slf4j-jdk14-1.5.6.jar
> [ERROR] urls[4] = file:/home/robert/.m2/repository/org/slf4j/jcl-over-slf4j/1.5.6/jcl-over-slf4j-1.5.6.jar
> [ERROR] urls[5] = file:/home/robert/.m2/repository/org/apache/maven/reporting/maven-reporting-api/2.2.1/maven-reporting-api-2.2.1.jar
> [ERROR] urls[6] = file:/home/robert/.m2/repository/org/apache/maven/doxia/doxia-sink-api/1.1/doxia-sink-api-1.1.jar
> [ERROR] urls[7] = file:/home/robert/.m2/repository/org/apache/maven/doxia/doxia-logging-api/1.1/doxia-logging-api-1.1.jar
> [ERROR] urls[8] = file:/home/robert/.m2/repository/commons-cli/commons-cli/1.2/commons-cli-1.2.jar
> [ERROR] urls[9] = file:/home/robert/.m2/repository/org/codehaus/plexus/plexus-interactivity-api/1.0-alpha-4/plexus-interactivity-api-1.0-alpha-4.jar
> [ERROR] urls[10] = file:/home/robert/.m2/repository/org/sonatype/plexus/plexus-sec-dispatcher/1.3/plexus-sec-dispatcher-1.3.jar
> [ERROR] urls[11] = file:/home/robert/.m2/repository/org/sonatype/plexus/plexus-cipher/1.4/plexus-cipher-1.4.jar
> [ERROR] urls[12] = file:/home/robert/.m2/repository/org/codehaus/plexus/plexus-utils/3.0.22/plexus-utils-3.0.22.jar
> [ERROR] urls[13] = file:/home/robert/.m2/repository/commons-lang/commons-lang/2.3/commons-lang-2.3.jar
> [ERROR] urls[14] = file:/home/robert/.m2/repository/org/apache/maven/enforcer/enforcer-api/1.4.1/enforcer-api-1.4.1.jar
> [ERROR] urls[15] = file:/home/robert/.m2/repository/org/apache/maven/enforcer/enforcer-rules/1.4.1/enforcer-rules-1.4.1.jar
> [ERROR] urls[16] = file:/home/robert/.m2/repository/org/apache/maven/shared/maven-common-artifact-filters/1.4/maven-common-artifact-filters-1.4.jar
> [ERROR] urls[17] = file:/home/robert/.m2/repository/org/beanshell/bsh/2.0b4/bsh-2.0b4.jar
> [ERROR] urls[18] = file:/home/robert/.m2/repository/org/apache/maven/shared/maven-dependency-tree/2.2/maven-dependency-tree-2.2.jar
> [ERROR] urls[19] = file:/home/robert/.m2/repository/org/codehaus/plexus/plexus-component-annotations/1.5.5/plexus-component-annotations-1.5.5.jar
> [ERROR] urls[20] = file:/home/robert/.m2/repository/org/eclipse/aether/aether-util/0.9.0.M2/aether-util-0.9.0.M2.jar
> [ERROR] urls[21] = file:/home/robert/.m2/repository/org/codehaus/plexus/plexus-i18n/1.0-beta-6/plexus-i18n-1.0-beta-6.jar
> [ERROR] urls[22] = file:/home/robert/.m2/repository/org/apache/maven/plugin-testing/maven-plugin-testing-harness/1.3/maven-plugin-testing-harness-1.3.jar
> [ERROR] urls[23] = file:/home/robert/.m2/repository/org/codehaus/plexus/plexus-archiver/2.2/plexus-archiver-2.2.jar
> [ERROR] urls[24] = file:/home/robert/.m2/repository/org/codehaus/plexus/plexus-io/2.0.4/plexus-io-2.0.4.jar
> [ERROR] urls[25] = file:/home/robert/.m2/repository/junit/junit/4.11/junit-4.11.jar
> [ERROR] urls[26] = file:/home/robert/.m2/repository/org/hamcrest/hamcrest-core/1.3/hamcrest-core-1.3.jar
> [ERROR] Number of foreign imports: 1
> [ERROR] import: Entry[import  from realm ClassRealm[project>org.apache.sling:org.apache.sling.engine:2.6.9-SNAPSHOT,
parent: ClassRealm[maven.api, parent: null]]]{noformat}



--
This message was sent by Atlassian JIRA
(v6.4.14#64029)

Mime
View raw message