sling-dev mailing list archives

Site index · List index
Message view « Date » · « Thread »
Top « Date » · « Thread »
From Robert Munteanu <romb...@apache.org>
Subject Re: Build failed in Jenkins: sling-launchpad-builder-1.8 #1997
Date Mon, 30 Jan 2017 10:51:56 GMT
Looks like auth.core 1.3.4 is not yet available on Maven central.

We typically move to 1.3.5-SNAPSHOT right after a release to avoid this
kind of problem.

Antonio, would that be ok for you?

Robert

On Mon, 2017-01-30 at 10:44 +0000, Apache Jenkins Server wrote:
> See <https://builds.apache.org/job/sling-launchpad-builder-1.8/1997/c
> hanges>
> 
> Changes:
> 
> [asanso] Release Apache Sling Authentication Service 1.3.24
> 
> ------------------------------------------
> Started by upstream project "sling-bundles-extensions-caconfig-
> integration-tests-1.8" build number 1542
> originally caused by:
>  Started by upstream project "sling-launchpad-builder-1.8" build
> number 1996
>  originally caused by:
>   Started by an SCM change
> Started by upstream project "sling-bundles-jcr-davex-1.7" build
> number 6
> originally caused by:
>  Started by an SCM change
> [EnvInject] - Loading node environment variables.
> Building remotely on ubuntu-4 (ubuntu) in workspace <https://builds.a
> pache.org/job/sling-launchpad-builder-1.8/ws/>
> Updating https://svn.apache.org/repos/asf/sling/trunk/launchpad/build
> er at revision '2017-01-30T10:44:10.114 +0000'
> U         src/main/provisioning/sling.txt
> At revision 1780894
> 
> Parsing POMs
> Established TCP socket on 54402
> maven32-agent.jar already up to date
> maven32-interceptor.jar already up to date
> maven3-interceptor-commons.jar already up to date
> [sling-launchpad-builder-1.8] $
> /home/jenkins/tools/java/latest1.8/bin/java -Xmx2g -Xms256m
> -XX:MaxPermSize=512m -cp /home/jenkins/jenkins-slave/maven32-
> agent.jar:/home/jenkins/tools/maven/apache-maven-3.3.9/boot/plexus-
> classworlds-2.5.2.jar:/home/jenkins/tools/maven/apache-maven-
> 3.3.9/conf/logging jenkins.maven3.agent.Maven32Main
> /home/jenkins/tools/maven/apache-maven-3.3.9 /home/jenkins/jenkins-
> slave/slave.jar /home/jenkins/jenkins-slave/maven32-interceptor.jar
> /home/jenkins/jenkins-slave/maven3-interceptor-commons.jar 54402
> Java HotSpot(TM) 64-Bit Server VM warning: ignoring option
> MaxPermSize=512m; support was removed in 8.0
> <===[JENKINS REMOTING CAPACITY]===>   channel started
> Executing Maven:  -B -f <https://builds.apache.org/job/sling-launchpa
> d-builder-1.8/ws/pom.xml> -Dmaven.repo.local=/home/jenkins/jenkins-
> slave/maven-repositories/1 -U clean deploy
> [INFO] Scanning for projects...
> [INFO]                                                               
>           
> [INFO] --------------------------------------------------------------
> ----------
> [INFO] Building Apache Sling Launchpad Application Builder 9-SNAPSHOT
> [INFO] --------------------------------------------------------------
> ----------
> [INFO] Downloading: http://repository.apache.org/snapshots/org/apache
> /sling/org.apache.sling.launchpad.base/5.6.1-2.6.15-SNAPSHOT/maven-
> metadata.xml
> [INFO] Downloaded: http://repository.apache.org/snapshots/org/apache/
> sling/org.apache.sling.launchpad.base/5.6.1-2.6.15-SNAPSHOT/maven-
> metadata.xml (2 KB at 3.2 KB/sec)
> [INFO] Downloading: http://repository.apache.org/snapshots/org/apache
> /sling/org.apache.sling.commons.log/5.0.1-SNAPSHOT/maven-metadata.xml
> [INFO] Downloaded: http://repository.apache.org/snapshots/org/apache/
> sling/org.apache.sling.commons.log/5.0.1-SNAPSHOT/maven-metadata.xml
> (1008 B at 2.7 KB/sec)
> [INFO] Downloading: http://repository.apache.org/snapshots/org/apache
> /sling/org.apache.sling.jcr.oak.server/1.1.3-SNAPSHOT/maven-
> metadata.xml
> [INFO] Downloaded: http://repository.apache.org/snapshots/org/apache/
> sling/org.apache.sling.jcr.oak.server/1.1.3-SNAPSHOT/maven-
> metadata.xml (1019 B at 2.7 KB/sec)
> [INFO] Downloading: https://repo.maven.apache.org/maven2/org/apache/s
> ling/org.apache.sling.auth.core/1.3.24/org.apache.sling.auth.core-
> 1.3.24.pom
> [WARNING] The POM for
> org.apache.sling:org.apache.sling.auth.core:jar:1.3.24 is missing, no
> dependency information available
> [INFO] Downloading: http://repository.apache.org/snapshots/org/apache
> /sling/org.apache.sling.fsresource/1.2.1-SNAPSHOT/maven-metadata.xml
> [INFO] Downloaded: http://repository.apache.org/snapshots/org/apache/
> sling/org.apache.sling.fsresource/1.2.1-SNAPSHOT/maven-metadata.xml
> (1007 B at 2.7 KB/sec)
> [INFO] Downloading: http://repository.apache.org/snapshots/org/apache
> /sling/org.apache.sling.installer.provider.jcr/3.1.23-SNAPSHOT/maven-
> metadata.xml
> [INFO] Downloaded: http://repository.apache.org/snapshots/org/apache/
> sling/org.apache.sling.installer.provider.jcr/3.1.23-SNAPSHOT/maven-
> metadata.xml (1023 B at 2.7 KB/sec)
> [INFO] Downloading: http://repository.apache.org/snapshots/org/apache
> /sling/org.apache.sling.jcr.contentloader/2.1.11-SNAPSHOT/maven-
> metadata.xml
> [INFO] Downloaded: http://repository.apache.org/snapshots/org/apache/
> sling/org.apache.sling.jcr.contentloader/2.1.11-SNAPSHOT/maven-
> metadata.xml (2 KB at 2.7 KB/sec)
> [INFO] Downloading: http://repository.apache.org/snapshots/org/apache
> /sling/org.apache.sling.launchpad.content/2.0.9-SNAPSHOT/maven-
> metadata.xml
> [INFO] Downloaded: http://repository.apache.org/snapshots/org/apache/
> sling/org.apache.sling.launchpad.content/2.0.9-SNAPSHOT/maven-
> metadata.xml (2 KB at 2.8 KB/sec)
> [INFO] Downloading: http://repository.apache.org/snapshots/org/apache
> /sling/org.apache.sling.jcr.webdav/2.3.7-SNAPSHOT/maven-metadata.xml
> [INFO] Downloaded: http://repository.apache.org/snapshots/org/apache/
> sling/org.apache.sling.jcr.webdav/2.3.7-SNAPSHOT/maven-metadata.xml
> (1007 B at 2.7 KB/sec)
> [INFO] Downloading: https://repo.maven.apache.org/maven2/org/apache/s
> ling/org.apache.sling.auth.core/1.3.24/org.apache.sling.auth.core-
> 1.3.24.jar
> [JENKINS] Archiving disabled
> [JENKINS] Archiving disabled[INFO] ----------------------------------
> --------------------------------------
> [INFO] BUILD FAILURE
> [INFO] --------------------------------------------------------------
> ----------
> [INFO] Total time: 7.183 s
> [INFO] Finished at: 2017-01-30T10:44:24+00:00
> 
> [INFO] Final Memory: 25M/340M
> [INFO] --------------------------------------------------------------
> ----------
> [ERROR] Failed to execute goal on project org.apache.sling.launchpad:
> Could not resolve dependencies for project
> org.apache.sling:org.apache.sling.launchpad:slingstart:9-SNAPSHOT:
> Could not find artifact
> org.apache.sling:org.apache.sling.auth.core:jar:1.3.24 in central (ht
> tps://repo.maven.apache.org/maven2) -> [Help 1]
> [ERROR] 
> [ERROR] To see the full stack trace of the errors, re-run Maven with
> the -e switch.
> [ERROR] Re-run Maven using the -X switch to enable full debug
> logging.
> [ERROR] 
> [ERROR] For more information about the errors and possible solutions,
> please read the following articles:
> [ERROR] [Help 1] http://cwiki.apache.org/confluence/display/MAVEN/Dep
> endencyResolutionException
> channel stopped
> Archiving artifacts
> Compressed 577.44 KB of artifacts by 99.7% relative to #1996
> Recording test results
> ERROR: Step ?Publish JUnit test result report? failed: Test reports
> were found but none of them are new. Did tests run? 
> For example, <https://builds.apache.org/job/sling-launchpad-builder-1
> .8/ws/target/failsafe-reports/TEST-
> org.apache.sling.launchpad.SmokeIT.xml> is 3 min 51 sec old
> 
> 


Mime
View raw message