sling-dev mailing list archives

Site index · List index
Message view « Date » · « Thread »
Top « Date » · « Thread »
From Apache Jenkins Server <jenk...@builds.apache.org>
Subject Build failed in Jenkins: sling-samples-1.5 #338
Date Fri, 08 Jun 2012 10:19:30 GMT
See <https://builds.apache.org/job/sling-samples-1.5/338/>

------------------------------------------
[...truncated 1760 lines...]
[INFO] --- maven-remote-resources-plugin:1.1:process (default) @ org.apache.sling.samples.accessmanager.ui
---
mojoSucceeded org.apache.maven.plugins:maven-remote-resources-plugin:1.1(default)
mojoStarted org.apache.maven.plugins:maven-resources-plugin:2.4.3(default-resources)[INFO]
Using 'UTF-8' encoding to copy filtered resources.

[INFO] 
[INFO] --- maven-resources-plugin:2.4.3:resources (default-resources) @ org.apache.sling.samples.accessmanager.ui
---
[INFO] Copying 14 resources
[INFO] Copying 3 resources
mojoSucceeded org.apache.maven.plugins:maven-resources-plugin:2.4.3(default-resources)
mojoStarted org.apache.maven.plugins:maven-antrun-plugin:1.6(default)
[INFO] 
[INFO] --- maven-antrun-plugin:1.6:run (default) @ org.apache.sling.samples.accessmanager.ui
---
[INFO] Executing tasks

main:
     [echo] **************** WARNING (SLING-443/SLING-1782) ******************************
     [echo] On most platforms, you'll get OutOfMemoryErrors when building unless you set
     [echo] on 32bit platforms: MAVEN_OPTS="-Xmx256M -XX:MaxPermSize=256M", see SLING-443
     [echo] on 64bit platforms: MAVEN_OPTS="-Xmx512M -XX:MaxPermSize=512M", see SLING-1782
     [echo] ******************************************************************************
[INFO] Executed tasks
mojoSucceeded org.apache.maven.plugins:maven-antrun-plugin:1.6(default)
mojoStarted net.alchim31.maven:yuicompressor-maven-plugin:1.3.0(default)[INFO] nothing to
do, <https://builds.apache.org/job/sling-samples-1.5/ws/contrib-1.5/accessmanager-ui/src/main/resources/js/accessmanager/accessmanager.min.js>
is younger than original, use 'force' option or clean your target
[INFO] nothing to do, <https://builds.apache.org/job/sling-samples-1.5/ws/contrib-1.5/accessmanager-ui/src/main/resources/css/accessmanager/accessmanager.min.css>
is younger than original, use 'force' option or clean your target
[INFO] nothing to do, <https://builds.apache.org/job/sling-samples-1.5/ws/contrib-1.5/accessmanager-ui/src/main/resources/js/accessmanager/accessmanager.min.js>
is younger than original, use 'force' option or clean your target
[INFO] nothing to do, <https://builds.apache.org/job/sling-samples-1.5/ws/contrib-1.5/accessmanager-ui/src/main/resources/css/accessmanager/accessmanager.min.css>
is younger than original, use 'force' option or clean your target
[INFO] nb warnings: 0, nb errors: 0

[INFO] 
[INFO] --- yuicompressor-maven-plugin:1.3.0:compress (default) @ org.apache.sling.samples.accessmanager.ui
---
mojoSucceeded net.alchim31.maven:yuicompressor-maven-plugin:1.3.0(default)
mojoStarted org.apache.maven.plugins:maven-compiler-plugin:2.3.2(default-compile)[INFO] Nothing
to compile - all classes are up to date

[INFO] 
[INFO] --- maven-compiler-plugin:2.3.2:compile (default-compile) @ org.apache.sling.samples.accessmanager.ui
---
mojoSucceeded org.apache.maven.plugins:maven-compiler-plugin:2.3.2(default-compile)
mojoStarted org.apache.felix:maven-scr-plugin:1.7.2(generate-scr-scrdescriptor)
[INFO] 
[INFO] --- maven-scr-plugin:1.7.2:scr (generate-scr-scrdescriptor) @ org.apache.sling.samples.accessmanager.ui
---
mojoSucceeded org.apache.felix:maven-scr-plugin:1.7.2(generate-scr-scrdescriptor)
mojoStarted org.apache.maven.plugins:maven-resources-plugin:2.4.3(default-testResources)[INFO]
Using 'UTF-8' encoding to copy filtered resources.
[INFO] skip non existing resourceDirectory <https://builds.apache.org/job/sling-samples-1.5/ws/contrib-1.5/accessmanager-ui/src/test/resources>
[INFO] Copying 3 resources

[INFO] 
[INFO] --- maven-resources-plugin:2.4.3:testResources (default-testResources) @ org.apache.sling.samples.accessmanager.ui
---
mojoSucceeded org.apache.maven.plugins:maven-resources-plugin:2.4.3(default-testResources)
mojoStarted org.apache.maven.plugins:maven-compiler-plugin:2.3.2(default-testCompile)[INFO]
No sources to compile

[INFO] 
[INFO] --- maven-compiler-plugin:2.3.2:testCompile (default-testCompile) @ org.apache.sling.samples.accessmanager.ui
---
mojoSucceeded org.apache.maven.plugins:maven-compiler-plugin:2.3.2(default-testCompile)
mojoStarted org.apache.maven.plugins:maven-surefire-plugin:2.7.2(default-test)[INFO] Surefire
report directory: <https://builds.apache.org/job/sling-samples-1.5/ws/contrib-1.5/accessmanager-ui/target/surefire-reports>

[INFO] 
[INFO] --- maven-surefire-plugin:2.7.2:test (default-test) @ org.apache.sling.samples.accessmanager.ui
---

-------------------------------------------------------
 T E S T S
-------------------------------------------------------
There are no tests to run.

Results :

Tests run: 0, Failures: 0, Errors: 0, Skipped: 0

mojoSucceeded org.apache.maven.plugins:maven-surefire-plugin:2.7.2(default-test)
[JENKINS] Recording test results[INFO] Checking unresolved references to org.codehaus.mojo.signature:java15:1.0

mojoStarted org.codehaus.mojo:animal-sniffer-maven-plugin:1.7(default)
[INFO] 
[INFO] --- animal-sniffer-maven-plugin:1.7:check (default) @ org.apache.sling.samples.accessmanager.ui
---
mojoSucceeded org.codehaus.mojo:animal-sniffer-maven-plugin:1.7(default)
mojoStarted org.apache.felix:maven-bundle-plugin:2.0.1(default-bundle)[WARNING] Warning building
bundle org.apache.sling.samples:org.apache.sling.samples.accessmanager.ui:bundle:0.9-SNAPSHOT
: Did not find matching referal for *

[INFO] 
[INFO] --- maven-bundle-plugin:2.0.1:bundle (default-bundle) @ org.apache.sling.samples.accessmanager.ui
---
mojoSucceeded org.apache.felix:maven-bundle-plugin:2.0.1(default-bundle)
forkedProjectStarted org.apache.sling.samples:org.apache.sling.samples.accessmanager.ui:0.9-SNAPSHOT
mojoStarted org.apache.maven.plugins:maven-enforcer-plugin:1.0(enforce-java)
[INFO] 
[INFO] --- maven-enforcer-plugin:1.0:enforce (enforce-java) @ org.apache.sling.samples.accessmanager.ui
---
mojoSucceeded org.apache.maven.plugins:maven-enforcer-plugin:1.0(enforce-java)
Jun 8, 2012 10:19:09 AM hudson.maven.ExecutedMojo <init>
forkedProjectSucceeded org.apache.sling.samples:org.apache.sling.samples.accessmanager.ui:0.9-SNAPSHOTWARNING:
Failed to getClass for org.apache.maven.plugin.source.SourceJarMojo

mojoStarted org.apache.maven.plugins:maven-source-plugin:2.1.2(attach-sources)
[INFO] 
[INFO] --- maven-source-plugin:2.1.2:jar (attach-sources) @ org.apache.sling.samples.accessmanager.ui
---
[INFO] META-INF already added, skipping
[INFO] META-INF/LICENSE already added, skipping
[INFO] META-INF/NOTICE already added, skipping
[INFO] META-INF/DEPENDENCIES already added, skipping
[INFO] Building jar: <https://builds.apache.org/job/sling-samples-1.5/ws/contrib-1.5/accessmanager-ui/target/org.apache.sling.samples.accessmanager.ui-0.9-SNAPSHOT-sources.jar>
[INFO] META-INF already added, skipping
[INFO] META-INF/LICENSE already added, skipping
[INFO] META-INF/NOTICE already added, skipping
[INFO] META-INF/DEPENDENCIES already added, skipping
mojoSucceeded org.apache.maven.plugins:maven-source-plugin:2.1.2(attach-sources)
mojoStarted org.codehaus.mojo:ianal-maven-plugin:1.0-alpha-1(default)[INFO] Checking legal
files in: org.apache.sling.samples.accessmanager.ui-0.9-SNAPSHOT.jar
[INFO] Checking legal files in: org.apache.sling.samples.accessmanager.ui-0.9-SNAPSHOT-sources.jar

[INFO] 
[INFO] --- ianal-maven-plugin:1.0-alpha-1:verify-legal-files (default) @ org.apache.sling.samples.accessmanager.ui
---
mojoSucceeded org.codehaus.mojo:ianal-maven-plugin:1.0-alpha-1(default)
mojoStarted org.apache.maven.plugins:maven-install-plugin:2.3.1(default-install)[INFO] Installing
<https://builds.apache.org/job/sling-samples-1.5/ws/contrib-1.5/accessmanager-ui/target/org.apache.sling.samples.accessmanager.ui-0.9-SNAPSHOT.jar>
to /home/jenkins/jenkins-slave/maven-repositories/1/org/apache/sling/samples/org.apache.sling.samples.accessmanager.ui/0.9-SNAPSHOT/org.apache.sling.samples.accessmanager.ui-0.9-SNAPSHOT.jar
[INFO] Installing <https://builds.apache.org/job/sling-samples-1.5/ws/contrib-1.5/accessmanager-ui/pom.xml>
to /home/jenkins/jenkins-slave/maven-repositories/1/org/apache/sling/samples/org.apache.sling.samples.accessmanager.ui/0.9-SNAPSHOT/org.apache.sling.samples.accessmanager.ui-0.9-SNAPSHOT.pom
[INFO] Installing <https://builds.apache.org/job/sling-samples-1.5/ws/contrib-1.5/accessmanager-ui/target/org.apache.sling.samples.accessmanager.ui-0.9-SNAPSHOT-sources.jar>
to /home/jenkins/jenkins-slave/maven-repositories/1/org/apache/sling/samples/org.apache.sling.samples.accessmanager.ui/0.9-SNAPSHOT/org.apache.sling.samples.accessmanager.ui-0.9-SNAPSHOT-sources.jar

[INFO] 
[INFO] --- maven-install-plugin:2.3.1:install (default-install) @ org.apache.sling.samples.accessmanager.ui
---
mojoSucceeded org.apache.maven.plugins:maven-install-plugin:2.3.1(default-install)
mojoStarted org.apache.felix:maven-bundle-plugin:2.0.1(default-install)[INFO] Local OBR update
disabled (enable with -DobrRepository)

[INFO] 
[INFO] --- maven-bundle-plugin:2.0.1:install (default-install) @ org.apache.sling.samples.accessmanager.ui
---
mojoSucceeded org.apache.felix:maven-bundle-plugin:2.0.1(default-install)
projectSucceeded org.apache.sling.samples:org.apache.sling.samples.accessmanager.ui:0.9-SNAPSHOT
projectStarted org.apache.sling:sling-samples-builder:2-SNAPSHOT
[INFO]                                                                         
[INFO] ------------------------------------------------------------------------
[INFO] Building Apache Sling Samples (Builder) 2-SNAPSHOT
[INFO] ------------------------------------------------------------------------
mojoStarted org.apache.maven.plugins:maven-clean-plugin:2.4.1(default-clean)
[INFO] 
[INFO] --- maven-clean-plugin:2.4.1:clean (default-clean) @ sling-samples-builder ---
mojoSucceeded org.apache.maven.plugins:maven-clean-plugin:2.4.1(default-clean)
mojoStarted org.apache.maven.plugins:maven-install-plugin:2.3.1(default-install)[INFO] Installing
<https://builds.apache.org/job/sling-samples-1.5/ws/contrib-1.5/pom.xml> to /home/jenkins/jenkins-slave/maven-repositories/1/org/apache/sling/sling-samples-builder/2-SNAPSHOT/sling-samples-builder-2-SNAPSHOT.pom

[INFO] 
[INFO] --- maven-install-plugin:2.3.1:install (default-install) @ sling-samples-builder ---
mojoSucceeded org.apache.maven.plugins:maven-install-plugin:2.3.1(default-install)
projectSucceeded org.apache.sling:sling-samples-builder:2-SNAPSHOT
sessionEnded
[INFO] ------------------------------------------------------------------------
[INFO] Reactor Summary:
[INFO] 
[INFO] Apache Sling ESP blog sample ...................... SUCCESS [25.820s]
[INFO] Apache Sling Javashell sample ..................... SUCCESS [3.677s]
[INFO] Apache Sling Sample Path Based Resource Type Provider  SUCCESS [12.275s]
[INFO] Apache Sling Sample Post Servlet Extensions ....... SUCCESS [5.304s]
[INFO] Apache Sling Sample Application ................... SUCCESS [8.900s]
[INFO] Apache Sling - Slingshot Demo ..................... SUCCESS [8.195s]
[INFO] Apache Sling Webloader Service .................... SUCCESS [4.502s]
[INFO] Apache Sling Webloader User Interface ............. SUCCESS [3.677s]
[INFO] Apache Sling Sample Custom Login Form ............. SUCCESS [3.568s]
[INFO] Apache Sling Slingbucks - sample coffee store management application  SUCCESS [4.354s]
[INFO] Dependency Install Sample ......................... SUCCESS [3.157s]
[INFO] Apache Sling Sample Framework Fragment Bundle ..... SUCCESS [7.271s]
[INFO] Apache Sling User Manager UI sample ............... SUCCESS [7.514s]
[INFO] Apache Sling Access Manager UI sample ............. SUCCESS [4.398s]
[INFO] Apache Sling Samples (Builder) .................... SUCCESS [0.351s]
[INFO] ------------------------------------------------------------------------
[INFO] BUILD SUCCESS
[INFO] ------------------------------------------------------------------------
[INFO] Total time: 1:48.389s
[INFO] Finished at: Fri Jun 08 10:19:11 UTC 2012
[INFO] Final Memory: 46M/96M
[INFO] ------------------------------------------------------------------------
Projects to build: [MavenProject: org.apache.sling.samples:org.apache.sling.samples.espblog:2.0.3-SNAPSHOT
@ <https://builds.apache.org/job/sling-samples-1.5/ws/contrib-1.5/espblog/pom.xml,>
MavenProject: org.apache.sling.samples:org.apache.sling.samples.javashell:2.0.3-SNAPSHOT @
<https://builds.apache.org/job/sling-samples-1.5/ws/contrib-1.5/javashell/pom.xml,>
MavenProject: org.apache.sling.samples:org.apache.sling.samples.path-based.rtp:2.0.5-SNAPSHOT
@ <https://builds.apache.org/job/sling-samples-1.5/ws/contrib-1.5/path-based-rtp/pom.xml,>
MavenProject: org.apache.sling.samples:org.apache.sling.samples.post-servlet-extensions:0.1.0-SNAPSHOT
@ <https://builds.apache.org/job/sling-samples-1.5/ws/contrib-1.5/post-servlet-extensions/pom.xml,>
MavenProject: org.apache.sling.samples:org.apache.sling.samples.simple-demo:2.0.3-SNAPSHOT
@ <https://builds.apache.org/job/sling-samples-1.5/ws/contrib-1.5/simple-demo/pom.xml,>
MavenProject: org.apache.sling:org.apache.sling.sample.slingshot:0.8.0-SNAPSHOT @ <https://builds.apache.org/job/sling-samples-1.5/ws/contrib-1.5/slingshot/pom.xml,>
MavenProject: org.apache.sling.samples:org.apache.sling.samples.webloader.service:2.0.3-SNAPSHOT
@ <https://builds.apache.org/job/sling-samples-1.5/ws/contrib-1.5/webloader/service/pom.xml,>
MavenProject: org.apache.sling.samples:org.apache.sling.samples.webloader.ui:2.0.3-SNAPSHOT
@ <https://builds.apache.org/job/sling-samples-1.5/ws/contrib-1.5/webloader/ui/pom.xml,>
MavenProject: org.apache.sling.samples:org.apache.sling.samples.custom-login-form:0.0.1-SNAPSHOT
@ <https://builds.apache.org/job/sling-samples-1.5/ws/contrib-1.5/custom-login-form/pom.xml,>
MavenProject: org.apache.sling:org.apache.sling.samples.slingbucks:0.9.9-SNAPSHOT @ <https://builds.apache.org/job/sling-samples-1.5/ws/contrib-1.5/slingbucks/pom.xml,>
MavenProject: org.apache.sling:installing-dependencies-sample:0.0.1-SNAPSHOT @ <https://builds.apache.org/job/sling-samples-1.5/ws/contrib-1.5/installing-dependencies/pom.xml,>
MavenProject: org.apache.sling:org.apache.sling.samples.frameworkfragment:0.9.9-SNAPSHOT @
<https://builds.apache.org/job/sling-samples-1.5/ws/contrib-1.5/framework-fragment/pom.xml,>
MavenProject: org.apache.sling.samples:org.apache.sling.samples.usermanager.ui:0.9-SNAPSHOT
@ <https://builds.apache.org/job/sling-samples-1.5/ws/contrib-1.5/usermanager-ui/pom.xml,>
MavenProject: org.apache.sling.samples:org.apache.sling.samples.accessmanager.ui:0.9-SNAPSHOT
@ <https://builds.apache.org/job/sling-samples-1.5/ws/contrib-1.5/accessmanager-ui/pom.xml,>
MavenProject: org.apache.sling:sling-samples-builder:2-SNAPSHOT @ <https://builds.apache.org/job/sling-samples-1.5/ws/contrib-1.5/pom.xml]>
[JENKINS] Archiving <https://builds.apache.org/job/sling-samples-1.5/ws/contrib-1.5/usermanager-ui/pom.xml>
to /home/hudson/hudson/jobs/sling-samples-1.5/modules/org.apache.sling.samples$org.apache.sling.samples.usermanager.ui/builds/2012-06-08_10-17-09/archive/org.apache.sling.samples/org.apache.sling.samples.usermanager.ui/0.9-SNAPSHOT/org.apache.sling.samples.usermanager.ui-0.9-SNAPSHOT.pom
[JENKINS] Archiving <https://builds.apache.org/job/sling-samples-1.5/ws/contrib-1.5/usermanager-ui/target/org.apache.sling.samples.usermanager.ui-0.9-SNAPSHOT.jar>
to /home/hudson/hudson/jobs/sling-samples-1.5/modules/org.apache.sling.samples$org.apache.sling.samples.usermanager.ui/builds/2012-06-08_10-17-09/archive/org.apache.sling.samples/org.apache.sling.samples.usermanager.ui/0.9-SNAPSHOT/org.apache.sling.samples.usermanager.ui-0.9-SNAPSHOT.jar
[JENKINS] Archiving <https://builds.apache.org/job/sling-samples-1.5/ws/contrib-1.5/usermanager-ui/target/org.apache.sling.samples.usermanager.ui-0.9-SNAPSHOT-sources.jar>
to /home/hudson/hudson/jobs/sling-samples-1.5/modules/org.apache.sling.samples$org.apache.sling.samples.usermanager.ui/builds/2012-06-08_10-17-09/archive/org.apache.sling.samples/org.apache.sling.samples.usermanager.ui/0.9-SNAPSHOT/org.apache.sling.samples.usermanager.ui-0.9-SNAPSHOT-sources.jar
[JENKINS] Archiving <https://builds.apache.org/job/sling-samples-1.5/ws/contrib-1.5/installing-dependencies/pom.xml>
to /home/hudson/hudson/jobs/sling-samples-1.5/modules/org.apache.sling$installing-dependencies-sample/builds/2012-06-08_10-17-09/archive/org.apache.sling/installing-dependencies-sample/0.0.1-SNAPSHOT/installing-dependencies-sample-0.0.1-SNAPSHOT.pom
[JENKINS] Archiving <https://builds.apache.org/job/sling-samples-1.5/ws/contrib-1.5/installing-dependencies/target/installing-dependencies-sample-0.0.1-SNAPSHOT.jar>
to /home/hudson/hudson/jobs/sling-samples-1.5/modules/org.apache.sling$installing-dependencies-sample/builds/2012-06-08_10-17-09/archive/org.apache.sling/installing-dependencies-sample/0.0.1-SNAPSHOT/installing-dependencies-sample-0.0.1-SNAPSHOT.jar
[JENKINS] Archiving <https://builds.apache.org/job/sling-samples-1.5/ws/contrib-1.5/espblog/pom.xml>
to /home/hudson/hudson/jobs/sling-samples-1.5/modules/org.apache.sling.samples$org.apache.sling.samples.espblog/builds/2012-06-08_10-17-09/archive/org.apache.sling.samples/org.apache.sling.samples.espblog/2.0.3-SNAPSHOT/org.apache.sling.samples.espblog-2.0.3-SNAPSHOT.pom
[JENKINS] Archiving <https://builds.apache.org/job/sling-samples-1.5/ws/contrib-1.5/espblog/target/org.apache.sling.samples.espblog-2.0.3-SNAPSHOT.jar>
to /home/hudson/hudson/jobs/sling-samples-1.5/modules/org.apache.sling.samples$org.apache.sling.samples.espblog/builds/2012-06-08_10-17-09/archive/org.apache.sling.samples/org.apache.sling.samples.espblog/2.0.3-SNAPSHOT/org.apache.sling.samples.espblog-2.0.3-SNAPSHOT.jar
[JENKINS] Archiving <https://builds.apache.org/job/sling-samples-1.5/ws/contrib-1.5/espblog/target/org.apache.sling.samples.espblog-2.0.3-SNAPSHOT-sources.jar>
to /home/hudson/hudson/jobs/sling-samples-1.5/modules/org.apache.sling.samples$org.apache.sling.samples.espblog/builds/2012-06-08_10-17-09/archive/org.apache.sling.samples/org.apache.sling.samples.espblog/2.0.3-SNAPSHOT/org.apache.sling.samples.espblog-2.0.3-SNAPSHOT-sources.jar
[JENKINS] Archiving <https://builds.apache.org/job/sling-samples-1.5/ws/contrib-1.5/custom-login-form/pom.xml>
to /home/hudson/hudson/jobs/sling-samples-1.5/modules/org.apache.sling.samples$org.apache.sling.samples.custom-login-form/builds/2012-06-08_10-17-09/archive/org.apache.sling.samples/org.apache.sling.samples.custom-login-form/0.0.1-SNAPSHOT/org.apache.sling.samples.custom-login-form-0.0.1-SNAPSHOT.pom
[JENKINS] Archiving <https://builds.apache.org/job/sling-samples-1.5/ws/contrib-1.5/custom-login-form/target/org.apache.sling.samples.custom-login-form-0.0.1-SNAPSHOT.jar>
to /home/hudson/hudson/jobs/sling-samples-1.5/modules/org.apache.sling.samples$org.apache.sling.samples.custom-login-form/builds/2012-06-08_10-17-09/archive/org.apache.sling.samples/org.apache.sling.samples.custom-login-form/0.0.1-SNAPSHOT/org.apache.sling.samples.custom-login-form-0.0.1-SNAPSHOT.jar
[JENKINS] Archiving <https://builds.apache.org/job/sling-samples-1.5/ws/contrib-1.5/custom-login-form/target/org.apache.sling.samples.custom-login-form-0.0.1-SNAPSHOT-sources.jar>
to /home/hudson/hudson/jobs/sling-samples-1.5/modules/org.apache.sling.samples$org.apache.sling.samples.custom-login-form/builds/2012-06-08_10-17-09/archive/org.apache.sling.samples/org.apache.sling.samples.custom-login-form/0.0.1-SNAPSHOT/org.apache.sling.samples.custom-login-form-0.0.1-SNAPSHOT-sources.jar
[JENKINS] Archiving <https://builds.apache.org/job/sling-samples-1.5/ws/contrib-1.5/accessmanager-ui/pom.xml>
to /home/hudson/hudson/jobs/sling-samples-1.5/modules/org.apache.sling.samples$org.apache.sling.samples.accessmanager.ui/builds/2012-06-08_10-17-09/archive/org.apache.sling.samples/org.apache.sling.samples.accessmanager.ui/0.9-SNAPSHOT/org.apache.sling.samples.accessmanager.ui-0.9-SNAPSHOT.pom
[JENKINS] Archiving <https://builds.apache.org/job/sling-samples-1.5/ws/contrib-1.5/accessmanager-ui/target/org.apache.sling.samples.accessmanager.ui-0.9-SNAPSHOT.jar>
to /home/hudson/hudson/jobs/sling-samples-1.5/modules/org.apache.sling.samples$org.apache.sling.samples.accessmanager.ui/builds/2012-06-08_10-17-09/archive/org.apache.sling.samples/org.apache.sling.samples.accessmanager.ui/0.9-SNAPSHOT/org.apache.sling.samples.accessmanager.ui-0.9-SNAPSHOT.jar
[JENKINS] Archiving <https://builds.apache.org/job/sling-samples-1.5/ws/contrib-1.5/accessmanager-ui/target/org.apache.sling.samples.accessmanager.ui-0.9-SNAPSHOT-sources.jar>
to /home/hudson/hudson/jobs/sling-samples-1.5/modules/org.apache.sling.samples$org.apache.sling.samples.accessmanager.ui/builds/2012-06-08_10-17-09/archive/org.apache.sling.samples/org.apache.sling.samples.accessmanager.ui/0.9-SNAPSHOT/org.apache.sling.samples.accessmanager.ui-0.9-SNAPSHOT-sources.jar
[JENKINS] Archiving <https://builds.apache.org/job/sling-samples-1.5/ws/contrib-1.5/post-servlet-extensions/pom.xml>
to /home/hudson/hudson/jobs/sling-samples-1.5/modules/org.apache.sling.samples$org.apache.sling.samples.post-servlet-extensions/builds/2012-06-08_10-17-09/archive/org.apache.sling.samples/org.apache.sling.samples.post-servlet-extensions/0.1.0-SNAPSHOT/org.apache.sling.samples.post-servlet-extensions-0.1.0-SNAPSHOT.pom
[JENKINS] Archiving <https://builds.apache.org/job/sling-samples-1.5/ws/contrib-1.5/post-servlet-extensions/target/org.apache.sling.samples.post-servlet-extensions-0.1.0-SNAPSHOT.jar>
to /home/hudson/hudson/jobs/sling-samples-1.5/modules/org.apache.sling.samples$org.apache.sling.samples.post-servlet-extensions/builds/2012-06-08_10-17-09/archive/org.apache.sling.samples/org.apache.sling.samples.post-servlet-extensions/0.1.0-SNAPSHOT/org.apache.sling.samples.post-servlet-extensions-0.1.0-SNAPSHOT.jar
[JENKINS] Archiving <https://builds.apache.org/job/sling-samples-1.5/ws/contrib-1.5/post-servlet-extensions/target/org.apache.sling.samples.post-servlet-extensions-0.1.0-SNAPSHOT-sources.jar>
to /home/hudson/hudson/jobs/sling-samples-1.5/modules/org.apache.sling.samples$org.apache.sling.samples.post-servlet-extensions/builds/2012-06-08_10-17-09/archive/org.apache.sling.samples/org.apache.sling.samples.post-servlet-extensions/0.1.0-SNAPSHOT/org.apache.sling.samples.post-servlet-extensions-0.1.0-SNAPSHOT-sources.jar
[JENKINS] Archiving <https://builds.apache.org/job/sling-samples-1.5/ws/contrib-1.5/simple-demo/pom.xml>
to /home/hudson/hudson/jobs/sling-samples-1.5/modules/org.apache.sling.samples$org.apache.sling.samples.simple-demo/builds/2012-06-08_10-17-09/archive/org.apache.sling.samples/org.apache.sling.samples.simple-demo/2.0.3-SNAPSHOT/org.apache.sling.samples.simple-demo-2.0.3-SNAPSHOT.pom
[JENKINS] Archiving <https://builds.apache.org/job/sling-samples-1.5/ws/contrib-1.5/simple-demo/target/org.apache.sling.samples.simple-demo-2.0.3-SNAPSHOT.jar>
to /home/hudson/hudson/jobs/sling-samples-1.5/modules/org.apache.sling.samples$org.apache.sling.samples.simple-demo/builds/2012-06-08_10-17-09/archive/org.apache.sling.samples/org.apache.sling.samples.simple-demo/2.0.3-SNAPSHOT/org.apache.sling.samples.simple-demo-2.0.3-SNAPSHOT.jar
[JENKINS] Archiving <https://builds.apache.org/job/sling-samples-1.5/ws/contrib-1.5/simple-demo/target/org.apache.sling.samples.simple-demo-2.0.3-SNAPSHOT-sources.jar>
to /home/hudson/hudson/jobs/sling-samples-1.5/modules/org.apache.sling.samples$org.apache.sling.samples.simple-demo/builds/2012-06-08_10-17-09/archive/org.apache.sling.samples/org.apache.sling.samples.simple-demo/2.0.3-SNAPSHOT/org.apache.sling.samples.simple-demo-2.0.3-SNAPSHOT-sources.jar
[JENKINS] Archiving <https://builds.apache.org/job/sling-samples-1.5/ws/contrib-1.5/pom.xml>
to /home/hudson/hudson/jobs/sling-samples-1.5/modules/org.apache.sling$sling-samples-builder/builds/2012-06-08_10-17-09/archive/org.apache.sling/sling-samples-builder/2-SNAPSHOT/sling-samples-builder-2-SNAPSHOT.pom
[JENKINS] Archiving <https://builds.apache.org/job/sling-samples-1.5/ws/contrib-1.5/slingshot/pom.xml>
to /home/hudson/hudson/jobs/sling-samples-1.5/modules/org.apache.sling$org.apache.sling.sample.slingshot/builds/2012-06-08_10-17-09/archive/org.apache.sling/org.apache.sling.sample.slingshot/0.8.0-SNAPSHOT/org.apache.sling.sample.slingshot-0.8.0-SNAPSHOT.pom
[JENKINS] Archiving <https://builds.apache.org/job/sling-samples-1.5/ws/contrib-1.5/slingshot/target/org.apache.sling.sample.slingshot-0.8.0-SNAPSHOT.jar>
to /home/hudson/hudson/jobs/sling-samples-1.5/modules/org.apache.sling$org.apache.sling.sample.slingshot/builds/2012-06-08_10-17-09/archive/org.apache.sling/org.apache.sling.sample.slingshot/0.8.0-SNAPSHOT/org.apache.sling.sample.slingshot-0.8.0-SNAPSHOT.jar
[JENKINS] Archiving <https://builds.apache.org/job/sling-samples-1.5/ws/contrib-1.5/slingshot/target/org.apache.sling.sample.slingshot-0.8.0-SNAPSHOT-sources.jar>
to /home/hudson/hudson/jobs/sling-samples-1.5/modules/org.apache.sling$org.apache.sling.sample.slingshot/builds/2012-06-08_10-17-09/archive/org.apache.sling/org.apache.sling.sample.slingshot/0.8.0-SNAPSHOT/org.apache.sling.sample.slingshot-0.8.0-SNAPSHOT-sources.jar
[JENKINS] Archiving <https://builds.apache.org/job/sling-samples-1.5/ws/contrib-1.5/path-based-rtp/pom.xml>
to /home/hudson/hudson/jobs/sling-samples-1.5/modules/org.apache.sling.samples$org.apache.sling.samples.path-based.rtp/builds/2012-06-08_10-17-09/archive/org.apache.sling.samples/org.apache.sling.samples.path-based.rtp/2.0.5-SNAPSHOT/org.apache.sling.samples.path-based.rtp-2.0.5-SNAPSHOT.pom
[JENKINS] Archiving <https://builds.apache.org/job/sling-samples-1.5/ws/contrib-1.5/path-based-rtp/target/org.apache.sling.samples.path-based.rtp-2.0.5-SNAPSHOT.jar>
to /home/hudson/hudson/jobs/sling-samples-1.5/modules/org.apache.sling.samples$org.apache.sling.samples.path-based.rtp/builds/2012-06-08_10-17-09/archive/org.apache.sling.samples/org.apache.sling.samples.path-based.rtp/2.0.5-SNAPSHOT/org.apache.sling.samples.path-based.rtp-2.0.5-SNAPSHOT.jar
[JENKINS] Archiving <https://builds.apache.org/job/sling-samples-1.5/ws/contrib-1.5/path-based-rtp/target/org.apache.sling.samples.path-based.rtp-2.0.5-SNAPSHOT-sources.jar>
to /home/hudson/hudson/jobs/sling-samples-1.5/modules/org.apache.sling.samples$org.apache.sling.samples.path-based.rtp/builds/2012-06-08_10-17-09/archive/org.apache.sling.samples/org.apache.sling.samples.path-based.rtp/2.0.5-SNAPSHOT/org.apache.sling.samples.path-based.rtp-2.0.5-SNAPSHOT-sources.jar
[JENKINS] Archiving <https://builds.apache.org/job/sling-samples-1.5/ws/contrib-1.5/javashell/pom.xml>
to /home/hudson/hudson/jobs/sling-samples-1.5/modules/org.apache.sling.samples$org.apache.sling.samples.javashell/builds/2012-06-08_10-17-09/archive/org.apache.sling.samples/org.apache.sling.samples.javashell/2.0.3-SNAPSHOT/org.apache.sling.samples.javashell-2.0.3-SNAPSHOT.pom
[JENKINS] Archiving <https://builds.apache.org/job/sling-samples-1.5/ws/contrib-1.5/javashell/target/org.apache.sling.samples.javashell-2.0.3-SNAPSHOT.jar>
to /home/hudson/hudson/jobs/sling-samples-1.5/modules/org.apache.sling.samples$org.apache.sling.samples.javashell/builds/2012-06-08_10-17-09/archive/org.apache.sling.samples/org.apache.sling.samples.javashell/2.0.3-SNAPSHOT/org.apache.sling.samples.javashell-2.0.3-SNAPSHOT.jar
[JENKINS] Archiving <https://builds.apache.org/job/sling-samples-1.5/ws/contrib-1.5/javashell/target/org.apache.sling.samples.javashell-2.0.3-SNAPSHOT-sources.jar>
to /home/hudson/hudson/jobs/sling-samples-1.5/modules/org.apache.sling.samples$org.apache.sling.samples.javashell/builds/2012-06-08_10-17-09/archive/org.apache.sling.samples/org.apache.sling.samples.javashell/2.0.3-SNAPSHOT/org.apache.sling.samples.javashell-2.0.3-SNAPSHOT-sources.jar
[JENKINS] Archiving <https://builds.apache.org/job/sling-samples-1.5/ws/contrib-1.5/webloader/ui/pom.xml>
to /home/hudson/hudson/jobs/sling-samples-1.5/modules/org.apache.sling.samples$org.apache.sling.samples.webloader.ui/builds/2012-06-08_10-17-09/archive/org.apache.sling.samples/org.apache.sling.samples.webloader.ui/2.0.3-SNAPSHOT/org.apache.sling.samples.webloader.ui-2.0.3-SNAPSHOT.pom
[JENKINS] Archiving <https://builds.apache.org/job/sling-samples-1.5/ws/contrib-1.5/webloader/ui/target/org.apache.sling.samples.webloader.ui-2.0.3-SNAPSHOT.jar>
to /home/hudson/hudson/jobs/sling-samples-1.5/modules/org.apache.sling.samples$org.apache.sling.samples.webloader.ui/builds/2012-06-08_10-17-09/archive/org.apache.sling.samples/org.apache.sling.samples.webloader.ui/2.0.3-SNAPSHOT/org.apache.sling.samples.webloader.ui-2.0.3-SNAPSHOT.jar
[JENKINS] Archiving <https://builds.apache.org/job/sling-samples-1.5/ws/contrib-1.5/webloader/ui/target/org.apache.sling.samples.webloader.ui-2.0.3-SNAPSHOT-sources.jar>
to /home/hudson/hudson/jobs/sling-samples-1.5/modules/org.apache.sling.samples$org.apache.sling.samples.webloader.ui/builds/2012-06-08_10-17-09/archive/org.apache.sling.samples/org.apache.sling.samples.webloader.ui/2.0.3-SNAPSHOT/org.apache.sling.samples.webloader.ui-2.0.3-SNAPSHOT-sources.jar
[JENKINS] Archiving <https://builds.apache.org/job/sling-samples-1.5/ws/contrib-1.5/webloader/service/pom.xml>
to /home/hudson/hudson/jobs/sling-samples-1.5/modules/org.apache.sling.samples$org.apache.sling.samples.webloader.service/builds/2012-06-08_10-17-09/archive/org.apache.sling.samples/org.apache.sling.samples.webloader.service/2.0.3-SNAPSHOT/org.apache.sling.samples.webloader.service-2.0.3-SNAPSHOT.pom
[JENKINS] Archiving <https://builds.apache.org/job/sling-samples-1.5/ws/contrib-1.5/webloader/service/target/org.apache.sling.samples.webloader.service-2.0.3-SNAPSHOT.jar>
to /home/hudson/hudson/jobs/sling-samples-1.5/modules/org.apache.sling.samples$org.apache.sling.samples.webloader.service/builds/2012-06-08_10-17-09/archive/org.apache.sling.samples/org.apache.sling.samples.webloader.service/2.0.3-SNAPSHOT/org.apache.sling.samples.webloader.service-2.0.3-SNAPSHOT.jar
[JENKINS] Archiving <https://builds.apache.org/job/sling-samples-1.5/ws/contrib-1.5/webloader/service/target/org.apache.sling.samples.webloader.service-2.0.3-SNAPSHOT-sources.jar>
to /home/hudson/hudson/jobs/sling-samples-1.5/modules/org.apache.sling.samples$org.apache.sling.samples.webloader.service/builds/2012-06-08_10-17-09/archive/org.apache.sling.samples/org.apache.sling.samples.webloader.service/2.0.3-SNAPSHOT/org.apache.sling.samples.webloader.service-2.0.3-SNAPSHOT-sources.jar
[JENKINS] Archiving <https://builds.apache.org/job/sling-samples-1.5/ws/contrib-1.5/slingbucks/pom.xml>
to /home/hudson/hudson/jobs/sling-samples-1.5/modules/org.apache.sling$org.apache.sling.samples.slingbucks/builds/2012-06-08_10-17-09/archive/org.apache.sling/org.apache.sling.samples.slingbucks/0.9.9-SNAPSHOT/org.apache.sling.samples.slingbucks-0.9.9-SNAPSHOT.pom
[JENKINS] Archiving <https://builds.apache.org/job/sling-samples-1.5/ws/contrib-1.5/slingbucks/target/org.apache.sling.samples.slingbucks-0.9.9-SNAPSHOT.jar>
to /home/hudson/hudson/jobs/sling-samples-1.5/modules/org.apache.sling$org.apache.sling.samples.slingbucks/builds/2012-06-08_10-17-09/archive/org.apache.sling/org.apache.sling.samples.slingbucks/0.9.9-SNAPSHOT/org.apache.sling.samples.slingbucks-0.9.9-SNAPSHOT.jar
[JENKINS] Archiving <https://builds.apache.org/job/sling-samples-1.5/ws/contrib-1.5/slingbucks/target/org.apache.sling.samples.slingbucks-0.9.9-SNAPSHOT-sources.jar>
to /home/hudson/hudson/jobs/sling-samples-1.5/modules/org.apache.sling$org.apache.sling.samples.slingbucks/builds/2012-06-08_10-17-09/archive/org.apache.sling/org.apache.sling.samples.slingbucks/0.9.9-SNAPSHOT/org.apache.sling.samples.slingbucks-0.9.9-SNAPSHOT-sources.jar
[JENKINS] Archiving <https://builds.apache.org/job/sling-samples-1.5/ws/contrib-1.5/framework-fragment/pom.xml>
to /home/hudson/hudson/jobs/sling-samples-1.5/modules/org.apache.sling$org.apache.sling.samples.frameworkfragment/builds/2012-06-08_10-17-09/archive/org.apache.sling/org.apache.sling.samples.frameworkfragment/0.9.9-SNAPSHOT/org.apache.sling.samples.frameworkfragment-0.9.9-SNAPSHOT.pom
[JENKINS] Archiving <https://builds.apache.org/job/sling-samples-1.5/ws/contrib-1.5/framework-fragment/target/org.apache.sling.samples.frameworkfragment-0.9.9-SNAPSHOT.jar>
to /home/hudson/hudson/jobs/sling-samples-1.5/modules/org.apache.sling$org.apache.sling.samples.frameworkfragment/builds/2012-06-08_10-17-09/archive/org.apache.sling/org.apache.sling.samples.frameworkfragment/0.9.9-SNAPSHOT/org.apache.sling.samples.frameworkfragment-0.9.9-SNAPSHOT.jar
[JENKINS] Archiving <https://builds.apache.org/job/sling-samples-1.5/ws/contrib-1.5/framework-fragment/target/org.apache.sling.samples.frameworkfragment-0.9.9-SNAPSHOT-sources.jar>
to /home/hudson/hudson/jobs/sling-samples-1.5/modules/org.apache.sling$org.apache.sling.samples.frameworkfragment/builds/2012-06-08_10-17-09/archive/org.apache.sling/org.apache.sling.samples.frameworkfragment/0.9.9-SNAPSHOT/org.apache.sling.samples.frameworkfragment-0.9.9-SNAPSHOT-sources.jar
Waiting for Jenkins to finish collecting data
channel stopped
[locks-and-latches] Releasing all the locks
[locks-and-latches] All the locks released
Maven RedeployPublished use remote ubuntu1 maven settings from : /home/jenkins/.m2/settings.xml
[ERROR] uniqueVersion == false is not anymore supported in maven 3
[INFO] Deployment in https://repository.apache.org/content/repositories/snapshots/ (id=,uniqueVersion=false)
Deploying the main artifact installing-dependencies-sample-0.0.1-SNAPSHOT.jar
Downloading: https://repository.apache.org/content/repositories/snapshots/org/apache/sling/installing-dependencies-sample/0.0.1-SNAPSHOT/maven-metadata.xml
Downloaded: https://repository.apache.org/content/repositories/snapshots/org/apache/sling/installing-dependencies-sample/0.0.1-SNAPSHOT/maven-metadata.xml
(292 B at 0.4 KB/sec)
Uploading: https://repository.apache.org/content/repositories/snapshots/org/apache/sling/installing-dependencies-sample/0.0.1-SNAPSHOT/installing-dependencies-sample-0.0.1-20120608.101929-1.jar
Uploading: https://repository.apache.org/content/repositories/snapshots/org/apache/sling/installing-dependencies-sample/0.0.1-SNAPSHOT/installing-dependencies-sample-0.0.1-20120608.101929-1.pom
ERROR: Failed to deploy artifacts: Could not transfer artifact org.apache.sling:installing-dependencies-sample:jar:0.0.1-20120608.101929-1
from/to  (https://repository.apache.org/content/repositories/snapshots/): Failed to transfer
file: https://repository.apache.org/content/repositories/snapshots/org/apache/sling/installing-dependencies-sample/0.0.1-SNAPSHOT/installing-dependencies-sample-0.0.1-20120608.101929-1.jar.
Return code is: 401, ReasonPhrase:Unauthorized.
org.apache.maven.artifact.deployer.ArtifactDeploymentException: Failed to deploy artifacts:
Could not transfer artifact org.apache.sling:installing-dependencies-sample:jar:0.0.1-20120608.101929-1
from/to  (https://repository.apache.org/content/repositories/snapshots/): Failed to transfer
file: https://repository.apache.org/content/repositories/snapshots/org/apache/sling/installing-dependencies-sample/0.0.1-SNAPSHOT/installing-dependencies-sample-0.0.1-20120608.101929-1.jar.
Return code is: 401, ReasonPhrase:Unauthorized.
	at org.apache.maven.artifact.deployer.DefaultArtifactDeployer.deploy(DefaultArtifactDeployer.java:141)
	at hudson.maven.reporters.MavenArtifactRecord.deploy(MavenArtifactRecord.java:182)
	at hudson.maven.RedeployPublisher.perform(RedeployPublisher.java:174)
	at hudson.tasks.BuildStepMonitor$1.perform(BuildStepMonitor.java:19)
	at hudson.model.AbstractBuild$AbstractRunner.perform(AbstractBuild.java:710)
	at hudson.model.AbstractBuild$AbstractRunner.performAllBuildSteps(AbstractBuild.java:685)
	at hudson.maven.MavenModuleSetBuild$RunnerImpl.post2(MavenModuleSetBuild.java:994)
	at hudson.model.AbstractBuild$AbstractRunner.post(AbstractBuild.java:632)
	at hudson.model.Run.run(Run.java:1459)
	at hudson.maven.MavenModuleSetBuild.run(MavenModuleSetBuild.java:477)
	at hudson.model.ResourceController.execute(ResourceController.java:88)
	at hudson.model.Executor.run(Executor.java:239)
Caused by: org.sonatype.aether.deployment.DeploymentException: Failed to deploy artifacts:
Could not transfer artifact org.apache.sling:installing-dependencies-sample:jar:0.0.1-20120608.101929-1
from/to  (https://repository.apache.org/content/repositories/snapshots/): Failed to transfer
file: https://repository.apache.org/content/repositories/snapshots/org/apache/sling/installing-dependencies-sample/0.0.1-SNAPSHOT/installing-dependencies-sample-0.0.1-20120608.101929-1.jar.
Return code is: 401, ReasonPhrase:Unauthorized.
	at org.sonatype.aether.impl.internal.DefaultDeployer.deploy(DefaultDeployer.java:280)
	at org.sonatype.aether.impl.internal.DefaultDeployer.deploy(DefaultDeployer.java:211)
	at org.sonatype.aether.impl.internal.DefaultRepositorySystem.deploy(DefaultRepositorySystem.java:443)
	at org.apache.maven.artifact.deployer.DefaultArtifactDeployer.deploy(DefaultArtifactDeployer.java:137)
	... 11 more
Caused by: org.sonatype.aether.transfer.ArtifactTransferException: Could not transfer artifact
org.apache.sling:installing-dependencies-sample:jar:0.0.1-20120608.101929-1 from/to  (https://repository.apache.org/content/repositories/snapshots/):
Failed to transfer file: https://repository.apache.org/content/repositories/snapshots/org/apache/sling/installing-dependencies-sample/0.0.1-SNAPSHOT/installing-dependencies-sample-0.0.1-20120608.101929-1.jar.
Return code is: 401, ReasonPhrase:Unauthorized.
	at org.sonatype.aether.connector.wagon.WagonRepositoryConnector$4.wrap(WagonRepositoryConnector.java:951)
	at org.sonatype.aether.connector.wagon.WagonRepositoryConnector$4.wrap(WagonRepositoryConnector.java:941)
	at org.sonatype.aether.connector.wagon.WagonRepositoryConnector$PutTask.run(WagonRepositoryConnector.java:837)
	at org.sonatype.aether.connector.wagon.WagonRepositoryConnector.put(WagonRepositoryConnector.java:467)
	at org.sonatype.aether.impl.internal.DefaultDeployer.deploy(DefaultDeployer.java:274)
	... 14 more
Caused by: org.apache.maven.wagon.TransferFailedException: Failed to transfer file: https://repository.apache.org/content/repositories/snapshots/org/apache/sling/installing-dependencies-sample/0.0.1-SNAPSHOT/installing-dependencies-sample-0.0.1-20120608.101929-1.jar.
Return code is: 401, ReasonPhrase:Unauthorized.
	at org.apache.maven.wagon.shared.http4.AbstractHttpClientWagon.put(AbstractHttpClientWagon.java:562)
	at org.apache.maven.wagon.shared.http4.AbstractHttpClientWagon.put(AbstractHttpClientWagon.java:471)
	at org.apache.maven.wagon.shared.http4.AbstractHttpClientWagon.put(AbstractHttpClientWagon.java:451)
	at org.sonatype.aether.connector.wagon.WagonRepositoryConnector$PutTask.run(WagonRepositoryConnector.java:811)
	... 16 more
[INFO] Deployment failed after 1.1 sec
Build step 'Deploy artifacts to Maven repository' changed build result to FAILURE

Mime
View raw message