sling-dev mailing list archives

Site index · List index
Message view « Date » · « Thread »
Top « Date » · « Thread »
From Apache Jenkins Server <jenk...@builds.apache.org>
Subject Build failed in Jenkins: sling-trunk-1.6 #1293
Date Tue, 03 Apr 2012 15:16:33 GMT
See <https://builds.apache.org/job/sling-trunk-1.6/1293/changes>

Changes:

[cziegeler] Use same maven version as parent pom as required

------------------------------------------
[...truncated 14943 lines...]
18 [main] INFO org.apache.sling.testing.tools.jarexec.JarExecutor - Executing java -Xmx512m
-jar <https://builds.apache.org/job/sling-trunk-1.6/ws/trunk/testing/samples/integration-tests/target/dependency/org.apache.sling.launchpad-6-standalone.jar>
-p 54061
22 [main] INFO org.apache.sling.testing.tools.sling.TimeoutsProvider - Timeout factor set
to 1.0 from system property sling.testing.timeout.multiplier
22 [main] INFO org.apache.sling.testing.samples.integrationtests.http.OsgiConsoleTest - Will
wait up to 60 seconds for server to become ready
24 [main] INFO org.apache.sling.testing.samples.integrationtests.http.OsgiConsoleTest - Checking
that GET requests return expected content (timeout=60 seconds): [/:script src="system/sling.js",
/.explorer.html:href="/libs/sling/explorer/css/explorer.css", /sling-test/sling/sling-test.html:Sling
client library tests]
03.04.2012 15:15:31.726 *INFO* [main] Setting sling.home=sling (default)
03.04.2012 15:15:31.726 *INFO* [main] Starting Sling in sling (<https://builds.apache.org/job/sling-trunk-1.6/ws/trunk/testing/samples/integration-tests/sling)>
03.04.2012 15:15:31.731 *INFO* [main] Checking launcher JAR in folder sling
03.04.2012 15:15:31.742 *INFO* [main] Installing new launcher: jar:<https://builds.apache.org/job/sling-trunk-1.6/ws/trunk/testing/samples/integration-tests/target/dependency/org.apache.sling.launchpad-6-standalone.jar!/resources/org.apache.sling.launchpad.base.jar,>
2.3.0 (org.apache.sling.launchpad.base.jar.1333466131741)
03.04.2012 15:15:31.743 *INFO* [main] Loading launcher class org.apache.sling.launchpad.base.app.MainDelegate
from org.apache.sling.launchpad.base.jar.1333466131741
03.04.2012 15:15:31.753 *INFO* [main] Starting launcher ...
03.04.2012 15:15:31.755 *INFO* [main] HTTP server port: 54061
03.04.2012 15:15:33.372 *INFO* [main] Startup completed
36150 [main] INFO org.apache.sling.testing.samples.integrationtests.http.OsgiConsoleTest -
All 3 paths return expected content, server ready
36151 [main] INFO org.apache.sling.testing.tools.osgi.WebconsoleClient - Installing bundle
org.apache.sling.junit.core-1.0.7-SNAPSHOT.jar
36333 [main] INFO org.apache.sling.testing.tools.osgi.WebconsoleClient - Installing bundle
org.apache.sling.junit.scriptable-1.0.7-SNAPSHOT.jar
36340 [main] INFO org.apache.sling.testing.tools.osgi.WebconsoleClient - Installing bundle
org.apache.sling.testing.samples.sampletests-1.0.7-SNAPSHOT.jar
36347 [main] INFO org.apache.sling.testing.tools.osgi.WebconsoleClient - Installing bundle
org.apache.sling.testing.samples.failingtests-1.0.7-SNAPSHOT.jar
36353 [main] INFO org.apache.sling.testing.tools.osgi.WebconsoleClient - Installing bundle
org.apache.sling.junit.remote-1.0.7-SNAPSHOT.jar
36360 [main] INFO org.apache.sling.testing.tools.osgi.WebconsoleClient - Installing bundle
org.apache.sling.testing.tools-1.0.5-SNAPSHOT.jar
36368 [main] INFO org.apache.sling.testing.tools.osgi.WebconsoleClient - Installing bundle
httpclient-osgi-4.1.2.jar
36380 [main] INFO org.apache.sling.testing.tools.osgi.WebconsoleClient - Installing bundle
httpcore-osgi-4.1.2.jar
36391 [main] INFO org.apache.sling.testing.tools.sling.BundlesInstaller - 8 additional bundles
installed from <https://builds.apache.org/job/sling-trunk-1.6/ws/trunk/testing/samples/integration-tests/target/sling/additional-bundles/org.apache.sling.junit.core-1.0.7-SNAPSHOT.jar>
36398 [main] INFO org.apache.sling.testing.tools.sling.BundlesInstaller - Checking that bundles
are installed (timeout 20 seconds): [org.apache.sling.junit.core, org.apache.sling.junit.scriptable,
org.apache.sling.testing.samples.sampletests, org.apache.sling.testing.samples.failingtests,
org.apache.sling.junit.remote, org.apache.sling.testing.tools, org.apache.httpcomponents.httpclient,
org.apache.httpcomponents.httpcore]
37018 [main] INFO org.apache.sling.testing.tools.sling.BundlesInstaller - Starting bundles
(timeout 30 seconds): [org.apache.sling.junit.core, org.apache.sling.junit.scriptable, org.apache.sling.testing.samples.sampletests,
org.apache.sling.testing.samples.failingtests, org.apache.sling.junit.remote, org.apache.sling.testing.tools,
org.apache.httpcomponents.httpclient, org.apache.httpcomponents.httpcore]
37034 [main] INFO org.apache.sling.testing.tools.osgi.WebconsoleClient - Starting bundle org.apache.sling.junit.core
via /system/console/bundles/org.apache.sling.junit.core
38445 [main] INFO org.apache.sling.testing.tools.osgi.WebconsoleClient - Starting bundle org.apache.sling.junit.scriptable
via /system/console/bundles/org.apache.sling.junit.scriptable
39817 [main] INFO org.apache.sling.testing.tools.osgi.WebconsoleClient - Starting bundle org.apache.sling.testing.samples.sampletests
via /system/console/bundles/org.apache.sling.testing.samples.sampletests
41175 [main] INFO org.apache.sling.testing.tools.osgi.WebconsoleClient - Starting bundle org.apache.sling.testing.samples.failingtests
via /system/console/bundles/org.apache.sling.testing.samples.failingtests
42537 [main] INFO org.apache.sling.testing.tools.osgi.WebconsoleClient - Starting bundle org.apache.sling.junit.remote
via /system/console/bundles/org.apache.sling.junit.remote
43927 [main] INFO org.apache.sling.testing.tools.osgi.WebconsoleClient - Starting bundle org.apache.sling.testing.tools
via /system/console/bundles/org.apache.sling.testing.tools
45316 [main] INFO org.apache.sling.testing.tools.osgi.WebconsoleClient - Starting bundle org.apache.httpcomponents.httpclient
via /system/console/bundles/org.apache.httpcomponents.httpclient
46715 [main] INFO org.apache.sling.testing.tools.osgi.WebconsoleClient - Starting bundle org.apache.httpcomponents.httpcore
via /system/console/bundles/org.apache.httpcomponents.httpcore
48111 [main] INFO org.apache.sling.testing.tools.sling.BundlesInstaller - Ok - all bundles
are in the active state
Tests run: 1, Failures: 0, Errors: 0, Skipped: 0, Time elapsed: 49.955 sec
Running org.apache.sling.testing.samples.integrationtests.serverside.JSONResponseTest
49890 [main] INFO org.apache.sling.testing.samples.integrationtests.serverside.JSONResponseTest
- Checking that /system/sling/junit returns status 200, timeout=60 seconds
49905 [main] INFO org.apache.sling.testing.samples.integrationtests.serverside.JSONResponseTest
- Checking JSON list of server-side tests (timeout=30 seconds)
Tests run: 1, Failures: 0, Errors: 0, Skipped: 0, Time elapsed: 0.02 sec
Running org.apache.sling.testing.samples.integrationtests.serverside.SingleServerSideMethodTest
49913 [main] INFO org.apache.sling.junit.remote.httpclient.RemoteTestHttpClient - Executing
test remotely, path=/org.apache.sling.testing.samples.sampletests.JUnit4Test/testRequiresBefore.json
JUnit servlet URL=http://localhost:54061/system/sling/junit
49946 [main] INFO org.apache.sling.junit.remote.testrunner.SlingRemoteTestRunner - Server-side
tests executed at http://localhost:54061/system/sling/junit with path /org.apache.sling.testing.samples.sampletests.JUnit4Test/testRequiresBefore.json
Tests run: 1, Failures: 0, Errors: 0, Skipped: 0, Time elapsed: 0.035 sec
Running org.apache.sling.testing.samples.integrationtests.serverside.sling.SlingServerSideSingleMethodTest
50007 [main] INFO org.apache.sling.testing.samples.integrationtests.serverside.sling.SlingServerSideSingleMethodTest
- Checking that /test/sling/1333466181559.junit returns status 200, timeout=30 seconds
50015 [main] INFO org.apache.sling.testing.samples.integrationtests.serverside.sling.SlingServerSideSingleMethodTest
- /test/sling/1333466181559.junit is ready, returns expected content
50015 [main] INFO org.apache.sling.junit.remote.httpclient.RemoteTestHttpClient - Executing
test remotely, path=/org.apache.sling.testing.samples.sampletests.JUnit4Test/testRequiresBefore.json
JUnit servlet URL=http://localhost:54061/test/sling/1333466181559.junit
50023 [main] INFO org.apache.sling.junit.remote.testrunner.SlingRemoteTestRunner - Server-side
tests executed at http://localhost:54061/test/sling/1333466181559.junit with path /org.apache.sling.testing.samples.sampletests.JUnit4Test/testRequiresBefore.json
Tests run: 1, Failures: 0, Errors: 0, Skipped: 0, Time elapsed: 0.076 sec
Running org.apache.sling.testing.samples.integrationtests.serverside.sling.SlingServerSideTest
50027 [main] INFO org.apache.sling.junit.remote.httpclient.RemoteTestHttpClient - Executing
test remotely, path=/org.apache.sling.testing.samples.sampletests.json JUnit servlet URL=http://localhost:54061/test/sling/1333466181559.junit
50057 [main] INFO org.apache.sling.junit.remote.testrunner.SlingRemoteTestRunner - Server-side
tests executed at http://localhost:54061/test/sling/1333466181559.junit with path /org.apache.sling.testing.samples.sampletests.json
Tests run: 8, Failures: 0, Errors: 0, Skipped: 0, Time elapsed: 0.034 sec
Running org.apache.sling.testing.samples.integrationtests.serverside.FailingTestsTest
Tests run: 1, Failures: 0, Errors: 0, Skipped: 0, Time elapsed: 0.01 sec
Running org.apache.sling.testing.samples.integrationtests.serverside.scriptable.ScriptableTestsTest
50204 [main] INFO org.apache.sling.junit.remote.httpclient.RemoteTestHttpClient - Executing
test remotely, path=/org.apache.sling.junit.scriptable.ScriptableTestsProvider.json JUnit
servlet URL=http://localhost:54061/system/sling/junit
50383 [main] INFO org.apache.sling.junit.remote.httpclient.RemoteTestHttpClient - Executing
test remotely, path=/org.apache.sling.junit.scriptable.ScriptableTestsProvider.json JUnit
servlet URL=http://localhost:54061/system/sling/junit
Tests run: 2, Failures: 1, Errors: 0, Skipped: 0, Time elapsed: 0.351 sec <<< FAILURE!
Running org.apache.sling.testing.samples.integrationtests.serverside.DontCareForTestsCountTest
50434 [main] INFO org.apache.sling.junit.remote.httpclient.RemoteTestHttpClient - Executing
test remotely, path=/org.apache.sling.testing.samples.sampletests.json JUnit servlet URL=http://localhost:54061/system/sling/junit
50451 [main] INFO org.apache.sling.junit.remote.testrunner.SlingRemoteTestRunner - Server-side
tests executed at http://localhost:54061/system/sling/junit with path /org.apache.sling.testing.samples.sampletests.json
Tests run: 8, Failures: 0, Errors: 0, Skipped: 0, Time elapsed: 0.021 sec
Running org.apache.sling.testing.samples.integrationtests.serverside.ServerSideSampleTest
50458 [main] INFO org.apache.sling.junit.remote.httpclient.RemoteTestHttpClient - Executing
test remotely, path=/org.apache.sling.testing.samples.sampletests.json JUnit servlet URL=http://localhost:54061/system/sling/junit
50470 [main] INFO org.apache.sling.junit.remote.testrunner.SlingRemoteTestRunner - Server-side
tests executed at http://localhost:54061/system/sling/junit with path /org.apache.sling.testing.samples.sampletests.json
Tests run: 8, Failures: 0, Errors: 0, Skipped: 0, Time elapsed: 0.017 sec

Results :

Failed tests: 
  testScriptableTest[0](org.apache.sling.testing.samples.integrationtests.serverside.scriptable.ScriptableTestsTest):
Expected 0 failing tests but got 1: [verifyContent[0](org.apache.sling.junit.scriptable.TestAllPaths):
Unexpected content at path /apps/testing/ScriptableTests/testnode.test.txt, should be just
TEST_PASSED (lines starting with # and empty lines are ignored)
content was:
** Resource dumped by PlainTextRendererServlet**
Resource path:/apps/testing/ScriptableTests/testnode
Resource metadata: {sling.resolutionPathInfo=.test.txt, sling.resolutionPath=/apps/testing/ScriptableTests/testnode}
Resource type: testing/ScriptableTests
Resource super type: -

** Resource properties **
sling:resourceType: testing/ScriptableTests
jcr:createdBy: admin
jcr:mixinTypes: [sling:Test]
jcr:created: java.util.GregorianCalendar[time=1333466181733,areFieldsSet=true,areAllFieldsSet=true,lenient=true,zone=sun.util.calendar.ZoneInfo[id="Etc/UTC",offset=0,dstSavings=0,useDaylight=false,transitions=0,lastRule=null],firstDayOfWeek=1,minimalDaysInFirstWeek=1,ERA=1,YEAR=2012,MONTH=3,WEEK_OF_YEAR=14,WEEK_OF_MONTH=1,DAY_OF_MONTH=3,DAY_OF_YEAR=94,DAY_OF_WEEK=3,DAY_OF_WEEK_IN_MONTH=1,AM_PM=1,HOUR=3,HOUR_OF_DAY=15,MINUTE=16,SECOND=21,MILLISECOND=733,ZONE_OFFSET=0,DST_OFFSET=0]
jcr:primaryType: sling:Folder

]

Tests run: 31, Failures: 1, Errors: 0, Skipped: 0

[WARNING] File encoding has not been set, using platform encoding ANSI_X3.4-1968, i.e. build
is platform dependent!
[JENKINS] Recording test results
[INFO] [INFO] Checking legal files in: org.apache.sling.testing.samples.integrationtests-1.0.7-SNAPSHOT.jar
[INFO] Checking legal files in: org.apache.sling.testing.samples.integrationtests-1.0.7-SNAPSHOT-sources.jar

[INFO] --- ianal-maven-plugin:1.0-alpha-1:verify-legal-files (default) @ org.apache.sling.testing.samples.integrationtests
---
[INFO] [INFO] Failsafe report directory: <https://builds.apache.org/job/sling-trunk-1.6/ws/trunk/testing/samples/integration-tests/target/failsafe-reports>
[WARNING] File encoding has not been set, using platform encoding ANSI_X3.4-1968, i.e. build
is platform dependent!

[INFO] --- maven-failsafe-plugin:2.7.2:verify (verify) @ org.apache.sling.testing.samples.integrationtests
---
[JENKINS] Archiving <https://builds.apache.org/job/sling-trunk-1.6/ws/trunk/testing/samples/integration-tests/target/org.apache.sling.testing.samples.integrationtests-1.0.7-SNAPSHOT-sources.jar>
to /home/hudson/hudson/jobs/sling-trunk-1.6/modules/org.apache.sling$org.apache.sling.testing.samples.integrationtests/builds/2012-04-03_14-34-40/archive/org.apache.sling/org.apache.sling.testing.samples.integrationtests/1.0.7-SNAPSHOT/org.apache.sling.testing.samples.integrationtests-1.0.7-SNAPSHOT-sources.jar
[INFO] ------------------------------------------------------------------------
[INFO] Reactor Summary:
[INFO] 
[INFO] Apache Sling JAR Resource Bundle .................. SUCCESS [26.199s]
[INFO] Apache Sling (Parent) ............................. SUCCESS [3.960s]
[INFO] Sling Adapter Annotations ......................... SUCCESS [8.662s]
[INFO] Apache Sling Maven Plugin to create Jackrabbit OCM descriptors  SUCCESS [6.868s]
[INFO] Apache Sling Maven Plugin for Compiling JSP Sources into Bundles  SUCCESS [6.019s]
[INFO] Apache Sling Maven Plugin for Supporting Bundle Development  SUCCESS [9.420s]
[INFO] Apache Sling Launchpad Base ....................... SUCCESS [27.292s]
[INFO] Apache Sling Launchpad Maven Plugin ............... SUCCESS [16.419s]
[INFO] Sling Launchpad Standalone Archetype .............. SUCCESS [7.844s]
[INFO] Sling Launchpad Webapp Archetype .................. SUCCESS [4.130s]
[INFO] Sling Initial Content Archetype ................... SUCCESS [4.649s]
[INFO] Sling Servlet Archetype ........................... SUCCESS [12.943s]
[INFO] Sling Bundle Archetype ............................ SUCCESS [3.005s]
[INFO] Sling JCRInstall Bundle Archetype ................. SUCCESS [3.355s]
[INFO] Apache Sling API .................................. SUCCESS [10.979s]
[INFO] Apache Sling System Bundle Extension: Java Transaction API  SUCCESS [3.371s]
[INFO] Apache Sling System Bundle Extension: XML APIs .... SUCCESS [3.389s]
[INFO] Apache Sling System Bundle Extension: Activation API  SUCCESS [7.224s]
[INFO] Apache Sling System Bundle Extension: WS APIs ..... SUCCESS [5.026s]
[INFO] Apache Sling Dynamic Class Loader Support ......... SUCCESS [17.866s]
[INFO] Apache Sling JSON Library ......................... SUCCESS [5.341s]
[INFO] Apache Sling SLF4J Implementation ................. SUCCESS [8.104s]
[INFO] Apache Sling OSGi LogService Implementation ....... SUCCESS [3.839s]
[INFO] Apache Sling MIME type mapping support ............ SUCCESS [7.324s]
[INFO] Apache Sling Commons OSGi support ................. SUCCESS [5.295s]
[INFO] Apache Sling Scheduler Support .................... SUCCESS [12.125s]
[INFO] Apache Sling Testing Utilities .................... SUCCESS [38.239s]
[INFO] Apache Sling Thread Support ....................... SUCCESS [24.135s]
[INFO] Apache Sling Authentication Service ............... SUCCESS [22.333s]
[INFO] Apache Sling OpenID Authentication ................ SUCCESS [27.457s]
[INFO] Apache Sling Form Based Authentication Handler .... SUCCESS [11.239s]
[INFO] Apache Sling Authentication Selector .............. SUCCESS [9.341s]
[INFO] Apache Sling Engine Implementation ................ SUCCESS [49.402s]
[INFO] Apache Sling Repository API Bundle ................ SUCCESS [8.146s]
[INFO] Apache Sling JCR Base Bundle ...................... SUCCESS [25.166s]
[INFO] Apache Sling JCR ClassLoader ...................... SUCCESS [16.610s]
[INFO] Apache Sling Initial Content Loader ............... SUCCESS [7.359s]
[INFO] Apache Sling Jackrabbit Embedded Repository ....... SUCCESS [1:01.340s]
[INFO] Apache Sling Jackrabbit UserManager Support ....... SUCCESS [9.571s]
[INFO] Apache Sling Jackrabbit JSR-283 Access Control Manager Support  SUCCESS [9.072s]
[INFO] Apache Sling Object Content Mapping ............... SUCCESS [13.057s]
[INFO] Apache Sling JCR Resource Resolver ................ SUCCESS [38.893s]
[INFO] Apache Sling Simple WebDAV Access to repositories . SUCCESS [10.746s]
[INFO] Apache Sling DavEx Access to repositories ......... SUCCESS [12.263s]
[INFO] Apache Sling JCR WebConsole Bundle ................ SUCCESS [4.181s]
[INFO] Apache Sling Servlet Resolver ..................... SUCCESS [8.408s]
[INFO] Apache Sling Default GET Servlets ................. SUCCESS [10.492s]
[INFO] Apache Sling Default POST Servlets ................ SUCCESS [12.025s]
[INFO] Apache Sling Compat Servlets ...................... SUCCESS [8.345s]
[INFO] Apache Sling Scripting Implementation API ......... SUCCESS [4.504s]
[INFO] Apache Sling Scripting Core implementation ........ SUCCESS [6.542s]
[INFO] Apache Sling Scripting JavaScript Support ......... SUCCESS [16.863s]
[INFO] Apache Sling Scripting JSP Support ................ SUCCESS [25.355s]
[INFO] Apache Sling JSP Tag Library ...................... SUCCESS [9.762s]
[INFO] Apache Sling Adapter Manager Implementation ....... SUCCESS [5.375s]
[INFO] Apache Sling Bundle Resource Provider ............. SUCCESS [8.230s]
[INFO] Apache Sling Event Support ........................ SUCCESS [4:08.573s]
[INFO] Apache Sling Filesystem Resource Provider ......... SUCCESS [5.121s]
[INFO] Apache Sling Settings ............................. SUCCESS [10.755s]
[INFO] Apache Sling Thread Dumper ........................ SUCCESS [3.772s]
[INFO] Apache Sling Web Console Branding ................. SUCCESS [3.482s]
[INFO] Apache Sling Web Console Security Provider ........ SUCCESS [5.477s]
[INFO] Apache Sling Groovy Extensions .................... SUCCESS [4.954s]
[INFO] Apache Sling Explorer ............................. SUCCESS [9.694s]
[INFO] Apache Sling Test Tools ........................... SUCCESS [7.554s]
[INFO] Apache Sling JUnit Core ........................... SUCCESS [8.892s]
[INFO] Apache Sling JUnit Scriptable Tests Provider ...... SUCCESS [9.133s]
[INFO] Apache Sling JUnit Remote Tests Runners ........... SUCCESS [5.288s]
[INFO] Apache Sling Installer ............................ SUCCESS [8.732s]
[INFO] Apache Sling File Installer ....................... SUCCESS [4.455s]
[INFO] Apache Sling JCR Installer ........................ SUCCESS [1:54.455s]
[INFO] Apache Sling Installer Configuration Admin Support  SUCCESS [9.547s]
[INFO] Apache Sling Deployment Package Installer ......... SUCCESS [5.681s]
[INFO] Apache Sling Installer Integration Tests .......... SUCCESS [1:07.464s]
[INFO] Apache Sling Launchpad API ........................ SUCCESS [8.772s]
[INFO] Apache Sling Launchpad Installer .................. SUCCESS [5.543s]
[INFO] Apache Sling Launchpad Content .................... SUCCESS [4.481s]
[INFO] Apache Sling Launchpad Application Builder ........ SUCCESS [5:48.471s]
[INFO] Apache Sling Sample Server-Side Tests ............. SUCCESS [5.653s]
[INFO] Apache Sling Failing Server-Side Tests ............ SUCCESS [5.536s]
[INFO] Apache Sling Sample Integration Tests ............. FAILURE [1:03.589s]
[INFO] Apache Sling Launchpad Testing Services ........... SKIPPED
[INFO] Apache Sling Launchpad Testing Services WAR ....... SKIPPED
[INFO] Apache Sling Launchpad Test Bundles ............... SKIPPED
[INFO] Apache Sling Integration Tests .................... SKIPPED
[INFO] Apache Sling Launchpad Testing .................... SKIPPED
[INFO] Apache Sling Launchpad Testing WAR version ........ SKIPPED
[INFO] Apache Sling (Builder) ............................ SKIPPED
[INFO] ------------------------------------------------------------------------
[INFO] BUILD FAILURE
[INFO] ------------------------------------------------------------------------
[INFO] Total time: 41:30.037s
[INFO] Finished at: Tue Apr 03 15:16:25 UTC 2012
[INFO] Final Memory: 238M/482M
[INFO] ------------------------------------------------------------------------
mavenExecutionResult exceptions not empty
message : Failed to execute goal org.apache.maven.plugins:maven-failsafe-plugin:2.7.2:verify
(verify) on project org.apache.sling.testing.samples.integrationtests: There are test failures.

Please refer to <https://builds.apache.org/job/sling-trunk-1.6/ws/trunk/testing/samples/integration-tests/target/failsafe-reports>
for the individual test results.
cause : There are test failures.

Please refer to <https://builds.apache.org/job/sling-trunk-1.6/ws/trunk/testing/samples/integration-tests/target/failsafe-reports>
for the individual test results.
Stack trace : 
org.apache.maven.lifecycle.LifecycleExecutionException: Failed to execute goal org.apache.maven.plugins:maven-failsafe-plugin:2.7.2:verify
(verify) on project org.apache.sling.testing.samples.integrationtests: There are test failures.

Please refer to <https://builds.apache.org/job/sling-trunk-1.6/ws/trunk/testing/samples/integration-tests/target/failsafe-reports>
for the individual test results.
	at org.apache.maven.lifecycle.internal.MojoExecutor.execute(MojoExecutor.java:213)
	at org.apache.maven.lifecycle.internal.MojoExecutor.execute(MojoExecutor.java:153)
	at org.apache.maven.lifecycle.internal.MojoExecutor.execute(MojoExecutor.java:145)
	at org.apache.maven.lifecycle.internal.LifecycleModuleBuilder.buildProject(LifecycleModuleBuilder.java:84)
	at org.apache.maven.lifecycle.internal.LifecycleModuleBuilder.buildProject(LifecycleModuleBuilder.java:59)
	at org.apache.maven.lifecycle.internal.LifecycleStarter.singleThreadedBuild(LifecycleStarter.java:183)
	at org.apache.maven.lifecycle.internal.LifecycleStarter.execute(LifecycleStarter.java:161)
	at org.apache.maven.DefaultMaven.doExecute(DefaultMaven.java:319)
	at org.apache.maven.DefaultMaven.execute(DefaultMaven.java:156)
	at org.jvnet.hudson.maven3.launcher.Maven3Launcher.main(Maven3Launcher.java:79)
	at sun.reflect.NativeMethodAccessorImpl.invoke0(Native Method)
	at sun.reflect.NativeMethodAccessorImpl.invoke(NativeMethodAccessorImpl.java:39)
	at sun.reflect.DelegatingMethodAccessorImpl.invoke(DelegatingMethodAccessorImpl.java:25)
	at java.lang.reflect.Method.invoke(Method.java:597)
	at org.codehaus.plexus.classworlds.launcher.Launcher.launchStandard(Launcher.java:329)
	at org.codehaus.plexus.classworlds.launcher.Launcher.launch(Launcher.java:239)
	at org.jvnet.hudson.maven3.agent.Maven3Main.launch(Maven3Main.java:158)
	at hudson.maven.Maven3Builder.call(Maven3Builder.java:104)
	at hudson.maven.Maven3Builder.call(Maven3Builder.java:70)
	at hudson.remoting.UserRequest.perform(UserRequest.java:118)
	at hudson.remoting.UserRequest.perform(UserRequest.java:48)
	at hudson.remoting.Request$2.run(Request.java:287)
	at hudson.remoting.InterceptingExecutorService$1.call(InterceptingExecutorService.java:72)
	at java.util.concurrent.FutureTask$Sync.innerRun(FutureTask.java:303)
	at java.util.concurrent.FutureTask.run(FutureTask.java:138)
	at java.util.concurrent.ThreadPoolExecutor$Worker.runTask(ThreadPoolExecutor.java:886)
	at java.util.concurrent.ThreadPoolExecutor$Worker.run(ThreadPoolExecutor.java:908)
	at java.lang.Thread.run(Thread.java:662)
Caused by: org.apache.maven.plugin.MojoFailureException: There are test failures.

Please refer to <https://builds.apache.org/job/sling-trunk-1.6/ws/trunk/testing/samples/integration-tests/target/failsafe-reports>
for the individual test results.
	at org.apache.maven.plugin.surefire.SurefireHelper.reportExecution(SurefireHelper.java:74)
	at org.apache.maven.plugin.failsafe.VerifyMojo.execute(VerifyMojo.java:205)
	at org.apache.maven.plugin.DefaultBuildPluginManager.executeMojo(DefaultBuildPluginManager.java:101)
	at org.apache.maven.lifecycle.internal.MojoExecutor.execute(MojoExecutor.java:209)
	... 27 more
Maven failed with error.
channel stopped
[locks-and-latches] Releasing all the locks
[locks-and-latches] All the locks released

Mime
View raw message