sling-dev mailing list archives

Site index · List index
Message view « Date » · « Thread »
Top « Date » · « Thread »
From Apache Jenkins Server <jenk...@builds.apache.org>
Subject Build failed in Jenkins: sling-contrib-1.5 #823
Date Mon, 06 Feb 2012 12:27:00 GMT
See <https://builds.apache.org/job/sling-contrib-1.5/823/>

------------------------------------------
[...truncated 3053 lines...]
[INFO] Copying bundle from /home/jenkins/.m2/repository/org/apache/sling/org.apache.sling.scripting.xproc/2.0.0-SNAPSHOT/org.apache.sling.scripting.xproc-2.0.0-SNAPSHOT.jar
to <https://builds.apache.org/job/sling-contrib-1.5/ws/contrib-1.5/launchpad/testing/target/launchpad-bundles/resources/bundles/15/org.apache.sling.scripting.xproc-2.0.0-SNAPSHOT.jar>
[INFO] snapshot org.apache.sling:org.apache.sling.extensions.apt.servlet:2.0.3-SNAPSHOT: checking
for updates from apache.snapshots
[INFO] Copying bundle from /home/jenkins/.m2/repository/org/apache/sling/org.apache.sling.extensions.apt.servlet/2.0.3-SNAPSHOT/org.apache.sling.extensions.apt.servlet-2.0.3-SNAPSHOT.jar
to <https://builds.apache.org/job/sling-contrib-1.5/ws/contrib-1.5/launchpad/testing/target/launchpad-bundles/resources/bundles/15/org.apache.sling.extensions.apt.servlet-2.0.3-SNAPSHOT.jar>
[INFO] snapshot org.apache.sling:org.apache.sling.extensions.apt.parser:2.0.3-SNAPSHOT: checking
for updates from apache.snapshots
[INFO] Copying bundle from /home/jenkins/.m2/repository/org/apache/sling/org.apache.sling.extensions.apt.parser/2.0.3-SNAPSHOT/org.apache.sling.extensions.apt.parser-2.0.3-SNAPSHOT.jar
to <https://builds.apache.org/job/sling-contrib-1.5/ws/contrib-1.5/launchpad/testing/target/launchpad-bundles/resources/bundles/15/org.apache.sling.extensions.apt.parser-2.0.3-SNAPSHOT.jar>
[INFO] snapshot org.apache.sling.samples:org.apache.sling.samples.path-based.rtp:2.0.5-SNAPSHOT:
checking for updates from apache.snapshots
Downloading: http://repository.apache.org/snapshots/org/apache/sling/samples/org.apache.sling.samples.path-based.rtp/2.0.5-SNAPSHOT/org.apache.sling.samples.path-based.rtp-2.0.5-SNAPSHOT.jar
[INFO] Copying bundle from /home/jenkins/.m2/repository/org/apache/sling/samples/org.apache.sling.samples.path-based.rtp/2.0.5-SNAPSHOT/org.apache.sling.samples.path-based.rtp-2.0.5-SNAPSHOT.jar
to <https://builds.apache.org/job/sling-contrib-1.5/ws/contrib-1.5/launchpad/testing/target/launchpad-bundles/resources/bundles/15/org.apache.sling.samples.path-based.rtp-2.0.5-SNAPSHOT.jar>
[INFO] [remote-resources:process {execution: default}]
[INFO] [resources:resources {execution: default-resources}]
[INFO] Using 'UTF-8' encoding to copy filtered resources.
[INFO] Copying 0 resource
[INFO] Copying 3 resources
[INFO] [build-helper:reserve-network-port {execution: reserve-network-port}]
[INFO] Reserved port 43736 for http.port
[WARNING] DEPRECATED [tasks]: Use target instead
[INFO] [antrun:run {execution: default}]
[WARNING] Parameter tasks is deprecated, use target instead
[INFO] Executing tasks

main:
     [echo] **************** WARNING (SLING-443/SLING-1782) ******************************
     [echo] On most platforms, you'll get OutOfMemoryErrors when building unless you set
     [echo] on 32bit platforms: MAVEN_OPTS="-Xmx256M -XX:MaxPermSize=256M", see SLING-443
     [echo] on 64bit platforms: MAVEN_OPTS="-Xmx512M -XX:MaxPermSize=512M", see SLING-1782
     [echo] ******************************************************************************
[INFO] Executed tasks
[INFO] [compiler:compile {execution: default-compile}]
[INFO] No sources to compile
[INFO] [resources:testResources {execution: default-testResources}]
[INFO] Using 'UTF-8' encoding to copy filtered resources.
[INFO] Copying 50 resources
[INFO] Copying 3 resources
[INFO] [compiler:testCompile {execution: default-testCompile}]
[INFO] Compiling 7 source files to <https://builds.apache.org/job/sling-contrib-1.5/ws/contrib-1.5/launchpad/testing/target/test-classes>
[WARNING] DEPRECATED [systemProperties]: Use systemPropertyVariables instead.
[INFO] [surefire:test {execution: default-test}]
[INFO] Surefire report directory: <https://builds.apache.org/job/sling-contrib-1.5/ws/contrib-1.5/launchpad/testing/target/surefire-reports>

-------------------------------------------------------
 T E S T S
-------------------------------------------------------
There are no tests to run.

Results :

Tests run: 0, Failures: 0, Errors: 0, Skipped: 0

[JENKINS] Recording test results
[INFO] [animal-sniffer:check {execution: default}]
[INFO] Checking unresolved references to org.codehaus.mojo.signature:java15:1.0
[INFO] [war:war {execution: default-war}]
[INFO] Packaging webapp
[INFO] Assembling webapp [org.apache.sling.launchpad.contrib-testing] in [<https://builds.apache.org/job/sling-contrib-1.5/ws/contrib-1.5/launchpad/testing/target/org.apache.sling.launchpad.contrib-testing-4-SNAPSHOT]>
[INFO] Processing war project
[INFO] Copying webapp webResources [<https://builds.apache.org/job/sling-contrib-1.5/ws/contrib-1.5/launchpad/testing/target/launchpad-bundles]>
to [<https://builds.apache.org/job/sling-contrib-1.5/ws/contrib-1.5/launchpad/testing/target/org.apache.sling.launchpad.contrib-testing-4-SNAPSHOT]>
[INFO] Copying webapp webResources [<https://builds.apache.org/job/sling-contrib-1.5/ws/contrib-1.5/launchpad/testing]>
to [<https://builds.apache.org/job/sling-contrib-1.5/ws/contrib-1.5/launchpad/testing/target/org.apache.sling.launchpad.contrib-testing-4-SNAPSHOT]>
[INFO] Processing overlay [ id org.apache.sling:org.apache.sling.launchpad.base:webapp]
[INFO] Webapp assembled in [449 msecs]
[INFO] Building war: <https://builds.apache.org/job/sling-contrib-1.5/ws/contrib-1.5/launchpad/testing/target/org.apache.sling.launchpad.contrib-testing-4-SNAPSHOT.war>
[INFO] WEB-INF/web.xml already added, skipping
[INFO] Preparing source:jar
[WARNING] Removing: jar from forked lifecycle, to prevent recursive invocation.
[JENKINS] Archiving <https://builds.apache.org/job/sling-contrib-1.5/ws/contrib-1.5/launchpad/testing/pom.xml>
to /home/hudson/hudson/jobs/sling-contrib-1.5/modules/org.apache.sling$org.apache.sling.launchpad.contrib-testing/builds/2012-02-06_12-10-37/archive/org.apache.sling/org.apache.sling.launchpad.contrib-testing/4-SNAPSHOT/org.apache.sling.launchpad.contrib-testing-4-SNAPSHOT.pom
[JENKINS] Archiving <https://builds.apache.org/job/sling-contrib-1.5/ws/contrib-1.5/launchpad/testing/target/org.apache.sling.launchpad.contrib-testing-4-SNAPSHOT.war>
to /home/hudson/hudson/jobs/sling-contrib-1.5/modules/org.apache.sling$org.apache.sling.launchpad.contrib-testing/builds/2012-02-06_12-10-37/archive/org.apache.sling/org.apache.sling.launchpad.contrib-testing/4-SNAPSHOT/org.apache.sling.launchpad.contrib-testing-4-SNAPSHOT.war
[INFO] [enforcer:enforce {execution: enforce-java}]
[INFO] [source:jar {execution: attach-sources}]
[INFO] META-INF already added, skipping
[INFO] META-INF already added, skipping
[INFO] META-INF/LICENSE already added, skipping
[INFO] META-INF/NOTICE already added, skipping
[INFO] META-INF/DEPENDENCIES already added, skipping
[INFO] Building jar: <https://builds.apache.org/job/sling-contrib-1.5/ws/contrib-1.5/launchpad/testing/target/org.apache.sling.launchpad.contrib-testing-4-SNAPSHOT-sources.jar>
[INFO] META-INF already added, skipping
[INFO] META-INF already added, skipping
[INFO] META-INF/LICENSE already added, skipping
[INFO] META-INF/NOTICE already added, skipping
[INFO] META-INF/DEPENDENCIES already added, skipping
[WARNING] DEPRECATED [tasks]: Use target instead
[INFO] [antrun:run {execution: delete-sling-folder}]
[WARNING] Parameter tasks is deprecated, use target instead
[INFO] Executing tasks

main:
     [echo] SLING-845 - delete parent sling folder before integration tests
[INFO] Executed tasks
[INFO] [cargo:start {execution: start-container}]
[INFO] [beddedLocalContainer] Jetty 6.x Embedded starting...
2012-02-06 12:25:39.783:INFO::Logging to STDERR via org.mortbay.log.StdErrLog
2012-02-06 12:25:39.830:INFO::jetty-6.1.26
2012-02-06 12:25:39.931:INFO::Extract <https://builds.apache.org/job/sling-contrib-1.5/ws/contrib-1.5/launchpad/testing/target/org.apache.sling.launchpad.contrib-testing-4-SNAPSHOT.war>
to /tmp/Jetty_0_0_0_0_43736_org.apache.sling.launchpad.contrib.testing.4.SNAPSHOT.war__org.apache.sling.launchpad.contrib.testing.4.SNAPSHOT__bgtau0/webapp
log4j:WARN No appenders could be found for logger (org.apache.jasper.compiler.JspRuntimeContext).
log4j:WARN Please initialize the log4j system properly.
2012-02-06 12:25:41.594:INFO:/org.apache.sling.launchpad.contrib-testing-4-SNAPSHOT:sling:
Setting sling.home=<https://builds.apache.org/job/sling-contrib-1.5/ws/contrib-1.5/sling/_org.apache.sling.launchpad.contrib-testing-4-SNAPSHOT>
(servlet context path)
2012-02-06 12:25:41.602:INFO:/org.apache.sling.launchpad.contrib-testing-4-SNAPSHOT:sling:
Checking launcher JAR in <https://builds.apache.org/job/sling-contrib-1.5/ws/contrib-1.5/sling/_org.apache.sling.launchpad.contrib-testing-4-SNAPSHOT>
2012-02-06 12:25:41.602:INFO:/org.apache.sling.launchpad.contrib-testing-4-SNAPSHOT:sling:
Checking launcher JAR in folder <https://builds.apache.org/job/sling-contrib-1.5/ws/contrib-1.5/sling/_org.apache.sling.launchpad.contrib-testing-4-SNAPSHOT>
2012-02-06 12:25:41.606:INFO:/org.apache.sling.launchpad.contrib-testing-4-SNAPSHOT:sling:
Installing new launcher: file:/tmp/Jetty_0_0_0_0_43736_org.apache.sling.launchpad.contrib.testing.4.SNAPSHOT.war__org.apache.sling.launchpad.contrib.testing.4.SNAPSHOT__bgtau0/webapp/WEB-INF//resources/org.apache.sling.launchpad.base.jar,
2.3.1.SNAPSHOT, Last-Modified:Mon Feb 06 11:08:53 UTC 2012 (org.apache.sling.launchpad.base.jar.1328531141606)
2012-02-06 12:25:41.606:INFO:/org.apache.sling.launchpad.contrib-testing-4-SNAPSHOT:sling:
Loading launcher class org.apache.sling.launchpad.base.webapp.SlingServletDelegate from org.apache.sling.launchpad.base.jar.1328531141606
2012-02-06 12:25:41.613:INFO:/org.apache.sling.launchpad.contrib-testing-4-SNAPSHOT:sling:
Starting launcher ...
2012-02-06 12:25:41.613:INFO:/org.apache.sling.launchpad.contrib-testing-4-SNAPSHOT:sling:
Starting Apache Sling in <https://builds.apache.org/job/sling-contrib-1.5/ws/contrib-1.5/sling/_org.apache.sling.launchpad.contrib-testing-4-SNAPSHOT>
06.02.2012 12:25:44.032 *INFO* [FelixStartLevel] org.apache.sling.commons.logservice Service
[org.apache.sling.commons.logservice.internal.LogServiceFactory,6] ServiceEvent REGISTERED
06.02.2012 12:25:44.037 *INFO* [FelixStartLevel] org.apache.sling.commons.logservice Service
[org.apache.sling.commons.logservice.internal.LogReaderServiceFactory,7] ServiceEvent REGISTERED
06.02.2012 12:25:44.038 *INFO* [FelixDispatchQueue] org.apache.sling.commons.logservice BundleEvent
STARTED
06.02.2012 12:25:44.038 *INFO* [FelixDispatchQueue] jcl.over.slf4j BundleEvent RESOLVED
06.02.2012 12:25:44.038 *INFO* [FelixDispatchQueue] jcl.over.slf4j BundleEvent STARTED
06.02.2012 12:25:44.039 *INFO* [FelixDispatchQueue] log4j.over.slf4j BundleEvent RESOLVED
06.02.2012 12:25:44.039 *INFO* [FelixDispatchQueue] log4j.over.slf4j BundleEvent STARTED
*sys-package-mgr*: processing new jar, '/home/jenkins/jenkins-slave/maven-agent.jar'
*sys-package-mgr*: processing new jar, '/home/jenkins/jenkins-slave/classworlds.jar'
*sys-package-mgr*: processing new jar, '/home/jenkins/tools/java/jdk1.5.0_22-32/jre/lib/rt.jar'
*sys-package-mgr*: processing new jar, '/home/jenkins/tools/java/jdk1.5.0_22-32/jre/lib/jsse.jar'
*sys-package-mgr*: processing new jar, '/home/jenkins/tools/java/jdk1.5.0_22-32/jre/lib/jce.jar'
*sys-package-mgr*: processing new jar, '/home/jenkins/tools/java/jdk1.5.0_22-32/jre/lib/charsets.jar'
*sys-package-mgr*: processing new jar, '/home/jenkins/tools/java/jdk1.5.0_22-32/jre/lib/ext/sunjce_provider.jar'
*sys-package-mgr*: processing new jar, '/home/jenkins/tools/java/jdk1.5.0_22-32/jre/lib/ext/localedata.jar'
*sys-package-mgr*: processing new jar, '/home/jenkins/tools/java/jdk1.5.0_22-32/jre/lib/ext/sunpkcs11.jar'
*sys-package-mgr*: processing new jar, '/home/jenkins/tools/java/jdk1.5.0_22-32/jre/lib/ext/dnsns.jar'
2012-02-06 12:26:30.283:INFO:/org.apache.sling.launchpad.contrib-testing-4-SNAPSHOT:sling:
Apache Sling successfully started in <https://builds.apache.org/job/sling-contrib-1.5/ws/contrib-1.5/sling/_org.apache.sling.launchpad.contrib-testing-4-SNAPSHOT>
2012-02-06 12:26:30.283:INFO:/org.apache.sling.launchpad.contrib-testing-4-SNAPSHOT:sling:
Startup completed
2012-02-06 12:26:30.283:INFO:/org.apache.sling.launchpad.contrib-testing-4-SNAPSHOT:sling:
Servlet sling initialized
2012-02-06 12:26:30.286:INFO::Extract <https://builds.apache.org/job/sling-contrib-1.5/ws/contrib-1.5/launchpad/testing/target/cargo/cargocpc.war>
to /tmp/Jetty_0_0_0_0_43736_cargocpc.war__cargocpc__39c8nk/webapp
2012-02-06 12:26:30.318:INFO::Started SelectChannelConnector@0.0.0.0:43736
[INFO] [beddedLocalContainer] Jetty 6.x Embedded started on port [43736]
[WARNING] DEPRECATED [systemProperties]: Use systemPropertyVariables instead.
[INFO] [surefire:test {execution: surefire-integration-test}]
[INFO] Surefire report directory: <https://builds.apache.org/job/sling-contrib-1.5/ws/contrib-1.5/launchpad/testing/target/surefire-reports>

-------------------------------------------------------
 T E S T S
-------------------------------------------------------
Running org.apache.sling.launchpad.webapp.integrationtest.PathBasedResourceTypeTest
Checking if the required Sling services are started (timeout 60 seconds)...
(base URLs=http://localhost:43736/org.apache.sling.launchpad.contrib-testing-4-SNAPSHOT and
http://localhost:43736/org.apache.sling.launchpad.contrib-testing-4-SNAPSHOT)
Sling services seem to be started, continuing with integration tests.
Tests run: 2, Failures: 0, Errors: 0, Skipped: 0, Time elapsed: 0.97 sec
Running org.apache.sling.launchpad.webapp.integrationtest.apt.SimpleAptRenderingTest
Tests run: 1, Failures: 0, Errors: 0, Skipped: 0, Time elapsed: 0.118 sec
Running org.apache.sling.launchpad.webapp.integrationtest.SlingResourceTypeRenderingTest
Tests run: 5, Failures: 0, Errors: 0, Skipped: 0, Time elapsed: 0.702 sec
Running org.apache.sling.launchpad.webapp.integrationtest.xproc.XsltTest
<?xml version="1.0" encoding="UTF-8"?><no_xml jcr:primaryType="sling:Folder" jcr:created="2012-02-06T12:26:33.379Z"
jcr:createdBy="admin" sling:resourceType="XsltTest1328531192541" title="no_xml" xmlns:mix="http://www.jcp.org/jcr/mix/1.0"
xmlns:test2="test2=http://sling.apache.org/test/two" xmlns:fn="http://www.w3.org/2005/xpath-functions"
xmlns:ocm="http://jackrabbit.apache.org/ocm" xmlns:slingevent="http://sling.apache.org/jcr/event/1.0"
xmlns:xs="http://www.w3.org/2001/XMLSchema" xmlns:sv="http://www.jcp.org/jcr/sv/1.0" xmlns:test1="http://sling.apache.org/test/one"
xmlns:nt="http://www.jcp.org/jcr/nt/1.0" xmlns:sling="http://sling.apache.org/jcr/sling/1.0"
xmlns:fn_old="http://www.w3.org/2004/10/xpath-functions" xmlns:rep="internal" xmlns:jcr="http://www.jcp.org/jcr/1.0"/>
Tests run: 3, Failures: 0, Errors: 0, Skipped: 0, Time elapsed: 0.929 sec
Running org.apache.sling.launchpad.webapp.integrationtest.GetStarTest
Tests run: 1, Failures: 0, Errors: 0, Skipped: 0, Time elapsed: 0.099 sec
Running org.apache.sling.launchpad.webapp.integrationtest.scala.ScalaScriptingTest
Tests run: 3, Failures: 0, Errors: 0, Skipped: 0, Time elapsed: 9.648 sec

Results :

Tests run: 15, Failures: 0, Errors: 0, Skipped: 0

[JENKINS] Recording test results
[INFO] [cargo:stop {execution: stop-container}]
[INFO] [beddedLocalContainer] Jetty 6.x Embedded is stopping...
2012-02-06 12:26:43.848:INFO::Stopped SelectChannelConnector@0.0.0.0:43736
[INFO] [beddedLocalContainer] Jetty 6.x Embedded is stopped
[INFO] [ianal:verify-legal-files {execution: default}]
[INFO] Checking legal files in: org.apache.sling.launchpad.contrib-testing-4-SNAPSHOT.war
[INFO] Checking legal files in: org.apache.sling.launchpad.contrib-testing-4-SNAPSHOT-sources.jar
[INFO] [install:install {execution: default-install}]
[INFO] Installing <https://builds.apache.org/job/sling-contrib-1.5/ws/contrib-1.5/launchpad/testing/target/org.apache.sling.launchpad.contrib-testing-4-SNAPSHOT.war>
to /home/jenkins/.m2/repository/org/apache/sling/org.apache.sling.launchpad.contrib-testing/4-SNAPSHOT/org.apache.sling.launchpad.contrib-testing-4-SNAPSHOT.war
2012-02-06 12:26:44.259:INFO:/org.apache.sling.launchpad.contrib-testing-4-SNAPSHOT:sling:
Apache Sling has been stopped
[INFO] Installing <https://builds.apache.org/job/sling-contrib-1.5/ws/contrib-1.5/launchpad/testing/target/org.apache.sling.launchpad.contrib-testing-4-SNAPSHOT-sources.jar>
to /home/jenkins/.m2/repository/org/apache/sling/org.apache.sling.launchpad.contrib-testing/4-SNAPSHOT/org.apache.sling.launchpad.contrib-testing-4-SNAPSHOT-sources.jar
[JENKINS] Archiving <https://builds.apache.org/job/sling-contrib-1.5/ws/contrib-1.5/launchpad/testing/target/org.apache.sling.launchpad.contrib-testing-4-SNAPSHOT-sources.jar>
to /home/hudson/hudson/jobs/sling-contrib-1.5/modules/org.apache.sling$org.apache.sling.launchpad.contrib-testing/builds/2012-02-06_12-10-37/archive/org.apache.sling/org.apache.sling.launchpad.contrib-testing/4-SNAPSHOT/org.apache.sling.launchpad.contrib-testing-4-SNAPSHOT-sources.jar
[INFO] ------------------------------------------------------------------------
[INFO] Building Apache Sling Contrib (Builder)
[INFO]    task-segment: [clean, install]
[INFO] ------------------------------------------------------------------------
[INFO] [clean:clean {execution: default-clean}]
[INFO] Deleting file-set: <https://builds.apache.org/job/sling-contrib-1.5/ws/contrib-1.5>
(included: [derby.log, cachedir, sling], excluded: [])
[INFO] [site:attach-descriptor {execution: default-attach-descriptor}]
[INFO] [install:install {execution: default-install}]
[INFO] Installing <https://builds.apache.org/job/sling-contrib-1.5/ws/contrib-1.5/pom.xml>
to /home/jenkins/.m2/repository/org/apache/sling/sling-contrib-builder/2-SNAPSHOT/sling-contrib-builder-2-SNAPSHOT.pom
[JENKINS] Archiving <https://builds.apache.org/job/sling-contrib-1.5/ws/contrib-1.5/pom.xml>
to /home/hudson/hudson/jobs/sling-contrib-1.5/modules/org.apache.sling$sling-contrib-builder/builds/2012-02-06_12-10-37/archive/org.apache.sling/sling-contrib-builder/2-SNAPSHOT/sling-contrib-builder-2-SNAPSHOT.pom
[INFO] 
[INFO] 
[INFO] ------------------------------------------------------------------------
[INFO] Reactor Summary:
[INFO] ------------------------------------------------------------------------
[INFO] Apache Sling Commons Java Compiler .................... SUCCESS [1:07.352s]
[INFO] Apache Sling Commons FileSystem ClassLoader ........... SUCCESS [4.238s]
[INFO] Apache Sling Commons HTML Utilities ................... SUCCESS [5.467s]
[INFO] Apache Sling APT parser ............................... SUCCESS [7.194s]
[INFO] Apache Sling APT servlet .............................. SUCCESS [4.415s]
[INFO] Apache Sling Dojo JavaScript Library .................. SUCCESS [1:37.660s]
[INFO] Apache Sling Dojo Data Extension ...................... SUCCESS [3.649s]
[INFO] Apache Sling Google Web Toolkit Servlet Library ....... SUCCESS [19.400s]
[INFO] Apache Sling Google Web Toolkit Sample ................ SUCCESS [39.928s]
[INFO] Apache Sling Internationalization Support ............. SUCCESS [14.237s]
[INFO] Apache Sling OSGi Bundle Repository ................... SUCCESS [7.482s]
[INFO] Apache Sling Rewriter ................................. SUCCESS [7.165s]
[INFO] Apache Sling Repository Accessor ...................... SUCCESS [4.738s]
[INFO] Apache Sling JCR Java Compiler ........................ SUCCESS [6.154s]
[INFO] Apache Sling JCR Prefs ................................ SUCCESS [4.386s]
[INFO] Apache Sling Atom Tag Library ......................... SUCCESS [6.157s]
[INFO] Apache Sling Scripting Freemarker Support ............. SUCCESS [15.987s]
[INFO] Apache Sling Scripting Java Support ................... SUCCESS [6.497s]
[INFO] Apache Sling Scripting JST Support .................... SUCCESS [11.998s]
[INFO] Apache Sling Scripting Python Support ................. SUCCESS [11.187s]
[INFO] Apache Sling Scripting Ruby Support ................... SUCCESS [45.341s]
[INFO] Scala Script Engine ................................... SUCCESS [53.114s]
[INFO] Apache Sling Scala Scripting Configuration ............ SUCCESS [6.562s]
[INFO] Scala for Sling Demo Application - Hello World ........ SUCCESS [4.182s]
[INFO] Scala for Sling Demo Application - Forum .............. SUCCESS [3.899s]
[INFO] Apache Sling Scripting Velocity Support ............... SUCCESS [9.450s]
[INFO] Apache Sling Scripting W3C XML Processing Support ..... SUCCESS [6.747s]
[INFO] Apache Sling Features for ServiceMix Kernel ........... SUCCESS [3.675s]
[INFO] Apache Sling Launchpad Contrib Testing ................ SUCCESS [7:04.486s]
[INFO] Apache Sling Contrib (Builder) ........................ SUCCESS [8.177s]
[INFO] ------------------------------------------------------------------------
[INFO] ------------------------------------------------------------------------
[INFO] BUILD SUCCESSFUL
[INFO] ------------------------------------------------------------------------
[INFO] Total time: 15 minutes 48 seconds
[INFO] Finished at: Mon Feb 06 12:26:56 UTC 2012
[INFO] Final Memory: 115M/177M
[INFO] ------------------------------------------------------------------------
channel stopped
2012-02-06 12:26:57.174:INFO::Shutdown hook executing
2012-02-06 12:26:57.174:INFO::Shutdown hook complete
[locks-and-latches] Releasing all the locks
[locks-and-latches] All the locks released
Maven RedeployPublished use remote ubuntu1 maven settings from : /home/jenkins/.m2/settings.xml
[INFO] Deployment in https://repository.apache.org/content/repositories/snapshots/ (id=,uniqueVersion=false)
Deploying the main artifact org.apache.sling.atom.taglib-0.9.0-SNAPSHOT.jar
ERROR: Error deploying artifact: Failed to transfer file: https://repository.apache.org/content/repositories/snapshots/org/apache/sling/org.apache.sling.atom.taglib/0.9.0-SNAPSHOT/org.apache.sling.atom.taglib-0.9.0-SNAPSHOT.jar.
Return code is: 401, ReasonPhrase:Unauthorized.
org.apache.maven.artifact.deployer.ArtifactDeploymentException: Error deploying artifact:
Failed to transfer file: https://repository.apache.org/content/repositories/snapshots/org/apache/sling/org.apache.sling.atom.taglib/0.9.0-SNAPSHOT/org.apache.sling.atom.taglib-0.9.0-SNAPSHOT.jar.
Return code is: 401, ReasonPhrase:Unauthorized.
	at hudson.maven.artifact.deployer.DefaultArtifactDeployer.deploy(DefaultArtifactDeployer.java:175)
	at hudson.maven.reporters.MavenArtifactRecord.deploy(MavenArtifactRecord.java:182)
	at hudson.maven.RedeployPublisher.perform(RedeployPublisher.java:158)
	at hudson.tasks.BuildStepMonitor$1.perform(BuildStepMonitor.java:19)
	at hudson.model.AbstractBuild$AbstractRunner.perform(AbstractBuild.java:697)
	at hudson.model.AbstractBuild$AbstractRunner.performAllBuildSteps(AbstractBuild.java:672)
	at hudson.maven.MavenModuleSetBuild$RunnerImpl.post2(MavenModuleSetBuild.java:997)
	at hudson.model.AbstractBuild$AbstractRunner.post(AbstractBuild.java:619)
	at hudson.model.Run.run(Run.java:1429)
	at hudson.maven.MavenModuleSetBuild.run(MavenModuleSetBuild.java:481)
	at hudson.model.ResourceController.execute(ResourceController.java:88)
	at hudson.model.Executor.run(Executor.java:238)
Caused by: org.apache.maven.wagon.TransferFailedException: Failed to transfer file: https://repository.apache.org/content/repositories/snapshots/org/apache/sling/org.apache.sling.atom.taglib/0.9.0-SNAPSHOT/org.apache.sling.atom.taglib-0.9.0-SNAPSHOT.jar.
Return code is: 401, ReasonPhrase:Unauthorized.
	at org.apache.maven.wagon.shared.http4.AbstractHttpClientWagon.put(AbstractHttpClientWagon.java:562)
	at org.apache.maven.wagon.shared.http4.AbstractHttpClientWagon.put(AbstractHttpClientWagon.java:471)
	at org.apache.maven.wagon.shared.http4.AbstractHttpClientWagon.put(AbstractHttpClientWagon.java:451)
	at org.apache.maven.repository.legacy.DefaultWagonManager.putRemoteFile(DefaultWagonManager.java:543)
	at org.apache.maven.repository.legacy.DefaultWagonManager.putArtifact(DefaultWagonManager.java:494)
	at hudson.maven.artifact.deployer.DefaultArtifactDeployer.deploy(DefaultArtifactDeployer.java:160)
	... 11 more
[INFO] Deployment failed after 1 sec
Build step 'Deploy artifacts to Maven repository' changed build result to FAILURE


Mime
View raw message