sling-dev mailing list archives

Site index · List index
Message view « Date » · « Thread »
Top « Date » · « Thread »
From Apache Hudson Server <hud...@hudson.zones.apache.org>
Subject Build failed in Hudson: sling-contrib-1.5 » Apache Sling Launchpad Contrib Testing #429
Date Tue, 06 Apr 2010 18:41:20 GMT
See <http://hudson.zones.apache.org/hudson/job/sling-contrib-1.5/org.apache.sling$org.apache.sling.launchpad.contrib-testing/429/>

------------------------------------------
[...truncated 3399 lines...]
<br/>                                                
<br/>                                                
<br/>                                                
<br/>                                                
<br/>                                                
<br/>                                                
<br/>                                                
<br/>                                                

</body>
</html>
]
org.apache.sling.commons.testing.integration.HttpStatusCodeException: Expected status code
302 for POST, got 404, URL=http://localhost:36835/org.apache.sling.launchpad.contrib-testing-4-SNAPSHOT/WaitForSlingStartup/1270579254372,
Content=[<html>
<head>
<meta http-equiv="Content-Type" content="text/html; charset=ISO-8859-1"/>
<title>Error 404 </title>
</head>
<body><h2>HTTP ERROR: 404</h2><pre>NOT_FOUND</pre>
<p>RequestURI=/org.apache.sling.launchpad.contrib-testing-4-SNAPSHOT/WaitForSlingStartup/1270579254372</p><p><i><small><a
href="http://jetty.mortbay.org/">Powered by Jetty://</a></small></i></p><br/>
                                               
<br/>                                                
<br/>                                                
<br/>                                                
<br/>                                                
<br/>                                                
<br/>                                                
<br/>                                                
<br/>                                                
<br/>                                                
<br/>                                                
<br/>                                                
<br/>                                                
<br/>                                                
<br/>                                                
<br/>                                                
<br/>                                                
<br/>                                                
<br/>                                                
<br/>                                                

</body>
</html>
]
org.apache.sling.commons.testing.integration.HttpStatusCodeException: Expected status code
302 for POST, got 404, URL=http://localhost:36835/org.apache.sling.launchpad.contrib-testing-4-SNAPSHOT/WaitForSlingStartup/1270579255337,
Content=[<html>
<head>
<meta http-equiv="Content-Type" content="text/html; charset=ISO-8859-1"/>
<title>Error 404 </title>
</head>
<body><h2>HTTP ERROR: 404</h2><pre>NOT_FOUND</pre>
<p>RequestURI=/org.apache.sling.launchpad.contrib-testing-4-SNAPSHOT/WaitForSlingStartup/1270579255337</p><p><i><small><a
href="http://jetty.mortbay.org/">Powered by Jetty://</a></small></i></p><br/>
                                               
<br/>                                                
<br/>                                                
<br/>                                                
<br/>                                                
<br/>                                                
<br/>                                                
<br/>                                                
<br/>                                                
<br/>                                                
<br/>                                                
<br/>                                                
<br/>                                                
<br/>                                                
<br/>                                                
<br/>                                                
<br/>                                                
<br/>                                                
<br/>                                                
<br/>                                                

</body>
</html>
]
org.apache.sling.commons.testing.integration.HttpStatusCodeException: Expected status code
302 for POST, got 404, URL=http://localhost:36835/org.apache.sling.launchpad.contrib-testing-4-SNAPSHOT/WaitForSlingStartup/1270579255849,
Content=[<html>
<head>
<meta http-equiv="Content-Type" content="text/html; charset=ISO-8859-1"/>
<title>Error 404 </title>
</head>
<body><h2>HTTP ERROR: 404</h2><pre>NOT_FOUND</pre>
<p>RequestURI=/org.apache.sling.launchpad.contrib-testing-4-SNAPSHOT/WaitForSlingStartup/1270579255849</p><p><i><small><a
href="http://jetty.mortbay.org/">Powered by Jetty://</a></small></i></p><br/>
                                               
<br/>                                                
<br/>                                                
<br/>                                                
<br/>                                                
<br/>                                                
<br/>                                                
<br/>                                                
<br/>                                                
<br/>                                                
<br/>                                                
<br/>                                                
<br/>                                                
<br/>                                                
<br/>                                                
<br/>                                                
<br/>                                                
<br/>                                                
<br/>                                                
<br/>                                                

</body>
</html>
]
org.apache.sling.commons.testing.integration.HttpStatusCodeException: Expected status code
302 for POST, got 404, URL=http://localhost:36835/org.apache.sling.launchpad.contrib-testing-4-SNAPSHOT/WaitForSlingStartup/1270579256372,
Content=[<html>
<head>
<meta http-equiv="Content-Type" content="text/html; charset=ISO-8859-1"/>
<title>Error 404 </title>
</head>
<body><h2>HTTP ERROR: 404</h2><pre>NOT_FOUND</pre>
<p>RequestURI=/org.apache.sling.launchpad.contrib-testing-4-SNAPSHOT/WaitForSlingStartup/1270579256372</p><p><i><small><a
href="http://jetty.mortbay.org/">Powered by Jetty://</a></small></i></p><br/>
                                               
<br/>                                                
<br/>                                                
<br/>                                                
<br/>                                                
<br/>                                                
<br/>                                                
<br/>                                                
<br/>                                                
<br/>                                                
<br/>                                                
<br/>                                                
<br/>                                                
<br/>                                                
<br/>                                                
<br/>                                                
<br/>                                                
<br/>                                                
<br/>                                                
<br/>                                                

</body>
</html>
]
org.apache.sling.commons.testing.integration.HttpStatusCodeException: Expected status code
302 for POST, got 404, URL=http://localhost:36835/org.apache.sling.launchpad.contrib-testing-4-SNAPSHOT/WaitForSlingStartup/1270579256892,
Content=[<html>
<head>
<meta http-equiv="Content-Type" content="text/html; charset=ISO-8859-1"/>
<title>Error 404 </title>
</head>
<body><h2>HTTP ERROR: 404</h2><pre>NOT_FOUND</pre>
<p>RequestURI=/org.apache.sling.launchpad.contrib-testing-4-SNAPSHOT/WaitForSlingStartup/1270579256892</p><p><i><small><a
href="http://jetty.mortbay.org/">Powered by Jetty://</a></small></i></p><br/>
                                               
<br/>                                                
<br/>                                                
<br/>                                                
<br/>                                                
<br/>                                                
<br/>                                                
<br/>                                                
<br/>                                                
<br/>                                                
<br/>                                                
<br/>                                                
<br/>                                                
<br/>                                                
<br/>                                                
<br/>                                                
<br/>                                                
<br/>                                                
<br/>                                                
<br/>                                                

</body>
</html>
]
org.apache.sling.commons.testing.integration.HttpStatusCodeException: Expected status code
302 for POST, got 404, URL=http://localhost:36835/org.apache.sling.launchpad.contrib-testing-4-SNAPSHOT/WaitForSlingStartup/1270579257422,
Content=[<html>
<head>
<meta http-equiv="Content-Type" content="text/html; charset=ISO-8859-1"/>
<title>Error 404 </title>
</head>
<body><h2>HTTP ERROR: 404</h2><pre>NOT_FOUND</pre>
<p>RequestURI=/org.apache.sling.launchpad.contrib-testing-4-SNAPSHOT/WaitForSlingStartup/1270579257422</p><p><i><small><a
href="http://jetty.mortbay.org/">Powered by Jetty://</a></small></i></p><br/>
                                               
<br/>                                                
<br/>                                                
<br/>                                                
<br/>                                                
<br/>                                                
<br/>                                                
<br/>                                                
<br/>                                                
<br/>                                                
<br/>                                                
<br/>                                                
<br/>                                                
<br/>                                                
<br/>                                                
<br/>                                                
<br/>                                                
<br/>                                                
<br/>                                                
<br/>                                                

</body>
</html>
]

Tests run: 3, Failures: 3, Errors: 0, Skipped: 0, Time elapsed: 60.368 sec <<< FAILURE!
Running org.apache.sling.launchpad.webapp.integrationtest.SlingResourceTypeRenderingTest
Tests run: 5, Failures: 5, Errors: 0, Skipped: 0, Time elapsed: 0.051 sec <<< FAILURE!
Running org.apache.sling.launchpad.webapp.integrationtest.GetStarTest
Tests run: 1, Failures: 1, Errors: 0, Skipped: 0, Time elapsed: 0.005 sec <<< FAILURE!
Running org.apache.sling.launchpad.webapp.integrationtest.apt.SimpleAptRenderingTest
Tests run: 1, Failures: 1, Errors: 0, Skipped: 0, Time elapsed: 0.005 sec <<< FAILURE!
Running org.apache.sling.launchpad.webapp.integrationtest.scala.ScalaScriptingTest
Tests run: 3, Failures: 3, Errors: 0, Skipped: 0, Time elapsed: 0.009 sec <<< FAILURE!
Running org.apache.sling.launchpad.webapp.integrationtest.PathBasedResourceTypeTest
Tests run: 2, Failures: 2, Errors: 0, Skipped: 0, Time elapsed: 0.007 sec <<< FAILURE!

Results :

Failed tests: 
  testStaticXml(org.apache.sling.launchpad.webapp.integrationtest.xproc.XsltTest)
  testDynamicXml(org.apache.sling.launchpad.webapp.integrationtest.xproc.XsltTest)
  testNoXml(org.apache.sling.launchpad.webapp.integrationtest.xproc.XsltTest)
  testPythonHtml(org.apache.sling.launchpad.webapp.integrationtest.SlingResourceTypeRenderingTest)
  testPythonJavaCode(org.apache.sling.launchpad.webapp.integrationtest.SlingResourceTypeRenderingTest)
  testPythonHtmlInAppsFolder(org.apache.sling.launchpad.webapp.integrationtest.SlingResourceTypeRenderingTest)
  testPythonXml(org.apache.sling.launchpad.webapp.integrationtest.SlingResourceTypeRenderingTest)
  testPythonPlain(org.apache.sling.launchpad.webapp.integrationtest.SlingResourceTypeRenderingTest)
  testGetStarWithScript(org.apache.sling.launchpad.webapp.integrationtest.GetStarTest)
  testAptDocument(org.apache.sling.launchpad.webapp.integrationtest.apt.SimpleAptRenderingTest)
  testIgnore(org.apache.sling.launchpad.webapp.integrationtest.scala.ScalaScriptingTest)
  testHelloWorldApp(org.apache.sling.launchpad.webapp.integrationtest.scala.ScalaScriptingTest)
  testForumApp(org.apache.sling.launchpad.webapp.integrationtest.scala.ScalaScriptingTest)
  testDefaultResourceType(org.apache.sling.launchpad.webapp.integrationtest.PathBasedResourceTypeTest)
  testExplicitResourceType(org.apache.sling.launchpad.webapp.integrationtest.PathBasedResourceTypeTest)

Tests run: 15, Failures: 15, Errors: 0, Skipped: 0

[ERROR] There are test failures.

Please refer to <http://hudson.zones.apache.org/hudson/job/sling-contrib-1.5/org.apache.sling$org.apache.sling.launchpad.contrib-testing/ws/target/surefire-reports>
for the individual test results.
[HUDSON] Recording test results
[INFO] [cargo:stop {execution: stop-container}]
[INFO] [beddedLocalContainer] Jetty 6.x Embedded is stopping...
[INFO] [beddedLocalContainer] Jetty 6.x Embedded is stopped
[INFO] [ianal:verify-legal-files {execution: default}]
[INFO] Checking legal files in: org.apache.sling.launchpad.contrib-testing-4-SNAPSHOT.war
[HUDSON] Archiving <http://hudson.zones.apache.org/hudson/job/sling-contrib-1.5/org.apache.sling$org.apache.sling.launchpad.contrib-testing/ws/target/org.apache.sling.launchpad.contrib-testing-4-SNAPSHOT-sources.jar>
to /export/home/hudson/hudson/jobs/sling-contrib-1.5/modules/org.apache.sling$org.apache.sling.launchpad.contrib-testing/builds/2010-04-06_18-29-28/archive/org.apache.sling/org.apache.sling.launchpad.contrib-testing/4-SNAPSHOT/org.apache.sling.launchpad.contrib-testing-4-SNAPSHOT-sources.jar
[INFO] ------------------------------------------------------------------------
[ERROR] BUILD ERROR
[INFO] ------------------------------------------------------------------------
[INFO] Artifact does not contain any legal files: org.apache.sling.launchpad.contrib-testing-4-SNAPSHOT.war
[INFO] ------------------------------------------------------------------------
[INFO] For more information, run Maven with the -e switch
[INFO] ------------------------------------------------------------------------
[INFO] Total time: 11 minutes 30 seconds
[INFO] Finished at: Tue Apr 06 18:41:11 UTC 2010
[INFO] Final Memory: 87M/114M
[INFO] ------------------------------------------------------------------------
2010-04-06 18:41:12.940:/org.apache.sling.launchpad.contrib-testing-4-SNAPSHOT:INFO:  sling:
Sling has been stopped
Waiting for Hudson to finish collecting data


Mime
View raw message