sling-dev mailing list archives

Site index · List index
Message view « Date » · « Thread »
Top « Date » · « Thread »
From Apache Hudson Server <hud...@hudson.zones.apache.org>
Subject Build failed in Hudson: sling-contrib-1.5 #427
Date Tue, 06 Apr 2010 11:24:24 GMT
See <http://hudson.zones.apache.org/hudson/job/sling-contrib-1.5/427/>

------------------------------------------
[...truncated 6991 lines...]
<br/>                                                
<br/>                                                

</body>
</html>
]
org.apache.sling.commons.testing.integration.HttpStatusCodeException: Expected status code
302 for POST, got 404, URL=http://localhost:53247/org.apache.sling.launchpad.contrib-testing-4-SNAPSHOT/WaitForSlingStartup/1270553021549,
Content=[<html>
<head>
<meta http-equiv="Content-Type" content="text/html; charset=ISO-8859-1"/>
<title>Error 404 </title>
</head>
<body><h2>HTTP ERROR: 404</h2><pre>NOT_FOUND</pre>
<p>RequestURI=/org.apache.sling.launchpad.contrib-testing-4-SNAPSHOT/WaitForSlingStartup/1270553021549</p><p><i><small><a
href="http://jetty.mortbay.org/">Powered by Jetty://</a></small></i></p><br/>
                                               
<br/>                                                
<br/>                                                
<br/>                                                
<br/>                                                
<br/>                                                
<br/>                                                
<br/>                                                
<br/>                                                
<br/>                                                
<br/>                                                
<br/>                                                
<br/>                                                
<br/>                                                
<br/>                                                
<br/>                                                
<br/>                                                
<br/>                                                
<br/>                                                
<br/>                                                

</body>
</html>
]
org.apache.sling.commons.testing.integration.HttpStatusCodeException: Expected status code
302 for POST, got 404, URL=http://localhost:53247/org.apache.sling.launchpad.contrib-testing-4-SNAPSHOT/WaitForSlingStartup/1270553022069,
Content=[<html>
<head>
<meta http-equiv="Content-Type" content="text/html; charset=ISO-8859-1"/>
<title>Error 404 </title>
</head>
<body><h2>HTTP ERROR: 404</h2><pre>NOT_FOUND</pre>
<p>RequestURI=/org.apache.sling.launchpad.contrib-testing-4-SNAPSHOT/WaitForSlingStartup/1270553022069</p><p><i><small><a
href="http://jetty.mortbay.org/">Powered by Jetty://</a></small></i></p><br/>
                                               
<br/>                                                
<br/>                                                
<br/>                                                
<br/>                                                
<br/>                                                
<br/>                                                
<br/>                                                
<br/>                                                
<br/>                                                
<br/>                                                
<br/>                                                
<br/>                                                
<br/>                                                
<br/>                                                
<br/>                                                
<br/>                                                
<br/>                                                
<br/>                                                
<br/>                                                

</body>
</html>
]
org.apache.sling.commons.testing.integration.HttpStatusCodeException: Expected status code
302 for POST, got 404, URL=http://localhost:53247/org.apache.sling.launchpad.contrib-testing-4-SNAPSHOT/WaitForSlingStartup/1270553022589,
Content=[<html>
<head>
<meta http-equiv="Content-Type" content="text/html; charset=ISO-8859-1"/>
<title>Error 404 </title>
</head>
<body><h2>HTTP ERROR: 404</h2><pre>NOT_FOUND</pre>
<p>RequestURI=/org.apache.sling.launchpad.contrib-testing-4-SNAPSHOT/WaitForSlingStartup/1270553022589</p><p><i><small><a
href="http://jetty.mortbay.org/">Powered by Jetty://</a></small></i></p><br/>
                                               
<br/>                                                
<br/>                                                
<br/>                                                
<br/>                                                
<br/>                                                
<br/>                                                
<br/>                                                
<br/>                                                
<br/>                                                
<br/>                                                
<br/>                                                
<br/>                                                
<br/>                                                
<br/>                                                
<br/>                                                
<br/>                                                
<br/>                                                
<br/>                                                
<br/>                                                

</body>
</html>
]
org.apache.sling.commons.testing.integration.HttpStatusCodeException: Expected status code
302 for POST, got 404, URL=http://localhost:53247/org.apache.sling.launchpad.contrib-testing-4-SNAPSHOT/WaitForSlingStartup/1270553023109,
Content=[<html>
<head>
<meta http-equiv="Content-Type" content="text/html; charset=ISO-8859-1"/>
<title>Error 404 </title>
</head>
<body><h2>HTTP ERROR: 404</h2><pre>NOT_FOUND</pre>
<p>RequestURI=/org.apache.sling.launchpad.contrib-testing-4-SNAPSHOT/WaitForSlingStartup/1270553023109</p><p><i><small><a
href="http://jetty.mortbay.org/">Powered by Jetty://</a></small></i></p><br/>
                                               
<br/>                                                
<br/>                                                
<br/>                                                
<br/>                                                
<br/>                                                
<br/>                                                
<br/>                                                
<br/>                                                
<br/>                                                
<br/>                                                
<br/>                                                
<br/>                                                
<br/>                                                
<br/>                                                
<br/>                                                
<br/>                                                
<br/>                                                
<br/>                                                
<br/>                                                

</body>
</html>
]
org.apache.sling.commons.testing.integration.HttpStatusCodeException: Expected status code
302 for POST, got 404, URL=http://localhost:53247/org.apache.sling.launchpad.contrib-testing-4-SNAPSHOT/WaitForSlingStartup/1270553023631,
Content=[<html>
<head>
<meta http-equiv="Content-Type" content="text/html; charset=ISO-8859-1"/>
<title>Error 404 </title>
</head>
<body><h2>HTTP ERROR: 404</h2><pre>NOT_FOUND</pre>
<p>RequestURI=/org.apache.sling.launchpad.contrib-testing-4-SNAPSHOT/WaitForSlingStartup/1270553023631</p><p><i><small><a
href="http://jetty.mortbay.org/">Powered by Jetty://</a></small></i></p><br/>
                                               
<br/>                                                
<br/>                                                
<br/>                                                
<br/>                                                
<br/>                                                
<br/>                                                
<br/>                                                
<br/>                                                
<br/>                                                
<br/>                                                
<br/>                                                
<br/>                                                
<br/>                                                
<br/>                                                
<br/>                                                
<br/>                                                
<br/>                                                
<br/>                                                
<br/>                                                

</body>
</html>
]
org.apache.sling.commons.testing.integration.HttpStatusCodeException: Expected status code
302 for POST, got 404, URL=http://localhost:53247/org.apache.sling.launchpad.contrib-testing-4-SNAPSHOT/WaitForSlingStartup/1270553024149,
Content=[<html>
<head>
<meta http-equiv="Content-Type" content="text/html; charset=ISO-8859-1"/>
<title>Error 404 </title>
</head>
<body><h2>HTTP ERROR: 404</h2><pre>NOT_FOUND</pre>
<p>RequestURI=/org.apache.sling.launchpad.contrib-testing-4-SNAPSHOT/WaitForSlingStartup/1270553024149</p><p><i><small><a
href="http://jetty.mortbay.org/">Powered by Jetty://</a></small></i></p><br/>
                                               
<br/>                                                
<br/>                                                
<br/>                                                
<br/>                                                
<br/>                                                
<br/>                                                
<br/>                                                
<br/>                                                
<br/>                                                
<br/>                                                
<br/>                                                
<br/>                                                
<br/>                                                
<br/>                                                
<br/>                                                
<br/>                                                
<br/>                                                
<br/>                                                
<br/>                                                

</body>
</html>
]

Tests run: 3, Failures: 3, Errors: 0, Skipped: 0, Time elapsed: 60.82 sec <<< FAILURE!
Running org.apache.sling.launchpad.webapp.integrationtest.SlingResourceTypeRenderingTest
Tests run: 5, Failures: 5, Errors: 0, Skipped: 0, Time elapsed: 0.013 sec <<< FAILURE!
Running org.apache.sling.launchpad.webapp.integrationtest.GetStarTest
Tests run: 1, Failures: 1, Errors: 0, Skipped: 0, Time elapsed: 0.005 sec <<< FAILURE!
Running org.apache.sling.launchpad.webapp.integrationtest.apt.SimpleAptRenderingTest
Tests run: 1, Failures: 1, Errors: 0, Skipped: 0, Time elapsed: 0.005 sec <<< FAILURE!
Running org.apache.sling.launchpad.webapp.integrationtest.scala.ScalaScriptingTest
Tests run: 3, Failures: 3, Errors: 0, Skipped: 0, Time elapsed: 0.008 sec <<< FAILURE!
Running org.apache.sling.launchpad.webapp.integrationtest.PathBasedResourceTypeTest
Tests run: 2, Failures: 2, Errors: 0, Skipped: 0, Time elapsed: 0.006 sec <<< FAILURE!

Results :

Failed tests: 
  testStaticXml(org.apache.sling.launchpad.webapp.integrationtest.xproc.XsltTest)
  testDynamicXml(org.apache.sling.launchpad.webapp.integrationtest.xproc.XsltTest)
  testNoXml(org.apache.sling.launchpad.webapp.integrationtest.xproc.XsltTest)
  testPythonHtml(org.apache.sling.launchpad.webapp.integrationtest.SlingResourceTypeRenderingTest)
  testPythonJavaCode(org.apache.sling.launchpad.webapp.integrationtest.SlingResourceTypeRenderingTest)
  testPythonHtmlInAppsFolder(org.apache.sling.launchpad.webapp.integrationtest.SlingResourceTypeRenderingTest)
  testPythonXml(org.apache.sling.launchpad.webapp.integrationtest.SlingResourceTypeRenderingTest)
  testPythonPlain(org.apache.sling.launchpad.webapp.integrationtest.SlingResourceTypeRenderingTest)
  testGetStarWithScript(org.apache.sling.launchpad.webapp.integrationtest.GetStarTest)
  testAptDocument(org.apache.sling.launchpad.webapp.integrationtest.apt.SimpleAptRenderingTest)
  testIgnore(org.apache.sling.launchpad.webapp.integrationtest.scala.ScalaScriptingTest)
  testHelloWorldApp(org.apache.sling.launchpad.webapp.integrationtest.scala.ScalaScriptingTest)
  testForumApp(org.apache.sling.launchpad.webapp.integrationtest.scala.ScalaScriptingTest)
  testDefaultResourceType(org.apache.sling.launchpad.webapp.integrationtest.PathBasedResourceTypeTest)
  testExplicitResourceType(org.apache.sling.launchpad.webapp.integrationtest.PathBasedResourceTypeTest)

Tests run: 15, Failures: 15, Errors: 0, Skipped: 0

[HUDSON] Recording test results[ERROR] There are test failures.

Please refer to <http://hudson.zones.apache.org/hudson/job/sling-contrib-1.5/ws/contrib-1.5/launchpad/testing/target/surefire-reports>
for the individual test results.

[INFO] [cargo:stop {execution: stop-container}]
[INFO] [beddedLocalContainer] Jetty 6.x Embedded is stopping...
2010-04-06 11:23:50.336:/org.apache.sling.launchpad.contrib-testing-4-SNAPSHOT:INFO:  sling:
Sling has been stopped
[INFO] [beddedLocalContainer] Jetty 6.x Embedded is stopped
[INFO] [ianal:verify-legal-files {execution: default}]
[INFO] Checking legal files in: org.apache.sling.launchpad.contrib-testing-4-SNAPSHOT.war
[HUDSON] Archiving <http://hudson.zones.apache.org/hudson/job/sling-contrib-1.5/ws/contrib-1.5/launchpad/testing/target/org.apache.sling.launchpad.contrib-testing-4-SNAPSHOT-sources.jar>
to /export/home/hudson/hudson/jobs/sling-contrib-1.5/modules/org.apache.sling$org.apache.sling.launchpad.contrib-testing/builds/2010-04-06_11-10-21/archive/org.apache.sling/org.apache.sling.launchpad.contrib-testing/4-SNAPSHOT/org.apache.sling.launchpad.contrib-testing-4-SNAPSHOT-sources.jar
[INFO] ------------------------------------------------------------------------
[ERROR] BUILD ERROR
[INFO] ------------------------------------------------------------------------
[INFO] Artifact does not contain any legal files: org.apache.sling.launchpad.contrib-testing-4-SNAPSHOT.war
[INFO] ------------------------------------------------------------------------
[INFO] For more information, run Maven with the -e switch
[INFO] ------------------------------------------------------------------------
[INFO] Total time: 13 minutes 17 seconds
[INFO] Finished at: Tue Apr 06 11:24:00 UTC 2010
[INFO] Final Memory: 80M/119M
[INFO] ------------------------------------------------------------------------
Waiting for Hudson to finish collecting data
Sending e-mails to: dev@sling.apache.org
channel stopped
2010-04-06 11:24:07.509::INFO:  Shutdown hook executing
2010-04-06 11:24:07.510::INFO:  Shutdown hook complete
[locks-and-latches] Releasing all the locks
[locks-and-latches] All the locks released


Mime
View raw message