sling-commits mailing list archives

Site index · List index
Message view « Date » · « Thread »
Top « Date » · « Thread »
From Apache Jenkins Server <jenk...@builds.apache.org>
Subject Build failed in Jenkins: sling-org-apache-sling-tail-1.8 #69
Date Fri, 21 Dec 2018 15:40:04 GMT
See <https://builds.apache.org/job/sling-org-apache-sling-tail-1.8/69/display/redirect?page=changes>

Changes:

[rombert] SLING-7245 - Validate pull requests using Jenkins

------------------------------------------
Started by an SCM change
[EnvInject] - Loading node environment variables.
Building remotely on H40 (ubuntu xenial) in workspace <https://builds.apache.org/job/sling-org-apache-sling-tail-1.8/ws/>
[WS-CLEANUP] Deleting project workspace...
Cloning the remote Git repository
Cloning repository https://github.com/apache/sling-org-apache-sling-tail.git
 > git init <https://builds.apache.org/job/sling-org-apache-sling-tail-1.8/ws/> #
timeout=10
Fetching upstream changes from https://github.com/apache/sling-org-apache-sling-tail.git
 > git --version # timeout=10
 > git fetch --tags --progress https://github.com/apache/sling-org-apache-sling-tail.git
+refs/heads/*:refs/remotes/origin/*
 > git config remote.origin.url https://github.com/apache/sling-org-apache-sling-tail.git
# timeout=10
 > git config --add remote.origin.fetch +refs/heads/*:refs/remotes/origin/* # timeout=10
 > git config remote.origin.url https://github.com/apache/sling-org-apache-sling-tail.git
# timeout=10
Fetching upstream changes from https://github.com/apache/sling-org-apache-sling-tail.git
 > git fetch --tags --progress https://github.com/apache/sling-org-apache-sling-tail.git
+refs/heads/*:refs/remotes/origin/*
 > git rev-parse origin/master^{commit} # timeout=10
Checking out Revision 1d031487783c91d73671904558d286ed8c435519 (origin/master)
 > git config core.sparsecheckout # timeout=10
 > git checkout -f 1d031487783c91d73671904558d286ed8c435519
Commit message: "SLING-7245 - Validate pull requests using Jenkins"
 > git rev-list --no-walk f83c941a0b1442a2dd40d0f0df875cd0550621a8 # timeout=10
Parsing POMs
Established TCP socket on 39315
maven35-agent.jar already up to date
maven35-interceptor.jar already up to date
maven3-interceptor-commons.jar already up to date
[sling-org-apache-sling-tail-1.8] $ /home/jenkins/tools/java/latest1.8/bin/java -Xmx4g -Xms4g
-cp /home/jenkins/jenkins-slave/maven35-agent.jar:/home/jenkins/tools/maven/latest/boot/plexus-classworlds-2.5.2.jar:/home/jenkins/tools/maven/latest/conf/logging
jenkins.maven3.agent.Maven35Main /home/jenkins/tools/maven/latest/ /home/jenkins/jenkins-slave/slave.jar
/home/jenkins/jenkins-slave/maven35-interceptor.jar /home/jenkins/jenkins-slave/maven3-interceptor-commons.jar
39315
<===[JENKINS REMOTING CAPACITY]===>   channel started
Executing Maven:  -B -f <https://builds.apache.org/job/sling-org-apache-sling-tail-1.8/ws/pom.xml>
-Dmaven.repo.local=/home/jenkins/jenkins-slave/maven-repositories/0 -U clean deploy
[INFO] Scanning for projects...
[INFO] 
[INFO] ---------------< org.apache.sling:org.apache.sling.tail >---------------
[INFO] Building Apache Sling Log Tail Implementation 0.0.1-SNAPSHOT
[INFO] -------------------------------[ bundle ]-------------------------------
[INFO] Downloading from central: https://repo.maven.apache.org/maven2/biz/aQute/bnd/bnd/2.1.0/bnd-2.1.0.pom
[INFO] Downloaded from central: https://repo.maven.apache.org/maven2/biz/aQute/bnd/bnd/2.1.0/bnd-2.1.0.pom
(1.4 kB at 3.0 kB/s)
[INFO] Downloading from central: https://repo.maven.apache.org/maven2/org/apache/felix/org.apache.felix.webconsole/4.3.2/org.apache.felix.webconsole-4.3.2.pom
[INFO] Downloaded from central: https://repo.maven.apache.org/maven2/org/apache/felix/org.apache.felix.webconsole/4.3.2/org.apache.felix.webconsole-4.3.2.pom
(19 kB at 183 kB/s)
[INFO] Downloading from central: https://repo.maven.apache.org/maven2/org/apache/sling/org.apache.sling.commons.log/4.0.0/org.apache.sling.commons.log-4.0.0.pom
[INFO] Downloaded from central: https://repo.maven.apache.org/maven2/org/apache/sling/org.apache.sling.commons.log/4.0.0/org.apache.sling.commons.log-4.0.0.pom
(17 kB at 73 kB/s)
[INFO] Downloading from central: https://repo.maven.apache.org/maven2/ch/qos/logback/logback-classic/1.1.0/logback-classic-1.1.0.pom
[INFO] Downloaded from central: https://repo.maven.apache.org/maven2/ch/qos/logback/logback-classic/1.1.0/logback-classic-1.1.0.pom
(12 kB at 698 kB/s)
[INFO] Downloading from central: https://repo.maven.apache.org/maven2/ch/qos/logback/logback-parent/1.1.0/logback-parent-1.1.0.pom
[INFO] Downloaded from central: https://repo.maven.apache.org/maven2/ch/qos/logback/logback-parent/1.1.0/logback-parent-1.1.0.pom
(15 kB at 931 kB/s)
[INFO] Downloading from central: https://repo.maven.apache.org/maven2/ch/qos/logback/logback-core/1.1.0/logback-core-1.1.0.pom
[INFO] Downloaded from central: https://repo.maven.apache.org/maven2/ch/qos/logback/logback-core/1.1.0/logback-core-1.1.0.pom
(5.0 kB at 313 kB/s)
[INFO] Downloading from central: https://repo.maven.apache.org/maven2/biz/aQute/bnd/bnd/2.1.0/bnd-2.1.0.jar
[INFO] Downloading from central: https://repo.maven.apache.org/maven2/org/apache/felix/org.apache.felix.webconsole/4.3.2/org.apache.felix.webconsole-4.3.2.jar
[INFO] Downloading from central: https://repo.maven.apache.org/maven2/org/apache/sling/org.apache.sling.commons.log/4.0.0/org.apache.sling.commons.log-4.0.0.jar
[INFO] Downloading from central: https://repo.maven.apache.org/maven2/ch/qos/logback/logback-classic/1.1.0/logback-classic-1.1.0.jar
[INFO] Downloading from central: https://repo.maven.apache.org/maven2/ch/qos/logback/logback-core/1.1.0/logback-core-1.1.0.jar
[INFO] Downloaded from central: https://repo.maven.apache.org/maven2/ch/qos/logback/logback-classic/1.1.0/logback-classic-1.1.0.jar
(271 kB at 3.7 MB/s)
[INFO] Downloaded from central: https://repo.maven.apache.org/maven2/ch/qos/logback/logback-core/1.1.0/logback-core-1.1.0.jar
(426 kB at 4.8 MB/s)
[INFO] Downloaded from central: https://repo.maven.apache.org/maven2/org/apache/sling/org.apache.sling.commons.log/4.0.0/org.apache.sling.commons.log-4.0.0.jar
(758 kB at 7.2 MB/s)
[INFO] Downloaded from central: https://repo.maven.apache.org/maven2/biz/aQute/bnd/bnd/2.1.0/bnd-2.1.0.jar
(1.9 MB at 4.9 MB/s)
[INFO] Downloaded from central: https://repo.maven.apache.org/maven2/org/apache/felix/org.apache.felix.webconsole/4.3.2/org.apache.felix.webconsole-4.3.2.jar
(478 kB at 1.1 MB/s)
[INFO] 
[INFO] --- maven-clean-plugin:2.5:clean (default-clean) @ org.apache.sling.tail ---
[INFO] 
[INFO] --- maven-enforcer-plugin:1.3.1:enforce (enforce-java) @ org.apache.sling.tail ---
[INFO] 
[INFO] --- maven-antrun-plugin:1.8:run (set-bundle-required-execution-environment) @ org.apache.sling.tail
---
[INFO] Executing tasks

main:
[INFO] Executed tasks
[INFO] 
[INFO] --- maven-remote-resources-plugin:1.5:process (default) @ org.apache.sling.tail ---
[INFO] 
[INFO] --- maven-resources-plugin:2.7:resources (default-resources) @ org.apache.sling.tail
---
[INFO] Using 'UTF-8' encoding to copy filtered resources.
[INFO] Copying 2 resources
[INFO] Copying 3 resources
[INFO] 
[INFO] --- maven-antrun-plugin:1.8:run (check-memory-task) @ org.apache.sling.tail ---
[INFO] Executing tasks

main:
     [echo] **************** WARNING (SLING-443/SLING-1782) ******************************
     [echo] On most platforms, you'll get OutOfMemoryErrors when building unless you set
     [echo] on 32bit platforms: MAVEN_OPTS="-Xmx256M -XX:MaxPermSize=256M", see SLING-443
     [echo] on 64bit platforms: MAVEN_OPTS="-Xmx512M -XX:MaxPermSize=512M", see SLING-1782
     [echo] ******************************************************************************
[INFO] Executed tasks
[INFO] 
[INFO] --- maven-compiler-plugin:3.2:compile (default-compile) @ org.apache.sling.tail ---
[INFO] Changes detected - recompiling the module!
[INFO] Compiling 2 source files to <https://builds.apache.org/job/sling-org-apache-sling-tail-1.8/ws/target/classes>
[INFO] 
[INFO] --- maven-scr-plugin:1.21.0:scr (generate-scr-scrdescriptor) @ org.apache.sling.tail
---
[INFO] Writing 1 Service Component Descriptors to <https://builds.apache.org/job/sling-org-apache-sling-tail-1.8/ws/target/classes/OSGI-INF/org.apache.sling.tail.impl.LogTailerWebConsolePlugin.xml>
[INFO] 
[INFO] --- maven-scr-plugin:1.21.0:scr (generate-scr-descriptor) @ org.apache.sling.tail ---
[INFO] Writing 1 Service Component Descriptors to <https://builds.apache.org/job/sling-org-apache-sling-tail-1.8/ws/target/classes/OSGI-INF/org.apache.sling.tail.impl.LogTailerWebConsolePlugin.xml>
[INFO] 
[INFO] --- maven-resources-plugin:2.7:testResources (default-testResources) @ org.apache.sling.tail
---
[INFO] Using 'UTF-8' encoding to copy filtered resources.
[INFO] skip non existing resourceDirectory <https://builds.apache.org/job/sling-org-apache-sling-tail-1.8/ws/src/test/resources>
[INFO] Copying 3 resources
[INFO] 
[INFO] --- maven-compiler-plugin:3.2:testCompile (default-testCompile) @ org.apache.sling.tail
---
[INFO] No sources to compile
[INFO] 
[INFO] --- maven-surefire-plugin:2.18.1:test (default-test) @ org.apache.sling.tail ---
[JENKINS] Recording test results
[INFO] 
[INFO] --- animal-sniffer-maven-plugin:1.14:check (default) @ org.apache.sling.tail ---
[INFO] Checking unresolved references to org.codehaus.mojo.signature:java16:1.0
[INFO] 
[INFO] --- maven-bundle-plugin:3.0.1:bundle (default-bundle) @ org.apache.sling.tail ---
[INFO] 
[INFO] >>> maven-source-plugin:2.4:jar (attach-sources) > generate-sources @ org.apache.sling.tail
>>>
[INFO] 
[INFO] --- maven-enforcer-plugin:1.3.1:enforce (enforce-java) @ org.apache.sling.tail ---
[INFO] 
[INFO] --- maven-antrun-plugin:1.8:run (set-bundle-required-execution-environment) @ org.apache.sling.tail
---
[INFO] Executing tasks

main:
[INFO] Executed tasks
[WARNING] Failed to getClass for org.apache.maven.plugin.source.SourceJarMojo
[INFO] 
[INFO] <<< maven-source-plugin:2.4:jar (attach-sources) < generate-sources @ org.apache.sling.tail
<<<
[INFO] 
[INFO] 
[INFO] --- maven-source-plugin:2.4:jar (attach-sources) @ org.apache.sling.tail ---
[INFO] Building jar: <https://builds.apache.org/job/sling-org-apache-sling-tail-1.8/ws/target/org.apache.sling.tail-0.0.1-SNAPSHOT-sources.jar>
[INFO] 
[INFO] --- maven-site-plugin:3.4:attach-descriptor (attach-descriptor) @ org.apache.sling.tail
---
[INFO] 
[INFO] --- ianal-maven-plugin:1.0-alpha-1:verify-legal-files (default) @ org.apache.sling.tail
---
[INFO] Checking legal files in: org.apache.sling.tail-0.0.1-SNAPSHOT.jar
[INFO] Checking legal files in: org.apache.sling.tail-0.0.1-SNAPSHOT-sources.jar
[INFO] 
[INFO] --- apache-rat-plugin:0.11:check (default) @ org.apache.sling.tail ---
[INFO] 51 implicit excludes (use -debug for more details).
[INFO] Exclude: src/main/appended-resources/META-INF/*
[INFO] Exclude: velocity.log
[INFO] Exclude: target/*
[INFO] Exclude: README.md
[INFO] Exclude: maven-eclipse.xml
[INFO] Exclude: .*
[INFO] Exclude: .*/**
[INFO] Exclude: **/*.json
[INFO] Exclude: DEPENDENCIES
[INFO] Exclude: **/*.rej
[INFO] Exclude: hs_err_*.log
[INFO] 9 resources included (use -debug for more details)
[INFO] Rat check: Summary of files. Unapproved: 1 unknown: 1 generated: 0 approved: 7 licence.
[WARNING] Attempt to (de-)serialize anonymous class hudson.maven.reporters.MavenArtifactArchiver$2;
see: https://jenkins.io/redirect/serialization-of-anonymous-classes/
[JENKINS] Archiving disabled
[WARNING] Attempt to (de-)serialize anonymous class hudson.maven.reporters.MavenFingerprinter$1;
see: https://jenkins.io/redirect/serialization-of-anonymous-classes/
[JENKINS] Archiving disabled
[INFO] ------------------------------------------------------------------------
[INFO] BUILD FAILURE
[INFO] ------------------------------------------------------------------------
[INFO] Total time: 02:15 min
[INFO] Finished at: 2018-12-21T15:39:04Z
[INFO] ------------------------------------------------------------------------
Waiting for Jenkins to finish collecting data
[ERROR] Failed to execute goal org.apache.rat:apache-rat-plugin:0.11:check (default) on project
org.apache.sling.tail: Too many files with unapproved license: 1 See RAT report in: <https://builds.apache.org/job/sling-org-apache-sling-tail-1.8/ws/target/rat.txt>
-> [Help 1]
[ERROR] 
[ERROR] To see the full stack trace of the errors, re-run Maven with the -e switch.
[ERROR] Re-run Maven using the -X switch to enable full debug logging.
[ERROR] 
[ERROR] For more information about the errors and possible solutions, please read the following
articles:
[ERROR] [Help 1] http://cwiki.apache.org/confluence/display/MAVEN/MojoFailureException
channel stopped
Recording test results

Mime
View raw message