sling-commits mailing list archives

Site index · List index
Message view « Date » · « Thread »
Top « Date » · « Thread »
From Apache Jenkins Server <jenk...@builds.apache.org>
Subject Build failed in Jenkins: sling-org-apache-sling-feature-extension-content-1.8 #56
Date Fri, 21 Dec 2018 16:03:42 GMT
See <https://builds.apache.org/job/sling-org-apache-sling-feature-extension-content-1.8/56/display/redirect>

------------------------------------------
Started by upstream project "sling-org-apache-sling-feature-launcher-1.8" build number 172
originally caused by:
 Started by timer
[EnvInject] - Loading node environment variables.
Building remotely on H34 (ubuntu xenial) in workspace <https://builds.apache.org/job/sling-org-apache-sling-feature-extension-content-1.8/ws/>
[WS-CLEANUP] Deleting project workspace...
Cloning the remote Git repository
Cloning repository https://github.com/apache/sling-org-apache-sling-feature-extension-content.git
 > git init <https://builds.apache.org/job/sling-org-apache-sling-feature-extension-content-1.8/ws/>
# timeout=10
Fetching upstream changes from https://github.com/apache/sling-org-apache-sling-feature-extension-content.git
 > git --version # timeout=10
 > git fetch --tags --progress https://github.com/apache/sling-org-apache-sling-feature-extension-content.git
+refs/heads/*:refs/remotes/origin/*
 > git config remote.origin.url https://github.com/apache/sling-org-apache-sling-feature-extension-content.git
# timeout=10
 > git config --add remote.origin.fetch +refs/heads/*:refs/remotes/origin/* # timeout=10
 > git config remote.origin.url https://github.com/apache/sling-org-apache-sling-feature-extension-content.git
# timeout=10
Fetching upstream changes from https://github.com/apache/sling-org-apache-sling-feature-extension-content.git
 > git fetch --tags --progress https://github.com/apache/sling-org-apache-sling-feature-extension-content.git
+refs/heads/*:refs/remotes/origin/*
 > git rev-parse origin/master^{commit} # timeout=10
Checking out Revision e77735417c23b27fca3d591bc7a99dc09bdbd3a7 (origin/master)
 > git config core.sparsecheckout # timeout=10
 > git checkout -f e77735417c23b27fca3d591bc7a99dc09bdbd3a7
Commit message: "Use copies when merging extensions rather than the original object"
 > git rev-list --no-walk e77735417c23b27fca3d591bc7a99dc09bdbd3a7 # timeout=10
Parsing POMs
Established TCP socket on 46264
maven35-agent.jar already up to date
maven35-interceptor.jar already up to date
maven3-interceptor-commons.jar already up to date
[sling-org-apache-sling-feature-extension-content-1.8] $ /home/jenkins/tools/java/latest1.8/bin/java
-Xmx4g -Xms4g -cp /home/jenkins/jenkins-slave/maven35-agent.jar:/home/jenkins/tools/maven/latest/boot/plexus-classworlds-2.5.2.jar:/home/jenkins/tools/maven/latest/conf/logging
jenkins.maven3.agent.Maven35Main /home/jenkins/tools/maven/latest/ /home/jenkins/jenkins-slave/slave.jar
/home/jenkins/jenkins-slave/maven35-interceptor.jar /home/jenkins/jenkins-slave/maven3-interceptor-commons.jar
46264
<===[JENKINS REMOTING CAPACITY]===>   channel started
Executing Maven:  -B -f <https://builds.apache.org/job/sling-org-apache-sling-feature-extension-content-1.8/ws/pom.xml>
-Dmaven.repo.local=/home/jenkins/jenkins-slave/maven-repositories/1 -U clean deploy
[INFO] Scanning for projects...
[INFO] 
[INFO] ----< org.apache.sling:org.apache.sling.feature.extension.content >-----
[INFO] Building Sling Featuremodel - Content Deployment Exension 0.0.1-SNAPSHOT
[INFO] --------------------------------[ jar ]---------------------------------
[INFO] Downloading from central: https://repo.maven.apache.org/maven2/org/apache/maven/plugins/maven-surefire-plugin/2.20.1/maven-surefire-plugin-2.20.1.pom
[INFO] Downloaded from central: https://repo.maven.apache.org/maven2/org/apache/maven/plugins/maven-surefire-plugin/2.20.1/maven-surefire-plugin-2.20.1.pom
(5.2 kB at 14 kB/s)
[INFO] Downloading from central: https://repo.maven.apache.org/maven2/org/apache/maven/plugins/maven-surefire-plugin/2.20.1/maven-surefire-plugin-2.20.1.jar
[INFO] Downloaded from central: https://repo.maven.apache.org/maven2/org/apache/maven/plugins/maven-surefire-plugin/2.20.1/maven-surefire-plugin-2.20.1.jar
(40 kB at 1.1 MB/s)
[INFO] Downloading from central: https://repo.maven.apache.org/maven2/org/osgi/osgi.core/6.0.0/osgi.core-6.0.0.pom
[INFO] Downloaded from central: https://repo.maven.apache.org/maven2/org/osgi/osgi.core/6.0.0/osgi.core-6.0.0.pom
(1.3 kB at 66 kB/s)
[INFO] Downloading from Nexus: http://repository.apache.org/snapshots/org/apache/jackrabbit/vault/org.apache.jackrabbit.vault/3.2.5-SNAPSHOT/maven-metadata.xml
[INFO] Downloading from Nexus: http://repository.apache.org/snapshots/org/apache/jackrabbit/vault/org.apache.jackrabbit.vault/3.2.5-SNAPSHOT/org.apache.jackrabbit.vault-3.2.5-SNAPSHOT.pom
[WARNING] The POM for org.apache.jackrabbit.vault:org.apache.jackrabbit.vault:jar:3.2.5-SNAPSHOT
is missing, no dependency information available
[INFO] Downloading from Nexus: http://repository.apache.org/snapshots/org/apache/sling/org.apache.sling.feature/0.8.1-SNAPSHOT/maven-metadata.xml
[INFO] Downloaded from Nexus: http://repository.apache.org/snapshots/org/apache/sling/org.apache.sling.feature/0.8.1-SNAPSHOT/maven-metadata.xml
(1.0 kB at 3.3 kB/s)
[INFO] Downloading from Nexus: http://repository.apache.org/snapshots/org/apache/sling/org.apache.sling.feature/0.8.1-SNAPSHOT/org.apache.sling.feature-0.8.1-20181220.155655-11.pom
[INFO] Downloaded from Nexus: http://repository.apache.org/snapshots/org/apache/sling/org.apache.sling.feature/0.8.1-SNAPSHOT/org.apache.sling.feature-0.8.1-20181220.155655-11.pom
(4.5 kB at 14 kB/s)
[INFO] Downloading from Nexus: http://repository.apache.org/snapshots/org/apache/sling/org.apache.sling.feature.io/0.8.1-SNAPSHOT/maven-metadata.xml
[INFO] Downloaded from Nexus: http://repository.apache.org/snapshots/org/apache/sling/org.apache.sling.feature.io/0.8.1-SNAPSHOT/maven-metadata.xml
(1.0 kB at 3.4 kB/s)
[INFO] Downloading from Nexus: http://repository.apache.org/snapshots/org/apache/sling/org.apache.sling.feature.io/0.8.1-SNAPSHOT/org.apache.sling.feature.io-0.8.1-20181220.160718-13.pom
[INFO] Downloaded from Nexus: http://repository.apache.org/snapshots/org/apache/sling/org.apache.sling.feature.io/0.8.1-SNAPSHOT/org.apache.sling.feature.io-0.8.1-20181220.160718-13.pom
(5.6 kB at 18 kB/s)
[INFO] Downloading from Nexus: http://repository.apache.org/snapshots/org/apache/sling/org.apache.sling.feature.launcher/0.8.1-SNAPSHOT/maven-metadata.xml
[INFO] Downloaded from Nexus: http://repository.apache.org/snapshots/org/apache/sling/org.apache.sling.feature.launcher/0.8.1-SNAPSHOT/maven-metadata.xml
(1.0 kB at 3.2 kB/s)
[INFO] Downloading from Nexus: http://repository.apache.org/snapshots/org/apache/sling/org.apache.sling.feature.launcher/0.8.1-SNAPSHOT/org.apache.sling.feature.launcher-0.8.1-20181221.155422-14.pom
[INFO] Downloaded from Nexus: http://repository.apache.org/snapshots/org/apache/sling/org.apache.sling.feature.launcher/0.8.1-SNAPSHOT/org.apache.sling.feature.launcher-0.8.1-20181221.155422-14.pom
(6.5 kB at 22 kB/s)
[INFO] Downloading from central: https://repo.maven.apache.org/maven2/org/slf4j/slf4j-nop/1.7.25/slf4j-nop-1.7.25.pom
[INFO] Downloaded from central: https://repo.maven.apache.org/maven2/org/slf4j/slf4j-nop/1.7.25/slf4j-nop-1.7.25.pom
(786 B at 41 kB/s)
[INFO] Downloading from central: https://repo.maven.apache.org/maven2/org/apache/sling/org.apache.sling.commons.johnzon/1.0.0/org.apache.sling.commons.johnzon-1.0.0.pom
[INFO] Downloaded from central: https://repo.maven.apache.org/maven2/org/apache/sling/org.apache.sling.commons.johnzon/1.0.0/org.apache.sling.commons.johnzon-1.0.0.pom
(3.4 kB at 188 kB/s)
[INFO] Downloading from central: https://repo.maven.apache.org/maven2/org/apache/geronimo/specs/geronimo-json_1.0_spec/1.0-alpha-1/geronimo-json_1.0_spec-1.0-alpha-1.pom
[INFO] Downloaded from central: https://repo.maven.apache.org/maven2/org/apache/geronimo/specs/geronimo-json_1.0_spec/1.0-alpha-1/geronimo-json_1.0_spec-1.0-alpha-1.pom
(4.2 kB at 250 kB/s)
[INFO] Downloading from central: https://repo.maven.apache.org/maven2/org/apache/felix/org.apache.felix.converter/1.0.0/org.apache.felix.converter-1.0.0.pom
[INFO] Downloaded from central: https://repo.maven.apache.org/maven2/org/apache/felix/org.apache.felix.converter/1.0.0/org.apache.felix.converter-1.0.0.pom
(5.3 kB at 52 kB/s)
[INFO] Downloading from central: https://repo.maven.apache.org/maven2/org/osgi/org.osgi.util.function/1.0.0/org.osgi.util.function-1.0.0.pom
[INFO] Downloaded from central: https://repo.maven.apache.org/maven2/org/osgi/org.osgi.util.function/1.0.0/org.osgi.util.function-1.0.0.pom
(1.3 kB at 13 kB/s)
[INFO] Downloading from central: https://repo.maven.apache.org/maven2/org/apache/sling/org.apache.sling.jcr.jcr-wrapper/2.0.0/org.apache.sling.jcr.jcr-wrapper-2.0.0.pom
[INFO] Downloaded from central: https://repo.maven.apache.org/maven2/org/apache/sling/org.apache.sling.jcr.jcr-wrapper/2.0.0/org.apache.sling.jcr.jcr-wrapper-2.0.0.pom
(3.9 kB at 217 kB/s)
[INFO] Downloading from central: https://repo.maven.apache.org/maven2/org/apache/sling/sling/13/sling-13.pom
[INFO] Downloaded from central: https://repo.maven.apache.org/maven2/org/apache/sling/sling/13/sling-13.pom
(37 kB at 1.6 MB/s)
[INFO] Downloading from central: https://repo.maven.apache.org/maven2/org/apache/jackrabbit/jackrabbit-spi-commons/2.17.3/jackrabbit-spi-commons-2.17.3.pom
[INFO] Downloaded from central: https://repo.maven.apache.org/maven2/org/apache/jackrabbit/jackrabbit-spi-commons/2.17.3/jackrabbit-spi-commons-2.17.3.pom
(6.9 kB at 277 kB/s)
[INFO] Downloading from central: https://repo.maven.apache.org/maven2/org/apache/jackrabbit/jackrabbit-parent/2.17.3/jackrabbit-parent-2.17.3.pom
[INFO] Downloaded from central: https://repo.maven.apache.org/maven2/org/apache/jackrabbit/jackrabbit-parent/2.17.3/jackrabbit-parent-2.17.3.pom
(34 kB at 1.3 MB/s)
[INFO] Downloading from central: https://repo.maven.apache.org/maven2/org/apache/jackrabbit/jackrabbit-spi/2.17.3/jackrabbit-spi-2.17.3.pom
[INFO] Downloaded from central: https://repo.maven.apache.org/maven2/org/apache/jackrabbit/jackrabbit-spi/2.17.3/jackrabbit-spi-2.17.3.pom
(3.1 kB at 34 kB/s)
[INFO] Downloading from central: https://repo.maven.apache.org/maven2/org/apache/jackrabbit/jackrabbit-jcr-commons/2.17.3/jackrabbit-jcr-commons-2.17.3.pom
[INFO] Downloaded from central: https://repo.maven.apache.org/maven2/org/apache/jackrabbit/jackrabbit-jcr-commons/2.17.3/jackrabbit-jcr-commons-2.17.3.pom
(3.8 kB at 212 kB/s)
[INFO] Downloading from central: https://repo.maven.apache.org/maven2/org/osgi/osgi.core/6.0.0/osgi.core-6.0.0.jar
[INFO] Downloading from central: https://repo.maven.apache.org/maven2/org/slf4j/slf4j-nop/1.7.25/slf4j-nop-1.7.25.jar
[INFO] Downloading from central: https://repo.maven.apache.org/maven2/org/apache/sling/org.apache.sling.commons.johnzon/1.0.0/org.apache.sling.commons.johnzon-1.0.0.jar
[INFO] Downloading from central: https://repo.maven.apache.org/maven2/org/apache/geronimo/specs/geronimo-json_1.0_spec/1.0-alpha-1/geronimo-json_1.0_spec-1.0-alpha-1.jar
[INFO] Downloading from central: https://repo.maven.apache.org/maven2/org/apache/felix/org.apache.felix.converter/1.0.0/org.apache.felix.converter-1.0.0.jar
[INFO] Downloaded from central: https://repo.maven.apache.org/maven2/org/slf4j/slf4j-nop/1.7.25/slf4j-nop-1.7.25.jar
(4.0 kB at 93 kB/s)
[INFO] Downloading from central: https://repo.maven.apache.org/maven2/org/osgi/org.osgi.util.function/1.0.0/org.osgi.util.function-1.0.0.jar
[INFO] Downloaded from central: https://repo.maven.apache.org/maven2/org/apache/geronimo/specs/geronimo-json_1.0_spec/1.0-alpha-1/geronimo-json_1.0_spec-1.0-alpha-1.jar
(26 kB at 543 kB/s)
[INFO] Downloading from central: https://repo.maven.apache.org/maven2/org/apache/sling/org.apache.sling.jcr.jcr-wrapper/2.0.0/org.apache.sling.jcr.jcr-wrapper-2.0.0.jar
[INFO] Downloaded from central: https://repo.maven.apache.org/maven2/org/apache/felix/org.apache.felix.converter/1.0.0/org.apache.felix.converter-1.0.0.jar
(114 kB at 1.9 MB/s)
[INFO] Downloading from central: https://repo.maven.apache.org/maven2/org/apache/jackrabbit/jackrabbit-spi-commons/2.17.3/jackrabbit-spi-commons-2.17.3.jar
[INFO] Downloaded from central: https://repo.maven.apache.org/maven2/org/osgi/org.osgi.util.function/1.0.0/org.osgi.util.function-1.0.0.jar
(13 kB at 182 kB/s)
[INFO] Downloading from central: https://repo.maven.apache.org/maven2/org/apache/jackrabbit/jackrabbit-jcr-commons/2.17.3/jackrabbit-jcr-commons-2.17.3.jar
[INFO] Downloaded from central: https://repo.maven.apache.org/maven2/org/apache/sling/org.apache.sling.commons.johnzon/1.0.0/org.apache.sling.commons.johnzon-1.0.0.jar
(107 kB at 1.5 MB/s)
[INFO] Downloading from central: https://repo.maven.apache.org/maven2/org/apache/jackrabbit/jackrabbit-spi/2.17.3/jackrabbit-spi-2.17.3.jar
[INFO] Downloaded from central: https://repo.maven.apache.org/maven2/org/apache/sling/org.apache.sling.jcr.jcr-wrapper/2.0.0/org.apache.sling.jcr.jcr-wrapper-2.0.0.jar
(74 kB at 931 kB/s)
[INFO] Downloading from central: https://repo.maven.apache.org/maven2/commons-cli/commons-cli/1.3.1/commons-cli-1.3.1.jar
[INFO] Downloaded from central: https://repo.maven.apache.org/maven2/org/osgi/osgi.core/6.0.0/osgi.core-6.0.0.jar
(475 kB at 5.6 MB/s)
[INFO] Downloaded from central: https://repo.maven.apache.org/maven2/commons-cli/commons-cli/1.3.1/commons-cli-1.3.1.jar
(53 kB at 552 kB/s)
[INFO] Downloaded from central: https://repo.maven.apache.org/maven2/org/apache/jackrabbit/jackrabbit-jcr-commons/2.17.3/jackrabbit-jcr-commons-2.17.3.jar
(403 kB at 3.4 MB/s)
[INFO] Downloaded from central: https://repo.maven.apache.org/maven2/org/apache/jackrabbit/jackrabbit-spi-commons/2.17.3/jackrabbit-spi-commons-2.17.3.jar
(803 kB at 6.3 MB/s)
[INFO] Downloaded from central: https://repo.maven.apache.org/maven2/org/apache/jackrabbit/jackrabbit-spi/2.17.3/jackrabbit-spi-2.17.3.jar
(29 kB at 163 kB/s)
[INFO] Downloading from Nexus: http://repository.apache.org/snapshots/org/apache/jackrabbit/vault/org.apache.jackrabbit.vault/3.2.5-SNAPSHOT/org.apache.jackrabbit.vault-3.2.5-SNAPSHOT.jar
[INFO] Downloading from Nexus: http://repository.apache.org/snapshots/org/apache/sling/org.apache.sling.feature/0.8.1-SNAPSHOT/org.apache.sling.feature-0.8.1-20181220.155655-11.jar
[INFO] Downloading from Nexus: http://repository.apache.org/snapshots/org/apache/sling/org.apache.sling.feature.io/0.8.1-SNAPSHOT/org.apache.sling.feature.io-0.8.1-20181220.160718-13.jar
[INFO] Downloading from Nexus: http://repository.apache.org/snapshots/org/apache/sling/org.apache.sling.feature.launcher/0.8.1-SNAPSHOT/org.apache.sling.feature.launcher-0.8.1-20181221.155422-14.jar
[INFO] Downloaded from Nexus: http://repository.apache.org/snapshots/org/apache/sling/org.apache.sling.feature/0.8.1-SNAPSHOT/org.apache.sling.feature-0.8.1-20181220.155655-11.jar
(114 kB at 215 kB/s)
[INFO] Downloaded from Nexus: http://repository.apache.org/snapshots/org/apache/sling/org.apache.sling.feature.io/0.8.1-SNAPSHOT/org.apache.sling.feature.io-0.8.1-20181220.160718-13.jar
(164 kB at 311 kB/s)
[INFO] Downloaded from Nexus: http://repository.apache.org/snapshots/org/apache/sling/org.apache.sling.feature.launcher/0.8.1-SNAPSHOT/org.apache.sling.feature.launcher-0.8.1-20181221.155422-14.jar
(1.3 MB at 1.9 MB/s)
[WARNING] Attempt to (de-)serialize anonymous class hudson.maven.reporters.MavenArtifactArchiver$2;
see: https://jenkins.io/redirect/serialization-of-anonymous-classes/
[JENKINS] Archiving disabled
[WARNING] Attempt to (de-)serialize anonymous class hudson.maven.reporters.MavenFingerprinter$1;
see: https://jenkins.io/redirect/serialization-of-anonymous-classes/
[JENKINS] Archiving disabled
[INFO] ------------------------------------------------------------------------
[INFO] BUILD FAILURE
[INFO] ------------------------------------------------------------------------
[INFO] Total time: 01:57 min
[INFO] Finished at: 2018-12-21T16:03:33Z
[INFO] ------------------------------------------------------------------------
Waiting for Jenkins to finish collecting data
[ERROR] Failed to execute goal on project org.apache.sling.feature.extension.content: Could
not resolve dependencies for project org.apache.sling:org.apache.sling.feature.extension.content:jar:0.0.1-SNAPSHOT:
Could not find artifact org.apache.jackrabbit.vault:org.apache.jackrabbit.vault:jar:3.2.5-SNAPSHOT
in Nexus (http://repository.apache.org/snapshots) -> [Help 1]
[ERROR] 
[ERROR] To see the full stack trace of the errors, re-run Maven with the -e switch.
[ERROR] Re-run Maven using the -X switch to enable full debug logging.
[ERROR] 
[ERROR] For more information about the errors and possible solutions, please read the following
articles:
[ERROR] [Help 1] http://cwiki.apache.org/confluence/display/MAVEN/DependencyResolutionException
channel stopped
Recording test results
Not sending mail to unregistered user bosschae@adobe.com
Not sending mail to unregistered user suess@adobe.com

Mime
View raw message