sling-commits mailing list archives

Site index · List index
Message view « Date » · « Thread »
Top « Date » · « Thread »
From Apache Jenkins Server <jenk...@builds.apache.org>
Subject Build failed in Jenkins: sling-org-apache-sling-scripting-bundle-tracker-it-1.8 #2
Date Mon, 10 Dec 2018 18:12:37 GMT
See <https://builds.apache.org/job/sling-org-apache-sling-scripting-bundle-tracker-it-1.8/2/display/redirect>

------------------------------------------
[...truncated 9.89 KB...]
[INFO] --- maven-resources-plugin:3.1.0:resources (default-resources) @ org.apache.sling.scripting.examplebundle
---
[INFO] Using 'UTF-8' encoding to copy filtered resources.
[INFO] Copying 24 resources
[INFO] Copying 3 resources
[INFO] Copying 3 resources
[INFO] 
[INFO] --- maven-compiler-plugin:3.7.0:compile (default-compile) @ org.apache.sling.scripting.examplebundle
---
[INFO] Changes detected - recompiling the module!
[INFO] Compiling 1 source file to <https://builds.apache.org/job/sling-org-apache-sling-scripting-bundle-tracker-it-1.8/ws/examples/org-apache-sling-scripting-examplebundle/target/classes>
[INFO] 
[INFO] --- maven-bundle-plugin:3.5.0:manifest (scr-metadata) @ org.apache.sling.scripting.examplebundle
---
[WARNING] Manifest org.apache.sling:org.apache.sling.scripting.examplebundle:bundle:0.0.1-SNAPSHOT
: No translation found for macro: org.apache.sling.scriptingbundle.maven.plugin.Require-Capability
[INFO] 
[INFO] --- animal-sniffer-maven-plugin:1.16:check (default) @ org.apache.sling.scripting.examplebundle
---
[INFO] Checking unresolved references to org.codehaus.mojo.signature:java18:1.0
[INFO] 
[INFO] --- maven-resources-plugin:3.1.0:testResources (default-testResources) @ org.apache.sling.scripting.examplebundle
---
[INFO] Using 'UTF-8' encoding to copy filtered resources.
[INFO] skip non existing resourceDirectory <https://builds.apache.org/job/sling-org-apache-sling-scripting-bundle-tracker-it-1.8/ws/examples/org-apache-sling-scripting-examplebundle/src/test/resources>
[INFO] Copying 3 resources
[INFO] Copying 3 resources
[INFO] 
[INFO] --- maven-compiler-plugin:3.7.0:testCompile (default-testCompile) @ org.apache.sling.scripting.examplebundle
---
[INFO] No sources to compile
[INFO] 
[INFO] --- maven-surefire-plugin:2.20.1:test (default-test) @ org.apache.sling.scripting.examplebundle
---
[JENKINS] Recording test results
[INFO] 
[INFO] --- scriptingbundle-maven-plugin:0.0.1-SNAPSHOT:metadata (default) @ org.apache.sling.scripting.examplebundle
---
[INFO] 
[INFO] --- maven-bundle-plugin:3.5.0:bundle (default-bundle) @ org.apache.sling.scripting.examplebundle
---
[INFO] 
[INFO] >>> maven-source-plugin:3.0.1:jar (attach-sources) > generate-sources @
org.apache.sling.scripting.examplebundle >>>
[INFO] 
[INFO] --- maven-enforcer-plugin:3.0.0-M1:enforce (enforce-maven-version) @ org.apache.sling.scripting.examplebundle
---
[INFO] 
[INFO] --- maven-enforcer-plugin:3.0.0-M1:enforce (enforce-property-values) @ org.apache.sling.scripting.examplebundle
---
[INFO] 
[INFO] --- maven-enforcer-plugin:3.0.0-M1:enforce (enforce-java) @ org.apache.sling.scripting.examplebundle
---
[INFO] 
[INFO] --- maven-enforcer-plugin:3.0.0-M1:enforce (ban-maven-scr-plugin) @ org.apache.sling.scripting.examplebundle
---
[WARNING] Failed to getClass for org.apache.maven.plugins.source.SourceJarMojo
[INFO] 
[INFO] <<< maven-source-plugin:3.0.1:jar (attach-sources) < generate-sources @
org.apache.sling.scripting.examplebundle <<<
[INFO] 
[INFO] --- maven-source-plugin:3.0.1:jar (attach-sources) @ org.apache.sling.scripting.examplebundle
---
[INFO] Building jar: <https://builds.apache.org/job/sling-org-apache-sling-scripting-bundle-tracker-it-1.8/ws/examples/org-apache-sling-scripting-examplebundle/target/org.apache.sling.scripting.examplebundle-0.0.1-SNAPSHOT-sources.jar>
[INFO] 
[INFO] --- maven-site-plugin:3.7.1:attach-descriptor (attach-descriptor) @ org.apache.sling.scripting.examplebundle
---
[INFO] Skipping because packaging 'bundle' is not pom.
[INFO] 
[INFO] --- ianal-maven-plugin:1.0-alpha-1:verify-legal-files (verify-legal-files) @ org.apache.sling.scripting.examplebundle
---
[INFO] Checking legal files in: org.apache.sling.scripting.examplebundle-0.0.1-SNAPSHOT.jar
[INFO] Checking legal files in: org.apache.sling.scripting.examplebundle-0.0.1-SNAPSHOT-sources.jar
[INFO] 
[INFO] --- maven-bundle-plugin:3.5.0:baseline (baseline) @ org.apache.sling.scripting.examplebundle
---
[INFO] artifact org.apache.sling:org.apache.sling.scripting.examplebundle: checking for updates
from Nexus
[INFO] artifact org.apache.sling:org.apache.sling.scripting.examplebundle: checking for updates
from central
[INFO] Unable to find a previous version of the project in the repository
[INFO] Not generating Baseline report as there is no previous version of the library to compare
against
[INFO] 
[INFO] --- apache-rat-plugin:0.12:check (rat-check) @ org.apache.sling.scripting.examplebundle
---
[INFO] Enabled default license matchers.
[INFO] Will parse SCM ignores for exclusions...
[INFO] Finished adding exclusions from SCM ignore files.
[INFO] 61 implicit excludes (use -debug for more details).
[INFO] Exclude: src/main/appended-resources/META-INF/*
[INFO] Exclude: velocity.log
[INFO] Exclude: target/*
[INFO] Exclude: README.md
[INFO] Exclude: maven-eclipse.xml
[INFO] Exclude: .*
[INFO] Exclude: .*/**
[INFO] Exclude: **/*.json
[INFO] Exclude: DEPENDENCIES
[INFO] Exclude: **/*.rej
[INFO] Exclude: hs_err_*.log
[INFO] Exclude: **/repository/index/*/index-details.txt
[INFO] Exclude: bnd.bnd
[INFO] Exclude: **/extends
[INFO] 26 resources included (use -debug for more details)
[INFO] Rat check: Summary over all files. Unapproved: 0, unknown: 0, generated: 0, approved:
26 licenses.
[INFO] 
[INFO] --- maven-install-plugin:2.5.2:install (default-install) @ org.apache.sling.scripting.examplebundle
---
[INFO] Installing <https://builds.apache.org/job/sling-org-apache-sling-scripting-bundle-tracker-it-1.8/ws/examples/org-apache-sling-scripting-examplebundle/target/org.apache.sling.scripting.examplebundle-0.0.1-SNAPSHOT.jar>
to /home/jenkins/jenkins-slave/maven-repositories/0/org/apache/sling/org.apache.sling.scripting.examplebundle/0.0.1-SNAPSHOT/org.apache.sling.scripting.examplebundle-0.0.1-SNAPSHOT.jar
[INFO] Installing <https://builds.apache.org/job/sling-org-apache-sling-scripting-bundle-tracker-it-1.8/ws/examples/org-apache-sling-scripting-examplebundle/pom.xml>
to /home/jenkins/jenkins-slave/maven-repositories/0/org/apache/sling/org.apache.sling.scripting.examplebundle/0.0.1-SNAPSHOT/org.apache.sling.scripting.examplebundle-0.0.1-SNAPSHOT.pom
[INFO] Installing <https://builds.apache.org/job/sling-org-apache-sling-scripting-bundle-tracker-it-1.8/ws/examples/org-apache-sling-scripting-examplebundle/target/org.apache.sling.scripting.examplebundle-0.0.1-SNAPSHOT-sources.jar>
to /home/jenkins/jenkins-slave/maven-repositories/0/org/apache/sling/org.apache.sling.scripting.examplebundle/0.0.1-SNAPSHOT/org.apache.sling.scripting.examplebundle-0.0.1-SNAPSHOT-sources.jar
[INFO] 
[INFO] --- maven-bundle-plugin:3.5.0:install (default-install) @ org.apache.sling.scripting.examplebundle
---
[INFO] Local OBR update disabled (enable with -DobrRepository)
[INFO] 
[INFO] --- maven-deploy-plugin:2.8.2:deploy (default-deploy) @ org.apache.sling.scripting.examplebundle
---
[INFO] Downloading: https://repository.apache.org/content/repositories/snapshots/org/apache/sling/org.apache.sling.scripting.examplebundle/0.0.1-SNAPSHOT/maven-metadata.xml
[INFO] Downloading: https://repository.apache.org/content/repositories/snapshots/org/apache/sling/org.apache.sling.scripting.examplebundle/0.0.1-SNAPSHOT/maven-metadata.xml
[INFO] Uploading: https://repository.apache.org/content/repositories/snapshots/org/apache/sling/org.apache.sling.scripting.examplebundle/0.0.1-SNAPSHOT/org.apache.sling.scripting.examplebundle-0.0.1-20181210.181145-1.jar
[INFO] Uploaded: https://repository.apache.org/content/repositories/snapshots/org/apache/sling/org.apache.sling.scripting.examplebundle/0.0.1-SNAPSHOT/org.apache.sling.scripting.examplebundle-0.0.1-20181210.181145-1.jar
(31 KB at 28.4 KB/sec)
[INFO] Uploading: https://repository.apache.org/content/repositories/snapshots/org/apache/sling/org.apache.sling.scripting.examplebundle/0.0.1-SNAPSHOT/org.apache.sling.scripting.examplebundle-0.0.1-20181210.181145-1.pom
[INFO] Uploaded: https://repository.apache.org/content/repositories/snapshots/org/apache/sling/org.apache.sling.scripting.examplebundle/0.0.1-SNAPSHOT/org.apache.sling.scripting.examplebundle-0.0.1-20181210.181145-1.pom
(5 KB at 5.0 KB/sec)
[INFO] Downloading: https://repository.apache.org/content/repositories/snapshots/org/apache/sling/org.apache.sling.scripting.examplebundle/maven-metadata.xml
[INFO] Downloading: https://repository.apache.org/content/repositories/snapshots/org/apache/sling/org.apache.sling.scripting.examplebundle/maven-metadata.xml
[INFO] Uploading: https://repository.apache.org/content/repositories/snapshots/org/apache/sling/org.apache.sling.scripting.examplebundle/0.0.1-SNAPSHOT/maven-metadata.xml
[INFO] Uploaded: https://repository.apache.org/content/repositories/snapshots/org/apache/sling/org.apache.sling.scripting.examplebundle/0.0.1-SNAPSHOT/maven-metadata.xml
(806 B at 0.8 KB/sec)
[INFO] Uploading: https://repository.apache.org/content/repositories/snapshots/org/apache/sling/org.apache.sling.scripting.examplebundle/0.0.1-SNAPSHOT/maven-metadata.xml
[INFO] Uploaded: https://repository.apache.org/content/repositories/snapshots/org/apache/sling/org.apache.sling.scripting.examplebundle/0.0.1-SNAPSHOT/maven-metadata.xml
(806 B at 0.8 KB/sec)
[INFO] Uploading: https://repository.apache.org/content/repositories/snapshots/org/apache/sling/org.apache.sling.scripting.examplebundle/maven-metadata.xml
[INFO] Uploaded: https://repository.apache.org/content/repositories/snapshots/org/apache/sling/org.apache.sling.scripting.examplebundle/maven-metadata.xml
(316 B at 0.3 KB/sec)
[INFO] Uploading: https://repository.apache.org/content/repositories/snapshots/org/apache/sling/org.apache.sling.scripting.examplebundle/maven-metadata.xml
[INFO] Uploaded: https://repository.apache.org/content/repositories/snapshots/org/apache/sling/org.apache.sling.scripting.examplebundle/maven-metadata.xml
(316 B at 0.3 KB/sec)
[INFO] Uploading: https://repository.apache.org/content/repositories/snapshots/org/apache/sling/org.apache.sling.scripting.examplebundle/0.0.1-SNAPSHOT/org.apache.sling.scripting.examplebundle-0.0.1-20181210.181145-1-sources.jar
[INFO] Uploaded: https://repository.apache.org/content/repositories/snapshots/org/apache/sling/org.apache.sling.scripting.examplebundle/0.0.1-SNAPSHOT/org.apache.sling.scripting.examplebundle-0.0.1-20181210.181145-1-sources.jar
(30 KB at 28.9 KB/sec)
[INFO] Downloading: https://repository.apache.org/content/repositories/snapshots/org/apache/sling/org.apache.sling.scripting.examplebundle/maven-metadata.xml
[INFO] Downloaded: https://repository.apache.org/content/repositories/snapshots/org/apache/sling/org.apache.sling.scripting.examplebundle/maven-metadata.xml
(316 B at 0.5 KB/sec)
[INFO] Uploading: https://repository.apache.org/content/repositories/snapshots/org/apache/sling/org.apache.sling.scripting.examplebundle/0.0.1-SNAPSHOT/maven-metadata.xml
[INFO] Uploaded: https://repository.apache.org/content/repositories/snapshots/org/apache/sling/org.apache.sling.scripting.examplebundle/0.0.1-SNAPSHOT/maven-metadata.xml
(1020 B at 1.1 KB/sec)
[INFO] Uploading: https://repository.apache.org/content/repositories/snapshots/org/apache/sling/org.apache.sling.scripting.examplebundle/0.0.1-SNAPSHOT/maven-metadata.xml
[INFO] Uploaded: https://repository.apache.org/content/repositories/snapshots/org/apache/sling/org.apache.sling.scripting.examplebundle/0.0.1-SNAPSHOT/maven-metadata.xml
(1020 B at 1.1 KB/sec)
[INFO] Uploading: https://repository.apache.org/content/repositories/snapshots/org/apache/sling/org.apache.sling.scripting.examplebundle/maven-metadata.xml
[INFO] Uploaded: https://repository.apache.org/content/repositories/snapshots/org/apache/sling/org.apache.sling.scripting.examplebundle/maven-metadata.xml
(316 B at 0.3 KB/sec)
[INFO] 
[INFO] --- maven-bundle-plugin:3.5.0:deploy (default-deploy) @ org.apache.sling.scripting.examplebundle
---
[INFO] Remote OBR update disabled (enable with -DremoteOBR)
[WARNING] Attempt to (de-)serialize anonymous class hudson.maven.reporters.MavenArtifactArchiver$2;
see: https://jenkins.io/redirect/serialization-of-anonymous-classes/
[JENKINS] Archiving disabled
[WARNING] Attempt to (de-)serialize anonymous class hudson.maven.reporters.MavenFingerprinter$1;
see: https://jenkins.io/redirect/serialization-of-anonymous-classes/
[INFO]                                                                         
[INFO] ------------------------------------------------------------------------
[INFO] Building org.apache.sling.scripting.examplebundle.precompiled 0.0.1-SNAPSHOT
[INFO] ------------------------------------------------------------------------
[INFO] Downloading: http://repository.apache.org/snapshots/org/apache/sling/htl-maven-plugin/1.2.1-1.4.0-SNAPSHOT/maven-metadata.xml
[INFO] Downloaded: http://repository.apache.org/snapshots/org/apache/sling/htl-maven-plugin/1.2.1-1.4.0-SNAPSHOT/maven-metadata.xml
(1 KB at 2.9 KB/sec)
[INFO] Downloading: http://repository.apache.org/snapshots/org/apache/sling/htl-maven-plugin/1.2.1-1.4.0-SNAPSHOT/htl-maven-plugin-1.2.1-1.4.0-20181031.154747-13.pom
[INFO] Downloaded: http://repository.apache.org/snapshots/org/apache/sling/htl-maven-plugin/1.2.1-1.4.0-SNAPSHOT/htl-maven-plugin-1.2.1-1.4.0-20181031.154747-13.pom
(15 KB at 46.8 KB/sec)
[INFO] Downloading: http://repository.apache.org/snapshots/org/apache/sling/htl-maven-plugin/1.2.1-1.4.0-SNAPSHOT/htl-maven-plugin-1.2.1-1.4.0-20181031.154747-13.jar
[INFO] Downloaded: http://repository.apache.org/snapshots/org/apache/sling/htl-maven-plugin/1.2.1-1.4.0-SNAPSHOT/htl-maven-plugin-1.2.1-1.4.0-20181031.154747-13.jar
(30 KB at 80.8 KB/sec)
[INFO] Downloading: http://repository.apache.org/snapshots/org/apache/sling/org.apache.sling.scripting.sightly.runtime/1.0.0-1.4.0-SNAPSHOT/maven-metadata.xml
[INFO] 
[INFO] --- maven-clean-plugin:3.1.0:clean (default-clean) @ org.apache.sling.scripting.examplebundle.precompiled
---
[INFO] 
[INFO] --- maven-enforcer-plugin:3.0.0-M1:enforce (enforce-maven-version) @ org.apache.sling.scripting.examplebundle.precompiled
---
[INFO] 
[INFO] --- maven-enforcer-plugin:3.0.0-M1:enforce (enforce-property-values) @ org.apache.sling.scripting.examplebundle.precompiled
---
[INFO] 
[INFO] --- maven-enforcer-plugin:3.0.0-M1:enforce (enforce-java) @ org.apache.sling.scripting.examplebundle.precompiled
---
[INFO] 
[INFO] --- maven-enforcer-plugin:3.0.0-M1:enforce (ban-maven-scr-plugin) @ org.apache.sling.scripting.examplebundle.precompiled
---
[INFO] 
[INFO] --- htl-maven-plugin:1.2.1-1.4.0-SNAPSHOT:validate (validate-htl-scripts) @ org.apache.sling.scripting.examplebundle.precompiled
---
[INFO] Downloading: http://repository.apache.org/snapshots/org/apache/sling/org.apache.sling.scripting.sightly.compiler/1.1.0-1.4.0-SNAPSHOT/maven-metadata.xml
[INFO] Downloading: http://repository.apache.org/snapshots/org/apache/sling/org.apache.sling.scripting.sightly.compiler/1.1.0-1.4.0-SNAPSHOT/org.apache.sling.scripting.sightly.compiler-1.1.0-1.4.0-SNAPSHOT.pom
[WARNING] The POM for org.apache.sling:org.apache.sling.scripting.sightly.compiler:jar:1.1.0-1.4.0-SNAPSHOT
is missing, no dependency information available
[INFO] Downloading: http://repository.apache.org/snapshots/org/apache/sling/org.apache.sling.scripting.sightly.compiler.java/1.1.0-1.4.0-SNAPSHOT/maven-metadata.xml
[INFO] Downloading: http://repository.apache.org/snapshots/org/apache/sling/org.apache.sling.scripting.sightly.compiler.java/1.1.0-1.4.0-SNAPSHOT/org.apache.sling.scripting.sightly.compiler.java-1.1.0-1.4.0-SNAPSHOT.pom
[WARNING] The POM for org.apache.sling:org.apache.sling.scripting.sightly.compiler.java:jar:1.1.0-1.4.0-SNAPSHOT
is missing, no dependency information available
[INFO] Downloading: https://repo.maven.apache.org/maven2/org/apache/maven/maven-plugin-api/3.3.9/maven-plugin-api-3.3.9.pom
[INFO] Downloaded: https://repo.maven.apache.org/maven2/org/apache/maven/maven-plugin-api/3.3.9/maven-plugin-api-3.3.9.pom
(3 KB at 47.7 KB/sec)
[INFO] Downloading: https://repo.maven.apache.org/maven2/org/apache/maven/maven/3.3.9/maven-3.3.9.pom
[INFO] Downloaded: https://repo.maven.apache.org/maven2/org/apache/maven/maven/3.3.9/maven-3.3.9.pom
(0 B at 0.0 KB/sec)
[INFO] Downloading: https://repo.maven.apache.org/maven2/org/apache/maven/maven-model/3.3.9/maven-model-3.3.9.pom
[INFO] Downloaded: https://repo.maven.apache.org/maven2/org/apache/maven/maven-model/3.3.9/maven-model-3.3.9.pom
(4 KB at 218.8 KB/sec)
[INFO] Downloading: https://repo.maven.apache.org/maven2/org/apache/maven/maven-artifact/3.3.9/maven-artifact-3.3.9.pom
[INFO] Downloaded: https://repo.maven.apache.org/maven2/org/apache/maven/maven-artifact/3.3.9/maven-artifact-3.3.9.pom
(3 KB at 130.2 KB/sec)
[INFO] Downloading: https://repo.maven.apache.org/maven2/org/eclipse/sisu/org.eclipse.sisu.plexus/0.3.2/org.eclipse.sisu.plexus-0.3.2.pom
[INFO] Downloaded: https://repo.maven.apache.org/maven2/org/eclipse/sisu/org.eclipse.sisu.plexus/0.3.2/org.eclipse.sisu.plexus-0.3.2.pom
(5 KB at 169.7 KB/sec)
[INFO] Downloading: https://repo.maven.apache.org/maven2/org/eclipse/sisu/sisu-plexus/0.3.2/sisu-plexus-0.3.2.pom
[INFO] Downloaded: https://repo.maven.apache.org/maven2/org/eclipse/sisu/sisu-plexus/0.3.2/sisu-plexus-0.3.2.pom
(14 KB at 705.5 KB/sec)
[INFO] Downloading: https://repo.maven.apache.org/maven2/org/eclipse/sisu/org.eclipse.sisu.inject/0.3.2/org.eclipse.sisu.inject-0.3.2.pom
[INFO] Downloaded: https://repo.maven.apache.org/maven2/org/eclipse/sisu/org.eclipse.sisu.inject/0.3.2/org.eclipse.sisu.inject-0.3.2.pom
(3 KB at 170.9 KB/sec)
[INFO] Downloading: https://repo.maven.apache.org/maven2/org/eclipse/sisu/sisu-inject/0.3.2/sisu-inject-0.3.2.pom
[INFO] Downloaded: https://repo.maven.apache.org/maven2/org/eclipse/sisu/sisu-inject/0.3.2/sisu-inject-0.3.2.pom
(15 KB at 879.3 KB/sec)
[INFO] Downloading: https://repo.maven.apache.org/maven2/org/apache/maven/maven-core/3.3.9/maven-core-3.3.9.pom
[INFO] Downloaded: https://repo.maven.apache.org/maven2/org/apache/maven/maven-core/3.3.9/maven-core-3.3.9.pom
(9 KB at 404.8 KB/sec)
[INFO] Downloading: https://repo.maven.apache.org/maven2/org/apache/maven/maven-settings/3.3.9/maven-settings-3.3.9.pom
[INFO] Downloaded: https://repo.maven.apache.org/maven2/org/apache/maven/maven-settings/3.3.9/maven-settings-3.3.9.pom
(2 KB at 111.9 KB/sec)
[INFO] Downloading: https://repo.maven.apache.org/maven2/org/apache/maven/maven-settings-builder/3.3.9/maven-settings-builder-3.3.9.pom
[INFO] Downloaded: https://repo.maven.apache.org/maven2/org/apache/maven/maven-settings-builder/3.3.9/maven-settings-builder-3.3.9.pom
(3 KB at 134.6 KB/sec)
[INFO] Downloading: https://repo.maven.apache.org/maven2/org/apache/maven/maven-builder-support/3.3.9/maven-builder-support-3.3.9.pom
[INFO] Downloaded: https://repo.maven.apache.org/maven2/org/apache/maven/maven-builder-support/3.3.9/maven-builder-support-3.3.9.pom
(2 KB at 100.8 KB/sec)
[INFO] Downloading: https://repo.maven.apache.org/maven2/org/apache/maven/maven-repository-metadata/3.3.9/maven-repository-metadata-3.3.9.pom
[INFO] Downloaded: https://repo.maven.apache.org/maven2/org/apache/maven/maven-repository-metadata/3.3.9/maven-repository-metadata-3.3.9.pom
(2 KB at 115.4 KB/sec)
[INFO] Downloading: https://repo.maven.apache.org/maven2/org/apache/maven/maven-model-builder/3.3.9/maven-model-builder-3.3.9.pom
[INFO] Downloaded: https://repo.maven.apache.org/maven2/org/apache/maven/maven-model-builder/3.3.9/maven-model-builder-3.3.9.pom
(4 KB at 191.7 KB/sec)
[INFO] Downloading: https://repo.maven.apache.org/maven2/org/apache/maven/maven-aether-provider/3.3.9/maven-aether-provider-3.3.9.pom
[INFO] Downloaded: https://repo.maven.apache.org/maven2/org/apache/maven/maven-aether-provider/3.3.9/maven-aether-provider-3.3.9.pom
(4 KB at 246.0 KB/sec)
[INFO] Downloading: http://repository.apache.org/snapshots/org/apache/sling/org.apache.sling.scripting.sightly.compiler/1.1.0-1.4.0-SNAPSHOT/org.apache.sling.scripting.sightly.compiler-1.1.0-1.4.0-SNAPSHOT.jar
[INFO] Downloading: http://repository.apache.org/snapshots/org/apache/sling/org.apache.sling.scripting.sightly.compiler.java/1.1.0-1.4.0-SNAPSHOT/org.apache.sling.scripting.sightly.compiler.java-1.1.0-1.4.0-SNAPSHOT.jar
[INFO] Downloading: https://repo.maven.apache.org/maven2/org/apache/maven/maven-plugin-api/3.3.9/maven-plugin-api-3.3.9.jar
[INFO] Downloading: https://repo.maven.apache.org/maven2/org/apache/maven/maven-model/3.3.9/maven-model-3.3.9.jar
[INFO] Downloading: https://repo.maven.apache.org/maven2/org/eclipse/sisu/org.eclipse.sisu.plexus/0.3.2/org.eclipse.sisu.plexus-0.3.2.jar
[INFO] Downloading: https://repo.maven.apache.org/maven2/org/eclipse/sisu/org.eclipse.sisu.inject/0.3.2/org.eclipse.sisu.inject-0.3.2.jar
[INFO] Downloading: https://repo.maven.apache.org/maven2/org/apache/maven/maven-artifact/3.3.9/maven-artifact-3.3.9.jar
[INFO] Downloaded: https://repo.maven.apache.org/maven2/org/apache/maven/maven-plugin-api/3.3.9/maven-plugin-api-3.3.9.jar
(47 KB at 1854.4 KB/sec)
[INFO] Downloading: https://repo.maven.apache.org/maven2/org/apache/maven/maven-core/3.3.9/maven-core-3.3.9.jar
[INFO] Downloaded: https://repo.maven.apache.org/maven2/org/apache/maven/maven-artifact/3.3.9/maven-artifact-3.3.9.jar
(54 KB at 1413.9 KB/sec)
[INFO] Downloading: https://repo.maven.apache.org/maven2/org/apache/maven/maven-settings/3.3.9/maven-settings-3.3.9.jar
[INFO] Downloaded: https://repo.maven.apache.org/maven2/org/apache/maven/maven-model/3.3.9/maven-model-3.3.9.jar
(161 KB at 3481.2 KB/sec)
[INFO] Downloading: https://repo.maven.apache.org/maven2/org/apache/maven/maven-settings-builder/3.3.9/maven-settings-builder-3.3.9.jar
[INFO] Downloaded: https://repo.maven.apache.org/maven2/org/eclipse/sisu/org.eclipse.sisu.plexus/0.3.2/org.eclipse.sisu.plexus-0.3.2.jar
(201 KB at 3785.0 KB/sec)
[INFO] Downloading: https://repo.maven.apache.org/maven2/org/apache/maven/maven-builder-support/3.3.9/maven-builder-support-3.3.9.jar
[INFO] Downloaded: https://repo.maven.apache.org/maven2/org/apache/maven/maven-settings/3.3.9/maven-settings-3.3.9.jar
(44 KB at 746.3 KB/sec)
[INFO] Downloading: https://repo.maven.apache.org/maven2/org/apache/maven/maven-repository-metadata/3.3.9/maven-repository-metadata-3.3.9.jar
[INFO] Downloaded: https://repo.maven.apache.org/maven2/org/apache/maven/maven-settings-builder/3.3.9/maven-settings-builder-3.3.9.jar
(43 KB at 666.9 KB/sec)
[INFO] Downloading: https://repo.maven.apache.org/maven2/org/apache/maven/maven-model-builder/3.3.9/maven-model-builder-3.3.9.jar
[INFO] Downloaded: https://repo.maven.apache.org/maven2/org/apache/maven/maven-builder-support/3.3.9/maven-builder-support-3.3.9.jar
(15 KB at 216.8 KB/sec)
[INFO] Downloading: https://repo.maven.apache.org/maven2/org/apache/maven/maven-aether-provider/3.3.9/maven-aether-provider-3.3.9.jar
[INFO] Downloaded: https://repo.maven.apache.org/maven2/org/eclipse/sisu/org.eclipse.sisu.inject/0.3.2/org.eclipse.sisu.inject-0.3.2.jar
(369 KB at 5194.2 KB/sec)
[INFO] Downloaded: https://repo.maven.apache.org/maven2/org/apache/maven/maven-repository-metadata/3.3.9/maven-repository-metadata-3.3.9.jar
(27 KB at 355.3 KB/sec)
[INFO] Downloaded: https://repo.maven.apache.org/maven2/org/apache/maven/maven-core/3.3.9/maven-core-3.3.9.jar
(623 KB at 7328.9 KB/sec)
[INFO] Downloaded: https://repo.maven.apache.org/maven2/org/apache/maven/maven-aether-provider/3.3.9/maven-aether-provider-3.3.9.jar
(66 KB at 750.5 KB/sec)
[INFO] Downloaded: https://repo.maven.apache.org/maven2/org/apache/maven/maven-model-builder/3.3.9/maven-model-builder-3.3.9.jar
(173 KB at 1942.3 KB/sec)
[WARNING] Failed to getClass for org.apache.sling.maven.htl.ValidateMojo
[JENKINS] Archiving disabled
[JENKINS] Archiving disabled
[JENKINS] Archiving disabled
[JENKINS] Archiving disabled
[JENKINS] Archiving disabled
[JENKINS] Archiving disabled
[JENKINS] Archiving disabled
[JENKINS] Archiving disabled
[JENKINS] Archiving disabled
[INFO] ------------------------------------------------------------------------
[INFO] Reactor Summary:
[INFO] 
[INFO] org.apache.sling.scripting.examplebundle ........... SUCCESS [ 39.857 s]
[INFO] org.apache.sling.scripting.examplebundle.precompiled FAILURE [  6.074 s]
[INFO] org.apache.sling.scripting.examplebundle.classic ... SKIPPED
[INFO] org.apache.sling.scripting.examplebundle.hi ........ SKIPPED
[INFO] org.apache.sling.scripting.examplebundle.ohhi ...... SKIPPED
[INFO] Apache Sling Scripting HTL Engine .................. SKIPPED
[INFO] org.apache.sling.scripting.bundle.tracker.it ....... SKIPPED
[INFO] org.apache.sling.scripting.bundle.tracker.it.reactor SKIPPED
[INFO] ------------------------------------------------------------------------
[INFO] BUILD FAILURE
[INFO] ------------------------------------------------------------------------
[INFO] Total time: 01:01 min
[INFO] Finished at: 2018-12-10T18:12:15+00:00
[INFO] Final Memory: 85M/3925M
[INFO] ------------------------------------------------------------------------
[ERROR] Failed to execute goal org.apache.sling:htl-maven-plugin:1.2.1-1.4.0-SNAPSHOT:validate
(validate-htl-scripts) on project org.apache.sling.scripting.examplebundle.precompiled: Execution
validate-htl-scripts of goal org.apache.sling:htl-maven-plugin:1.2.1-1.4.0-SNAPSHOT:validate
failed: Plugin org.apache.sling:htl-maven-plugin:1.2.1-1.4.0-SNAPSHOT or one of its dependencies
could not be resolved: The following artifacts could not be resolved: org.apache.sling:org.apache.sling.scripting.sightly.compiler:jar:1.1.0-1.4.0-SNAPSHOT,
org.apache.sling:org.apache.sling.scripting.sightly.compiler.java:jar:1.1.0-1.4.0-SNAPSHOT:
Could not find artifact org.apache.sling:org.apache.sling.scripting.sightly.compiler:jar:1.1.0-1.4.0-SNAPSHOT
in Nexus (http://repository.apache.org/snapshots) -> [Help 1]
[ERROR] 
[ERROR] To see the full stack trace of the errors, re-run Maven with the -e switch.
[ERROR] Re-run Maven using the -X switch to enable full debug logging.
[ERROR] 
[ERROR] For more information about the errors and possible solutions, please read the following
articles:
[ERROR] [Help 1] http://cwiki.apache.org/confluence/display/MAVEN/PluginResolutionException
[ERROR] 
[ERROR] After correcting the problems, you can resume the build with the command
[ERROR]   mvn <goals> -rf :org.apache.sling.scripting.examplebundle.precompiled
channel stopped
Recording test results

Mime
View raw message