sling-commits mailing list archives

Site index · List index
Message view « Date » · « Thread »
Top « Date » · « Thread »
From Apache Jenkins Server <jenk...@builds.apache.org>
Subject Build failed in Jenkins: sling-org-apache-sling-dynamic-include-1.8 #74
Date Sat, 01 Dec 2018 04:48:59 GMT
See <https://builds.apache.org/job/sling-org-apache-sling-dynamic-include-1.8/74/display/redirect>

------------------------------------------
Started by timer
[EnvInject] - Loading node environment variables.
Building remotely on H40 (ubuntu xenial) in workspace <https://builds.apache.org/job/sling-org-apache-sling-dynamic-include-1.8/ws/>
[WS-CLEANUP] Deleting project workspace...
Cloning the remote Git repository
Cloning repository https://github.com/apache/sling-org-apache-sling-dynamic-include.git
 > git init <https://builds.apache.org/job/sling-org-apache-sling-dynamic-include-1.8/ws/>
# timeout=10
Fetching upstream changes from https://github.com/apache/sling-org-apache-sling-dynamic-include.git
 > git --version # timeout=10
 > git fetch --tags --progress https://github.com/apache/sling-org-apache-sling-dynamic-include.git
+refs/heads/*:refs/remotes/origin/*
 > git config remote.origin.url https://github.com/apache/sling-org-apache-sling-dynamic-include.git
# timeout=10
 > git config --add remote.origin.fetch +refs/heads/*:refs/remotes/origin/* # timeout=10
 > git config remote.origin.url https://github.com/apache/sling-org-apache-sling-dynamic-include.git
# timeout=10
Fetching upstream changes from https://github.com/apache/sling-org-apache-sling-dynamic-include.git
 > git fetch --tags --progress https://github.com/apache/sling-org-apache-sling-dynamic-include.git
+refs/heads/*:refs/remotes/origin/*
 > git rev-parse origin/master^{commit} # timeout=10
Checking out Revision 1e194d85fc086fa20e5f12aa856e91e0d6236781 (origin/master)
 > git config core.sparsecheckout # timeout=10
 > git checkout -f 1e194d85fc086fa20e5f12aa856e91e0d6236781
Commit message: "SLING-7694 - Adding support for optionally including the suffix in dynamic
includes"
 > git rev-list --no-walk 1e194d85fc086fa20e5f12aa856e91e0d6236781 # timeout=10
Parsing POMs
Established TCP socket on 32838
maven33-agent.jar already up to date
maven33-interceptor.jar already up to date
maven3-interceptor-commons.jar already up to date
[sling-org-apache-sling-dynamic-include-1.8] $ /home/jenkins/tools/java/latest1.8/bin/java
-Xmx4g -Xms4g -cp /home/jenkins/jenkins-slave/maven33-agent.jar:/home/jenkins/tools/maven/apache-maven-3.3.9/boot/plexus-classworlds-2.5.2.jar:/home/jenkins/tools/maven/apache-maven-3.3.9/conf/logging
jenkins.maven3.agent.Maven33Main /home/jenkins/tools/maven/apache-maven-3.3.9 /home/jenkins/jenkins-slave/slave.jar
/home/jenkins/jenkins-slave/maven33-interceptor.jar /home/jenkins/jenkins-slave/maven3-interceptor-commons.jar
32838
<===[JENKINS REMOTING CAPACITY]===>   channel started
Executing Maven:  -B -f <https://builds.apache.org/job/sling-org-apache-sling-dynamic-include-1.8/ws/pom.xml>
-Dmaven.repo.local=/home/jenkins/jenkins-slave/maven-repositories/0 -U clean deploy
[INFO] Scanning for projects...
[INFO]                                                                         
[INFO] ------------------------------------------------------------------------
[INFO] Building Apache Sling Dynamic Include 3.1.3-SNAPSHOT
[INFO] ------------------------------------------------------------------------
[INFO] Downloading: https://repo.maven.apache.org/maven2/org/apache/sling/org.apache.sling.api/2.2.0/org.apache.sling.api-2.2.0.pom
[INFO] Downloaded: https://repo.maven.apache.org/maven2/org/apache/sling/org.apache.sling.api/2.2.0/org.apache.sling.api-2.2.0.pom
(6 KB at 15.1 KB/sec)
[INFO] Downloading: https://repo.maven.apache.org/maven2/org/slf4j/slf4j-api/1.7.0/slf4j-api-1.7.0.pom
[INFO] Downloaded: https://repo.maven.apache.org/maven2/org/slf4j/slf4j-api/1.7.0/slf4j-api-1.7.0.pom
(3 KB at 131.3 KB/sec)
[INFO] Downloading: https://repo.maven.apache.org/maven2/org/slf4j/slf4j-parent/1.7.0/slf4j-parent-1.7.0.pom
[INFO] Downloaded: https://repo.maven.apache.org/maven2/org/slf4j/slf4j-parent/1.7.0/slf4j-parent-1.7.0.pom
(13 KB at 607.2 KB/sec)
[INFO] Downloading: https://repo.maven.apache.org/maven2/org/apache/sling/org.apache.sling.api/2.2.0/org.apache.sling.api-2.2.0.jar
[INFO] Downloading: https://repo.maven.apache.org/maven2/org/slf4j/slf4j-api/1.7.0/slf4j-api-1.7.0.jar
[INFO] Downloaded: https://repo.maven.apache.org/maven2/org/slf4j/slf4j-api/1.7.0/slf4j-api-1.7.0.jar
(26 KB at 749.0 KB/sec)
[INFO] Downloaded: https://repo.maven.apache.org/maven2/org/apache/sling/org.apache.sling.api/2.2.0/org.apache.sling.api-2.2.0.jar
(66 KB at 1088.4 KB/sec)
[INFO] 
[INFO] --- maven-clean-plugin:2.5:clean (default-clean) @ org.apache.sling.dynamic-include
---
[INFO] 
[INFO] --- maven-enforcer-plugin:1.3.1:enforce (enforce-java) @ org.apache.sling.dynamic-include
---
[INFO] 
[INFO] --- maven-antrun-plugin:1.8:run (set-bundle-required-execution-environment) @ org.apache.sling.dynamic-include
---
[INFO] Executing tasks

main:
[INFO] Executed tasks
[INFO] 
[INFO] --- maven-remote-resources-plugin:1.5:process (default) @ org.apache.sling.dynamic-include
---
[INFO] 
[INFO] --- maven-resources-plugin:2.7:resources (default-resources) @ org.apache.sling.dynamic-include
---
[INFO] Using 'UTF-8' encoding to copy filtered resources.
[INFO] Copying 1 resource
[INFO] Copying 3 resources
[INFO] 
[INFO] --- maven-antrun-plugin:1.8:run (check-memory-task) @ org.apache.sling.dynamic-include
---
[INFO] Executing tasks

main:
     [echo] **************** WARNING (SLING-443/SLING-1782) ******************************
     [echo] On most platforms, you'll get OutOfMemoryErrors when building unless you set
     [echo] on 32bit platforms: MAVEN_OPTS="-Xmx256M -XX:MaxPermSize=256M", see SLING-443
     [echo] on 64bit platforms: MAVEN_OPTS="-Xmx512M -XX:MaxPermSize=512M", see SLING-1782
     [echo] ******************************************************************************
[INFO] Executed tasks
[INFO] 
[INFO] --- maven-compiler-plugin:3.2:compile (default-compile) @ org.apache.sling.dynamic-include
---
[INFO] Changes detected - recompiling the module!
[INFO] Compiling 18 source files to <https://builds.apache.org/job/sling-org-apache-sling-dynamic-include-1.8/ws/target/classes>
[INFO] 
[INFO] --- maven-scr-plugin:1.21.0:scr (generate-scr-scrdescriptor) @ org.apache.sling.dynamic-include
---
[INFO] Generating 1 MetaType Descriptors in <https://builds.apache.org/job/sling-org-apache-sling-dynamic-include-1.8/ws/target/classes/OSGI-INF/metatype/org.apache.sling.dynamicinclude.Configuration.xml>
[INFO] Generating 1 MetaType Descriptors in <https://builds.apache.org/job/sling-org-apache-sling-dynamic-include-1.8/ws/target/classes/OSGI-INF/metatype/org.apache.sling.dynamicinclude.SyntheticResourceFilter.xml>
[INFO] Writing 1 Service Component Descriptors to <https://builds.apache.org/job/sling-org-apache-sling-dynamic-include-1.8/ws/target/classes/OSGI-INF/org.apache.sling.dynamicinclude.Configuration.xml>
[INFO] Writing 1 Service Component Descriptors to <https://builds.apache.org/job/sling-org-apache-sling-dynamic-include-1.8/ws/target/classes/OSGI-INF/org.apache.sling.dynamicinclude.CacheControlFilter.xml>
[INFO] Writing 1 Service Component Descriptors to <https://builds.apache.org/job/sling-org-apache-sling-dynamic-include-1.8/ws/target/classes/OSGI-INF/org.apache.sling.dynamicinclude.IncludeTagFilter.xml>
[INFO] Writing 1 Service Component Descriptors to <https://builds.apache.org/job/sling-org-apache-sling-dynamic-include-1.8/ws/target/classes/OSGI-INF/org.apache.sling.dynamicinclude.ConfigurationWhiteboard.xml>
[INFO] Writing 1 Service Component Descriptors to <https://builds.apache.org/job/sling-org-apache-sling-dynamic-include-1.8/ws/target/classes/OSGI-INF/org.apache.sling.dynamicinclude.generator.types.JsiGenerator.xml>
[INFO] Writing 1 Service Component Descriptors to <https://builds.apache.org/job/sling-org-apache-sling-dynamic-include-1.8/ws/target/classes/OSGI-INF/org.apache.sling.dynamicinclude.generator.types.SsiGenerator.xml>
[INFO] Writing 1 Service Component Descriptors to <https://builds.apache.org/job/sling-org-apache-sling-dynamic-include-1.8/ws/target/classes/OSGI-INF/org.apache.sling.dynamicinclude.generator.types.EsiGenerator.xml>
[INFO] Writing 1 Service Component Descriptors to <https://builds.apache.org/job/sling-org-apache-sling-dynamic-include-1.8/ws/target/classes/OSGI-INF/org.apache.sling.dynamicinclude.generator.IncludeGeneratorWhiteboard.xml>
[INFO] Writing 1 Service Component Descriptors to <https://builds.apache.org/job/sling-org-apache-sling-dynamic-include-1.8/ws/target/classes/OSGI-INF/org.apache.sling.dynamicinclude.SyntheticResourceFilter.xml>
[INFO] 
[INFO] --- maven-resources-plugin:2.7:testResources (default-testResources) @ org.apache.sling.dynamic-include
---
[INFO] Using 'UTF-8' encoding to copy filtered resources.
[INFO] skip non existing resourceDirectory <https://builds.apache.org/job/sling-org-apache-sling-dynamic-include-1.8/ws/src/test/resources>
[INFO] Copying 3 resources
[INFO] 
[INFO] --- maven-compiler-plugin:3.2:testCompile (default-testCompile) @ org.apache.sling.dynamic-include
---
[INFO] Changes detected - recompiling the module!
[INFO] Compiling 5 source files to <https://builds.apache.org/job/sling-org-apache-sling-dynamic-include-1.8/ws/target/test-classes>
[INFO] 
[INFO] --- maven-surefire-plugin:2.18.1:test (default-test) @ org.apache.sling.dynamic-include
---
[INFO] Surefire report directory: <https://builds.apache.org/job/sling-org-apache-sling-dynamic-include-1.8/ws/target/surefire-reports>

-------------------------------------------------------
 T E S T S
-------------------------------------------------------
Running org.apache.sling.dynamicinclude.ConfigurationWhiteboardTest
SLF4J: Failed to load class "org.slf4j.impl.StaticLoggerBinder".
SLF4J: Defaulting to no-operation (NOP) logger implementation
SLF4J: See http://www.slf4j.org/codes.html#StaticLoggerBinder for further details.
Tests run: 5, Failures: 0, Errors: 0, Skipped: 0, Time elapsed: 0.679 sec - in org.apache.sling.dynamicinclude.ConfigurationWhiteboardTest
Running org.apache.sling.dynamicinclude.impl.UrlBuilderTest
Tests run: 9, Failures: 0, Errors: 0, Skipped: 0, Time elapsed: 0.103 sec - in org.apache.sling.dynamicinclude.impl.UrlBuilderTest
Running org.apache.sling.dynamicinclude.pathmatcher.PrefixPathMatcherTest
Tests run: 2, Failures: 0, Errors: 0, Skipped: 0, Time elapsed: 0 sec - in org.apache.sling.dynamicinclude.pathmatcher.PrefixPathMatcherTest
Running org.apache.sling.dynamicinclude.pathmatcher.RegexPathMatcherTest
Tests run: 2, Failures: 0, Errors: 0, Skipped: 0, Time elapsed: 0 sec - in org.apache.sling.dynamicinclude.pathmatcher.RegexPathMatcherTest
Running org.apache.sling.dynamicinclude.ConfigurationTest
Tests run: 3, Failures: 0, Errors: 0, Skipped: 0, Time elapsed: 0 sec - in org.apache.sling.dynamicinclude.ConfigurationTest

Results :

Tests run: 21, Failures: 0, Errors: 0, Skipped: 0

[JENKINS] Recording test results
[WARNING] Attempt to (de-)serialize anonymous class hudson.maven.reporters.SurefireArchiver$2;
see: https://jenkins.io/redirect/serialization-of-anonymous-classes/
[INFO] 
[INFO] --- animal-sniffer-maven-plugin:1.14:check (default) @ org.apache.sling.dynamic-include
---
[INFO] Checking unresolved references to org.codehaus.mojo.signature:java16:1.0
[INFO] 
[INFO] --- maven-bundle-plugin:3.0.1:bundle (default-bundle) @ org.apache.sling.dynamic-include
---
[INFO] 
[INFO] >>> maven-source-plugin:2.4:jar (attach-sources) > generate-sources @ org.apache.sling.dynamic-include
>>>
[INFO] 
[INFO] --- maven-enforcer-plugin:1.3.1:enforce (enforce-java) @ org.apache.sling.dynamic-include
---
[INFO] 
[INFO] --- maven-antrun-plugin:1.8:run (set-bundle-required-execution-environment) @ org.apache.sling.dynamic-include
---
[INFO] Executing tasks

main:
[INFO] Executed tasks
[WARNING] Failed to getClass for org.apache.maven.plugin.source.SourceJarMojo
[INFO] 
[INFO] <<< maven-source-plugin:2.4:jar (attach-sources) < generate-sources @ org.apache.sling.dynamic-include
<<<
[INFO] 
[INFO] --- maven-source-plugin:2.4:jar (attach-sources) @ org.apache.sling.dynamic-include
---
[INFO] Building jar: <https://builds.apache.org/job/sling-org-apache-sling-dynamic-include-1.8/ws/target/org.apache.sling.dynamic-include-3.1.3-SNAPSHOT-sources.jar>
[INFO] 
[INFO] --- maven-site-plugin:3.4:attach-descriptor (attach-descriptor) @ org.apache.sling.dynamic-include
---
[INFO] 
[INFO] --- ianal-maven-plugin:1.0-alpha-1:verify-legal-files (default) @ org.apache.sling.dynamic-include
---
[INFO] Checking legal files in: org.apache.sling.dynamic-include-3.1.3-SNAPSHOT.jar
[INFO] Checking legal files in: org.apache.sling.dynamic-include-3.1.3-SNAPSHOT-sources.jar
[INFO] 
[INFO] --- apache-rat-plugin:0.11:check (default) @ org.apache.sling.dynamic-include ---
[INFO] 51 implicit excludes (use -debug for more details).
[INFO] Exclude: src/main/appended-resources/META-INF/*
[INFO] Exclude: velocity.log
[INFO] Exclude: target/*
[INFO] Exclude: README.md
[INFO] Exclude: maven-eclipse.xml
[INFO] Exclude: .*
[INFO] Exclude: .*/**
[INFO] Exclude: **/*.json
[INFO] Exclude: DEPENDENCIES
[INFO] Exclude: **/*.rej
[INFO] Exclude: hs_err_*.log
[INFO] 30 resources included (use -debug for more details)
[INFO] Rat check: Summary of files. Unapproved: 0 unknown: 0 generated: 0 approved: 28 licence.
[INFO] 
[INFO] --- maven-bundle-plugin:3.0.1:baseline (baseline) @ org.apache.sling.dynamic-include
---
[INFO] artifact org.apache.sling:org.apache.sling.dynamic-include: checking for updates from
Nexus
[INFO] artifact org.apache.sling:org.apache.sling.dynamic-include: checking for updates from
central
[INFO] Downloading: https://repo.maven.apache.org/maven2/org/apache/sling/org.apache.sling.dynamic-include/3.1.2/org.apache.sling.dynamic-include-3.1.2.jar
[INFO] Downloaded: https://repo.maven.apache.org/maven2/org/apache/sling/org.apache.sling.dynamic-include/3.1.2/org.apache.sling.dynamic-include-3.1.2.jar
(41 KB at 229.0 KB/sec)
[INFO] Baseline Report - Generated by Apache Felix Maven Bundle Plugin on 2018-12-01T04:48Z
based on Bnd - see http://www.aqute.biz/Bnd/Bnd
[INFO] Comparing bundle org.apache.sling.dynamic-include version 3.1.3-SNAPSHOT to version
3.1.2
[INFO] 
[INFO]   PACKAGE_NAME                                       DELTA      CUR_VER    BASE_VER
  REC_VER    WARNINGS  
[INFO] = ================================================== ========== ========== ==========
========== ==========
[INFO] * org.apache.sling.dynamicinclude                    minor      4.1.0      4.1.0  
   4.2.0      Version increase required
[INFO]      < class org.apache.sling.dynamicinclude.Configuration
[INFO]          + method isAppendSuffix()
[INFO]              + return boolean
[INFO] -----------------------------------------------------------------------------------------------------------
[INFO]   org.apache.sling.dynamicinclude.generator          unchanged  3.0.0      3.0.0  
   3.0.0      -         
[INFO] -----------------------------------------------------------------------------------------------------------
[INFO]   org.apache.sling.dynamicinclude.generator.types    unchanged  3.0.0      3.0.0  
   3.0.0      -         
[INFO] -----------------------------------------------------------------------------------------------------------
[INFO]   org.apache.sling.dynamicinclude.pathmatcher        unchanged  3.0.0      3.0.0  
   3.0.0      -         
[INFO] -----------------------------------------------------------------------------------------------------------
[ERROR] org.apache.sling.dynamicinclude: Version increase required; detected 4.1.0, suggested
4.2.0
[INFO] Baseline analysis complete, 1 error(s), 0 warning(s)
[WARNING] Attempt to (de-)serialize anonymous class hudson.maven.reporters.MavenArtifactArchiver$2;
see: https://jenkins.io/redirect/serialization-of-anonymous-classes/
[JENKINS] Archiving disabled
[WARNING] Attempt to (de-)serialize anonymous class hudson.maven.reporters.MavenFingerprinter$1;
see: https://jenkins.io/redirect/serialization-of-anonymous-classes/
[JENKINS] Archiving disabled
[INFO] ------------------------------------------------------------------------
[INFO] BUILD FAILURE
[INFO] ------------------------------------------------------------------------
[INFO] Total time: 01:30 min
[INFO] Finished at: 2018-12-01T04:48:57+00:00
[INFO] Final Memory: 66M/3925M
[INFO] ------------------------------------------------------------------------
Waiting for Jenkins to finish collecting data
[ERROR] Failed to execute goal org.apache.felix:maven-bundle-plugin:3.0.1:baseline (baseline)
on project org.apache.sling.dynamic-include: Baseline failed, see generated report -> [Help
1]
[ERROR] 
[ERROR] To see the full stack trace of the errors, re-run Maven with the -e switch.
[ERROR] Re-run Maven using the -X switch to enable full debug logging.
[ERROR] 
[ERROR] For more information about the errors and possible solutions, please read the following
articles:
[ERROR] [Help 1] http://cwiki.apache.org/confluence/display/MAVEN/MojoFailureException
channel stopped
Recording test results

Mime
View raw message