sling-commits mailing list archives

Site index · List index
Message view « Date » · « Thread »
Top « Date » · « Thread »
From Apache Jenkins Server <jenk...@builds.apache.org>
Subject Build failed in Jenkins: sling-org-apache-sling-scripting-bundle-tracker-it-1.8 #3
Date Mon, 10 Dec 2018 18:19:53 GMT
See <https://builds.apache.org/job/sling-org-apache-sling-scripting-bundle-tracker-it-1.8/3/display/redirect?page=changes>

Changes:

[cotescu] releng: corrected dependencies

------------------------------------------
[...truncated 90.75 KB...]
[INFO] Uploaded: https://repository.apache.org/content/repositories/snapshots/org/apache/sling/org.apache.sling.scripting.examplebundle.hi/maven-metadata.xml
(319 B at 0.3 KB/sec)
[INFO] Uploading: https://repository.apache.org/content/repositories/snapshots/org/apache/sling/org.apache.sling.scripting.examplebundle.hi/maven-metadata.xml
[INFO] Uploaded: https://repository.apache.org/content/repositories/snapshots/org/apache/sling/org.apache.sling.scripting.examplebundle.hi/maven-metadata.xml
(319 B at 0.3 KB/sec)
[INFO] 
[INFO] --- maven-bundle-plugin:3.5.0:deploy (default-deploy) @ org.apache.sling.scripting.examplebundle.hi
---
[INFO] Remote OBR update disabled (enable with -DremoteOBR)
[JENKINS] Archiving disabled
[INFO]                                                                         
[INFO] ------------------------------------------------------------------------
[INFO] Building org.apache.sling.scripting.examplebundle.ohhi 0.0.1-SNAPSHOT
[INFO] ------------------------------------------------------------------------
[INFO] 
[INFO] --- maven-clean-plugin:3.1.0:clean (default-clean) @ org.apache.sling.scripting.examplebundle.ohhi
---
[INFO] 
[INFO] --- maven-enforcer-plugin:3.0.0-M1:enforce (enforce-maven-version) @ org.apache.sling.scripting.examplebundle.ohhi
---
[INFO] 
[INFO] --- maven-enforcer-plugin:3.0.0-M1:enforce (enforce-property-values) @ org.apache.sling.scripting.examplebundle.ohhi
---
[INFO] 
[INFO] --- maven-enforcer-plugin:3.0.0-M1:enforce (enforce-java) @ org.apache.sling.scripting.examplebundle.ohhi
---
[INFO] 
[INFO] --- maven-enforcer-plugin:3.0.0-M1:enforce (ban-maven-scr-plugin) @ org.apache.sling.scripting.examplebundle.ohhi
---
[INFO] 
[INFO] --- maven-remote-resources-plugin:1.5:process (process-resource-bundles) @ org.apache.sling.scripting.examplebundle.ohhi
---
[INFO] 
[INFO] --- maven-remote-resources-plugin:1.5:process (remote-resources-custom-notice) @ org.apache.sling.scripting.examplebundle.ohhi
---
[INFO] 
[INFO] --- maven-resources-plugin:3.1.0:resources (default-resources) @ org.apache.sling.scripting.examplebundle.ohhi
---
[INFO] Using 'UTF-8' encoding to copy filtered resources.
[INFO] Copying 3 resources
[INFO] Copying 3 resources
[INFO] Copying 3 resources
[INFO] 
[INFO] --- maven-compiler-plugin:3.7.0:compile (default-compile) @ org.apache.sling.scripting.examplebundle.ohhi
---
[INFO] No sources to compile
[INFO] 
[INFO] --- maven-bundle-plugin:3.5.0:manifest (scr-metadata) @ org.apache.sling.scripting.examplebundle.ohhi
---
[WARNING] Manifest org.apache.sling:org.apache.sling.scripting.examplebundle.ohhi:bundle:0.0.1-SNAPSHOT
: No translation found for macro: org.apache.sling.scriptingbundle.maven.plugin.Require-Capability
[INFO] 
[INFO] --- animal-sniffer-maven-plugin:1.16:check (default) @ org.apache.sling.scripting.examplebundle.ohhi
---
[INFO] Checking unresolved references to org.codehaus.mojo.signature:java18:1.0
[INFO] 
[INFO] --- maven-resources-plugin:3.1.0:testResources (default-testResources) @ org.apache.sling.scripting.examplebundle.ohhi
---
[INFO] Using 'UTF-8' encoding to copy filtered resources.
[INFO] skip non existing resourceDirectory <https://builds.apache.org/job/sling-org-apache-sling-scripting-bundle-tracker-it-1.8/ws/examples/org-apache-sling-scripting-examplebundle.ohhi/src/test/resources>
[INFO] Copying 3 resources
[INFO] Copying 3 resources
[INFO] 
[INFO] --- maven-compiler-plugin:3.7.0:testCompile (default-testCompile) @ org.apache.sling.scripting.examplebundle.ohhi
---
[INFO] No sources to compile
[INFO] 
[INFO] --- maven-surefire-plugin:2.20.1:test (default-test) @ org.apache.sling.scripting.examplebundle.ohhi
---
[JENKINS] Recording test results
[INFO] 
[INFO] --- scriptingbundle-maven-plugin:0.0.1-SNAPSHOT:metadata (default) @ org.apache.sling.scripting.examplebundle.ohhi
---
[INFO] 
[INFO] --- maven-bundle-plugin:3.5.0:bundle (default-bundle) @ org.apache.sling.scripting.examplebundle.ohhi
---
[INFO] 
[INFO] >>> maven-source-plugin:3.0.1:jar (attach-sources) > generate-sources @
org.apache.sling.scripting.examplebundle.ohhi >>>
[INFO] 
[INFO] --- maven-enforcer-plugin:3.0.0-M1:enforce (enforce-maven-version) @ org.apache.sling.scripting.examplebundle.ohhi
---
[INFO] 
[INFO] --- maven-enforcer-plugin:3.0.0-M1:enforce (enforce-property-values) @ org.apache.sling.scripting.examplebundle.ohhi
---
[INFO] 
[INFO] --- maven-enforcer-plugin:3.0.0-M1:enforce (enforce-java) @ org.apache.sling.scripting.examplebundle.ohhi
---
[INFO] 
[INFO] --- maven-enforcer-plugin:3.0.0-M1:enforce (ban-maven-scr-plugin) @ org.apache.sling.scripting.examplebundle.ohhi
---
[WARNING] Failed to getClass for org.apache.maven.plugins.source.SourceJarMojo
[INFO] 
[INFO] <<< maven-source-plugin:3.0.1:jar (attach-sources) < generate-sources @
org.apache.sling.scripting.examplebundle.ohhi <<<
[INFO] 
[INFO] --- maven-source-plugin:3.0.1:jar (attach-sources) @ org.apache.sling.scripting.examplebundle.ohhi
---
[INFO] Building jar: <https://builds.apache.org/job/sling-org-apache-sling-scripting-bundle-tracker-it-1.8/ws/examples/org-apache-sling-scripting-examplebundle.ohhi/target/org.apache.sling.scripting.examplebundle.ohhi-0.0.1-SNAPSHOT-sources.jar>
[INFO] 
[INFO] --- maven-site-plugin:3.7.1:attach-descriptor (attach-descriptor) @ org.apache.sling.scripting.examplebundle.ohhi
---
[INFO] Skipping because packaging 'bundle' is not pom.
[INFO] 
[INFO] --- ianal-maven-plugin:1.0-alpha-1:verify-legal-files (verify-legal-files) @ org.apache.sling.scripting.examplebundle.ohhi
---
[INFO] Checking legal files in: org.apache.sling.scripting.examplebundle.ohhi-0.0.1-SNAPSHOT.jar
[INFO] Checking legal files in: org.apache.sling.scripting.examplebundle.ohhi-0.0.1-SNAPSHOT-sources.jar
[INFO] 
[INFO] --- maven-bundle-plugin:3.5.0:baseline (baseline) @ org.apache.sling.scripting.examplebundle.ohhi
---
[INFO] artifact org.apache.sling:org.apache.sling.scripting.examplebundle.ohhi: checking for
updates from Nexus
[INFO] artifact org.apache.sling:org.apache.sling.scripting.examplebundle.ohhi: checking for
updates from central
[INFO] Unable to find a previous version of the project in the repository
[INFO] Not generating Baseline report as there is no previous version of the library to compare
against
[INFO] 
[INFO] --- apache-rat-plugin:0.12:check (rat-check) @ org.apache.sling.scripting.examplebundle.ohhi
---
[INFO] Enabled default license matchers.
[INFO] Will parse SCM ignores for exclusions...
[INFO] Finished adding exclusions from SCM ignore files.
[INFO] 61 implicit excludes (use -debug for more details).
[INFO] Exclude: src/main/appended-resources/META-INF/*
[INFO] Exclude: velocity.log
[INFO] Exclude: target/*
[INFO] Exclude: README.md
[INFO] Exclude: maven-eclipse.xml
[INFO] Exclude: .*
[INFO] Exclude: .*/**
[INFO] Exclude: **/*.json
[INFO] Exclude: DEPENDENCIES
[INFO] Exclude: **/*.rej
[INFO] Exclude: hs_err_*.log
[INFO] Exclude: **/repository/index/*/index-details.txt
[INFO] Exclude: bnd.bnd
[INFO] Exclude: **/extends
[INFO] 3 resources included (use -debug for more details)
[INFO] Rat check: Summary over all files. Unapproved: 0, unknown: 0, generated: 0, approved:
3 licenses.
[INFO] 
[INFO] --- maven-install-plugin:2.5.2:install (default-install) @ org.apache.sling.scripting.examplebundle.ohhi
---
[INFO] Installing <https://builds.apache.org/job/sling-org-apache-sling-scripting-bundle-tracker-it-1.8/ws/examples/org-apache-sling-scripting-examplebundle.ohhi/target/org.apache.sling.scripting.examplebundle.ohhi-0.0.1-SNAPSHOT.jar>
to /home/jenkins/jenkins-slave/maven-repositories/1/org/apache/sling/org.apache.sling.scripting.examplebundle.ohhi/0.0.1-SNAPSHOT/org.apache.sling.scripting.examplebundle.ohhi-0.0.1-SNAPSHOT.jar
[INFO] Installing <https://builds.apache.org/job/sling-org-apache-sling-scripting-bundle-tracker-it-1.8/ws/examples/org-apache-sling-scripting-examplebundle.ohhi/pom.xml>
to /home/jenkins/jenkins-slave/maven-repositories/1/org/apache/sling/org.apache.sling.scripting.examplebundle.ohhi/0.0.1-SNAPSHOT/org.apache.sling.scripting.examplebundle.ohhi-0.0.1-SNAPSHOT.pom
[INFO] Installing <https://builds.apache.org/job/sling-org-apache-sling-scripting-bundle-tracker-it-1.8/ws/examples/org-apache-sling-scripting-examplebundle.ohhi/target/org.apache.sling.scripting.examplebundle.ohhi-0.0.1-SNAPSHOT-sources.jar>
to /home/jenkins/jenkins-slave/maven-repositories/1/org/apache/sling/org.apache.sling.scripting.examplebundle.ohhi/0.0.1-SNAPSHOT/org.apache.sling.scripting.examplebundle.ohhi-0.0.1-SNAPSHOT-sources.jar
[INFO] 
[INFO] --- maven-bundle-plugin:3.5.0:install (default-install) @ org.apache.sling.scripting.examplebundle.ohhi
---
[INFO] Local OBR update disabled (enable with -DobrRepository)
[INFO] 
[INFO] --- maven-deploy-plugin:2.8.2:deploy (default-deploy) @ org.apache.sling.scripting.examplebundle.ohhi
---
[INFO] Downloading: https://repository.apache.org/content/repositories/snapshots/org/apache/sling/org.apache.sling.scripting.examplebundle.ohhi/0.0.1-SNAPSHOT/maven-metadata.xml
[INFO] Downloading: https://repository.apache.org/content/repositories/snapshots/org/apache/sling/org.apache.sling.scripting.examplebundle.ohhi/0.0.1-SNAPSHOT/maven-metadata.xml
[INFO] Downloading: https://repository.apache.org/content/repositories/snapshots/org/apache/sling/org.apache.sling.scripting.examplebundle.ohhi/0.0.1-SNAPSHOT/maven-metadata.xml
[INFO] Uploading: https://repository.apache.org/content/repositories/snapshots/org/apache/sling/org.apache.sling.scripting.examplebundle.ohhi/0.0.1-SNAPSHOT/org.apache.sling.scripting.examplebundle.ohhi-0.0.1-20181210.181901-1.jar
[INFO] Uploaded: https://repository.apache.org/content/repositories/snapshots/org/apache/sling/org.apache.sling.scripting.examplebundle.ohhi/0.0.1-SNAPSHOT/org.apache.sling.scripting.examplebundle.ohhi-0.0.1-20181210.181901-1.jar
(11 KB at 11.0 KB/sec)
[INFO] Uploading: https://repository.apache.org/content/repositories/snapshots/org/apache/sling/org.apache.sling.scripting.examplebundle.ohhi/0.0.1-SNAPSHOT/org.apache.sling.scripting.examplebundle.ohhi-0.0.1-20181210.181901-1.pom
[INFO] Uploaded: https://repository.apache.org/content/repositories/snapshots/org/apache/sling/org.apache.sling.scripting.examplebundle.ohhi/0.0.1-SNAPSHOT/org.apache.sling.scripting.examplebundle.ohhi-0.0.1-20181210.181901-1.pom
(4 KB at 3.8 KB/sec)
[INFO] Downloading: https://repository.apache.org/content/repositories/snapshots/org/apache/sling/org.apache.sling.scripting.examplebundle.ohhi/maven-metadata.xml
[INFO] Downloading: https://repository.apache.org/content/repositories/snapshots/org/apache/sling/org.apache.sling.scripting.examplebundle.ohhi/maven-metadata.xml
[INFO] Downloading: https://repository.apache.org/content/repositories/snapshots/org/apache/sling/org.apache.sling.scripting.examplebundle.ohhi/maven-metadata.xml
[INFO] Uploading: https://repository.apache.org/content/repositories/snapshots/org/apache/sling/org.apache.sling.scripting.examplebundle.ohhi/0.0.1-SNAPSHOT/maven-metadata.xml
[INFO] Uploaded: https://repository.apache.org/content/repositories/snapshots/org/apache/sling/org.apache.sling.scripting.examplebundle.ohhi/0.0.1-SNAPSHOT/maven-metadata.xml
(811 B at 0.9 KB/sec)
[INFO] Uploading: https://repository.apache.org/content/repositories/snapshots/org/apache/sling/org.apache.sling.scripting.examplebundle.ohhi/0.0.1-SNAPSHOT/maven-metadata.xml
[INFO] Uploaded: https://repository.apache.org/content/repositories/snapshots/org/apache/sling/org.apache.sling.scripting.examplebundle.ohhi/0.0.1-SNAPSHOT/maven-metadata.xml
(811 B at 0.9 KB/sec)
[INFO] Uploading: https://repository.apache.org/content/repositories/snapshots/org/apache/sling/org.apache.sling.scripting.examplebundle.ohhi/0.0.1-SNAPSHOT/maven-metadata.xml
[INFO] Uploaded: https://repository.apache.org/content/repositories/snapshots/org/apache/sling/org.apache.sling.scripting.examplebundle.ohhi/0.0.1-SNAPSHOT/maven-metadata.xml
(811 B at 0.9 KB/sec)
[INFO] Uploading: https://repository.apache.org/content/repositories/snapshots/org/apache/sling/org.apache.sling.scripting.examplebundle.ohhi/maven-metadata.xml
[INFO] Uploaded: https://repository.apache.org/content/repositories/snapshots/org/apache/sling/org.apache.sling.scripting.examplebundle.ohhi/maven-metadata.xml
(321 B at 0.3 KB/sec)
[INFO] Uploading: https://repository.apache.org/content/repositories/snapshots/org/apache/sling/org.apache.sling.scripting.examplebundle.ohhi/maven-metadata.xml
[INFO] Uploaded: https://repository.apache.org/content/repositories/snapshots/org/apache/sling/org.apache.sling.scripting.examplebundle.ohhi/maven-metadata.xml
(321 B at 0.3 KB/sec)
[INFO] Uploading: https://repository.apache.org/content/repositories/snapshots/org/apache/sling/org.apache.sling.scripting.examplebundle.ohhi/maven-metadata.xml
[INFO] Uploaded: https://repository.apache.org/content/repositories/snapshots/org/apache/sling/org.apache.sling.scripting.examplebundle.ohhi/maven-metadata.xml
(321 B at 0.3 KB/sec)
[INFO] Uploading: https://repository.apache.org/content/repositories/snapshots/org/apache/sling/org.apache.sling.scripting.examplebundle.ohhi/0.0.1-SNAPSHOT/org.apache.sling.scripting.examplebundle.ohhi-0.0.1-20181210.181901-1-sources.jar
[INFO] Uploaded: https://repository.apache.org/content/repositories/snapshots/org/apache/sling/org.apache.sling.scripting.examplebundle.ohhi/0.0.1-SNAPSHOT/org.apache.sling.scripting.examplebundle.ohhi-0.0.1-20181210.181901-1-sources.jar
(10 KB at 10.6 KB/sec)
[INFO] Downloading: https://repository.apache.org/content/repositories/snapshots/org/apache/sling/org.apache.sling.scripting.examplebundle.ohhi/maven-metadata.xml
[INFO] Downloaded: https://repository.apache.org/content/repositories/snapshots/org/apache/sling/org.apache.sling.scripting.examplebundle.ohhi/maven-metadata.xml
(321 B at 0.5 KB/sec)
[INFO] Downloading: https://repository.apache.org/content/repositories/snapshots/org/apache/sling/org.apache.sling.scripting.examplebundle.ohhi/maven-metadata.xml
[INFO] Downloaded: https://repository.apache.org/content/repositories/snapshots/org/apache/sling/org.apache.sling.scripting.examplebundle.ohhi/maven-metadata.xml
(321 B at 0.5 KB/sec)
[INFO] Uploading: https://repository.apache.org/content/repositories/snapshots/org/apache/sling/org.apache.sling.scripting.examplebundle.ohhi/0.0.1-SNAPSHOT/maven-metadata.xml
[INFO] Uploaded: https://repository.apache.org/content/repositories/snapshots/org/apache/sling/org.apache.sling.scripting.examplebundle.ohhi/0.0.1-SNAPSHOT/maven-metadata.xml
(2 KB at 1.1 KB/sec)
[INFO] Uploading: https://repository.apache.org/content/repositories/snapshots/org/apache/sling/org.apache.sling.scripting.examplebundle.ohhi/0.0.1-SNAPSHOT/maven-metadata.xml
[INFO] Uploaded: https://repository.apache.org/content/repositories/snapshots/org/apache/sling/org.apache.sling.scripting.examplebundle.ohhi/0.0.1-SNAPSHOT/maven-metadata.xml
(2 KB at 1.1 KB/sec)
[INFO] Uploading: https://repository.apache.org/content/repositories/snapshots/org/apache/sling/org.apache.sling.scripting.examplebundle.ohhi/0.0.1-SNAPSHOT/maven-metadata.xml
[INFO] Uploaded: https://repository.apache.org/content/repositories/snapshots/org/apache/sling/org.apache.sling.scripting.examplebundle.ohhi/0.0.1-SNAPSHOT/maven-metadata.xml
(2 KB at 1.1 KB/sec)
[INFO] Uploading: https://repository.apache.org/content/repositories/snapshots/org/apache/sling/org.apache.sling.scripting.examplebundle.ohhi/maven-metadata.xml
[INFO] Uploaded: https://repository.apache.org/content/repositories/snapshots/org/apache/sling/org.apache.sling.scripting.examplebundle.ohhi/maven-metadata.xml
(321 B at 0.3 KB/sec)
[INFO] Uploading: https://repository.apache.org/content/repositories/snapshots/org/apache/sling/org.apache.sling.scripting.examplebundle.ohhi/maven-metadata.xml
[INFO] Uploaded: https://repository.apache.org/content/repositories/snapshots/org/apache/sling/org.apache.sling.scripting.examplebundle.ohhi/maven-metadata.xml
(321 B at 0.3 KB/sec)
[INFO] 
[INFO] --- maven-bundle-plugin:3.5.0:deploy (default-deploy) @ org.apache.sling.scripting.examplebundle.ohhi
---
[INFO] Remote OBR update disabled (enable with -DremoteOBR)
[JENKINS] Archiving disabled
[INFO]                                                                         
[INFO] ------------------------------------------------------------------------
[INFO] Building Apache Sling Scripting HTL Engine 1.1.0-1.4.0-exp-SNAPSHOT
[INFO] ------------------------------------------------------------------------
[INFO] Downloading: http://repository.apache.org/snapshots/org/apache/sling/org.apache.sling.scripting.sightly.runtime/1.0.0-1.4.0-SNAPSHOT/maven-metadata.xml
[INFO] Downloading: http://repository.apache.org/snapshots/org/apache/sling/org.apache.sling.scripting.sightly.runtime/1.0.0-1.4.0-SNAPSHOT/org.apache.sling.scripting.sightly.runtime-1.0.0-1.4.0-SNAPSHOT.pom
[WARNING] The POM for org.apache.sling:org.apache.sling.scripting.sightly.runtime:jar:1.0.0-1.4.0-SNAPSHOT
is missing, no dependency information available
[INFO] Downloading: http://repository.apache.org/snapshots/org/apache/sling/org.apache.sling.scripting.sightly.compiler/1.1.0-1.4.0-SNAPSHOT/maven-metadata.xml
[INFO] Downloading: http://repository.apache.org/snapshots/org/apache/sling/org.apache.sling.scripting.sightly.compiler/1.1.0-1.4.0-SNAPSHOT/org.apache.sling.scripting.sightly.compiler-1.1.0-1.4.0-SNAPSHOT.pom
[WARNING] The POM for org.apache.sling:org.apache.sling.scripting.sightly.compiler:jar:1.1.0-1.4.0-SNAPSHOT
is missing, no dependency information available
[INFO] Downloading: http://repository.apache.org/snapshots/org/apache/sling/org.apache.sling.scripting.sightly.compiler.java/1.1.0-1.4.0-SNAPSHOT/maven-metadata.xml
[INFO] Downloading: http://repository.apache.org/snapshots/org/apache/sling/org.apache.sling.scripting.sightly.compiler.java/1.1.0-1.4.0-SNAPSHOT/org.apache.sling.scripting.sightly.compiler.java-1.1.0-1.4.0-SNAPSHOT.pom
[WARNING] The POM for org.apache.sling:org.apache.sling.scripting.sightly.compiler.java:jar:1.1.0-1.4.0-SNAPSHOT
is missing, no dependency information available
[INFO] Downloading: http://repository.apache.org/snapshots/org/apache/sling/org.apache.sling.scripting.bundle.tracker/0.0.1-SNAPSHOT/maven-metadata.xml
[INFO] Downloaded: http://repository.apache.org/snapshots/org/apache/sling/org.apache.sling.scripting.bundle.tracker/0.0.1-SNAPSHOT/maven-metadata.xml
(1021 B at 3.3 KB/sec)
[INFO] Downloading: http://repository.apache.org/snapshots/org/apache/sling/org.apache.sling.scripting.bundle.tracker/0.0.1-SNAPSHOT/org.apache.sling.scripting.bundle.tracker-0.0.1-20181210.181003-2.pom
[INFO] Downloaded: http://repository.apache.org/snapshots/org/apache/sling/org.apache.sling.scripting.bundle.tracker/0.0.1-SNAPSHOT/org.apache.sling.scripting.bundle.tracker-0.0.1-20181210.181003-2.pom
(8 KB at 24.4 KB/sec)
[INFO] Downloading: https://repo.maven.apache.org/maven2/org/apache/sling/org.apache.sling.api/2.14.0/org.apache.sling.api-2.14.0.pom
[INFO] Downloaded: https://repo.maven.apache.org/maven2/org/apache/sling/org.apache.sling.api/2.14.0/org.apache.sling.api-2.14.0.pom
(6 KB at 124.0 KB/sec)
[INFO] Downloading: https://repo.maven.apache.org/maven2/org/apache/sling/org.apache.sling.scripting.core/2.0.32/org.apache.sling.scripting.core-2.0.32.pom
[INFO] Downloaded: https://repo.maven.apache.org/maven2/org/apache/sling/org.apache.sling.scripting.core/2.0.32/org.apache.sling.scripting.core-2.0.32.pom
(10 KB at 95.9 KB/sec)
[INFO] Downloading: https://repo.maven.apache.org/maven2/org/apache/sling/org.apache.sling.i18n/2.2.8/org.apache.sling.i18n-2.2.8.pom
[INFO] Downloaded: https://repo.maven.apache.org/maven2/org/apache/sling/org.apache.sling.i18n/2.2.8/org.apache.sling.i18n-2.2.8.pom
(11 KB at 60.7 KB/sec)
[INFO] Downloading: https://repo.maven.apache.org/maven2/org/apache/sling/org.apache.sling.testing.sling-mock/2.1.2/org.apache.sling.testing.sling-mock-2.1.2.pom
[INFO] Downloaded: https://repo.maven.apache.org/maven2/org/apache/sling/org.apache.sling.testing.sling-mock/2.1.2/org.apache.sling.testing.sling-mock-2.1.2.pom
(11 KB at 163.2 KB/sec)
[INFO] Downloading: https://repo.maven.apache.org/maven2/org/apache/sling/org.apache.sling.testing.osgi-mock/2.1.0/org.apache.sling.testing.osgi-mock-2.1.0.pom
[INFO] Downloaded: https://repo.maven.apache.org/maven2/org/apache/sling/org.apache.sling.testing.osgi-mock/2.1.0/org.apache.sling.testing.osgi-mock-2.1.0.pom
(8 KB at 380.1 KB/sec)
[INFO] Downloading: https://repo.maven.apache.org/maven2/org/apache/sling/org.apache.sling.testing.jcr-mock/1.1.16/org.apache.sling.testing.jcr-mock-1.1.16.pom
[INFO] Downloaded: https://repo.maven.apache.org/maven2/org/apache/sling/org.apache.sling.testing.jcr-mock/1.1.16/org.apache.sling.testing.jcr-mock-1.1.16.pom
(5 KB at 257.6 KB/sec)
[INFO] Downloading: https://repo.maven.apache.org/maven2/org/apache/sling/org.apache.sling.resourcebuilder/1.0.0/org.apache.sling.resourcebuilder-1.0.0.pom
[INFO] Downloaded: https://repo.maven.apache.org/maven2/org/apache/sling/org.apache.sling.resourcebuilder/1.0.0/org.apache.sling.resourcebuilder-1.0.0.pom
(12 KB at 681.6 KB/sec)
[INFO] Downloading: http://repository.apache.org/snapshots/org/apache/sling/org.apache.sling.scripting.sightly.runtime/1.0.0-1.4.0-SNAPSHOT/org.apache.sling.scripting.sightly.runtime-1.0.0-1.4.0-SNAPSHOT.jar
[INFO] Downloading: http://repository.apache.org/snapshots/org/apache/sling/org.apache.sling.scripting.sightly.compiler/1.1.0-1.4.0-SNAPSHOT/org.apache.sling.scripting.sightly.compiler-1.1.0-1.4.0-SNAPSHOT.jar
[INFO] Downloading: http://repository.apache.org/snapshots/org/apache/sling/org.apache.sling.scripting.sightly.compiler.java/1.1.0-1.4.0-SNAPSHOT/org.apache.sling.scripting.sightly.compiler.java-1.1.0-1.4.0-SNAPSHOT.jar
[INFO] Downloading: http://repository.apache.org/snapshots/org/apache/sling/org.apache.sling.scripting.bundle.tracker/0.0.1-SNAPSHOT/org.apache.sling.scripting.bundle.tracker-0.0.1-20181210.181003-2.jar
[INFO] Downloaded: http://repository.apache.org/snapshots/org/apache/sling/org.apache.sling.scripting.bundle.tracker/0.0.1-SNAPSHOT/org.apache.sling.scripting.bundle.tracker-0.0.1-20181210.181003-2.jar
(51 KB at 117.3 KB/sec)
[INFO] Downloading: https://repo.maven.apache.org/maven2/org/apache/sling/org.apache.sling.api/2.14.0/org.apache.sling.api-2.14.0.jar
[INFO] Downloading: https://repo.maven.apache.org/maven2/org/apache/sling/org.apache.sling.scripting.core/2.0.32/org.apache.sling.scripting.core-2.0.32.jar
[INFO] Downloading: https://repo.maven.apache.org/maven2/org/apache/sling/org.apache.sling.i18n/2.2.8/org.apache.sling.i18n-2.2.8.jar
[INFO] Downloading: https://repo.maven.apache.org/maven2/org/apache/sling/org.apache.sling.testing.sling-mock/2.1.2/org.apache.sling.testing.sling-mock-2.1.2.jar
[INFO] Downloading: https://repo.maven.apache.org/maven2/org/apache/sling/org.apache.sling.testing.osgi-mock/2.1.0/org.apache.sling.testing.osgi-mock-2.1.0.jar
[INFO] Downloaded: https://repo.maven.apache.org/maven2/org/apache/sling/org.apache.sling.api/2.14.0/org.apache.sling.api-2.14.0.jar
(113 KB at 3310.2 KB/sec)
[INFO] Downloading: https://repo.maven.apache.org/maven2/org/apache/sling/org.apache.sling.testing.jcr-mock/1.1.16/org.apache.sling.testing.jcr-mock-1.1.16.jar
[INFO] Downloaded: https://repo.maven.apache.org/maven2/org/apache/sling/org.apache.sling.testing.jcr-mock/1.1.16/org.apache.sling.testing.jcr-mock-1.1.16.jar
(49 KB at 951.5 KB/sec)
[INFO] Downloading: https://repo.maven.apache.org/maven2/org/apache/sling/org.apache.sling.resourcebuilder/1.0.0/org.apache.sling.resourcebuilder-1.0.0.jar
[INFO] Downloaded: https://repo.maven.apache.org/maven2/org/apache/sling/org.apache.sling.resourcebuilder/1.0.0/org.apache.sling.resourcebuilder-1.0.0.jar
(18 KB at 263.8 KB/sec)
[INFO] Downloaded: https://repo.maven.apache.org/maven2/org/apache/sling/org.apache.sling.testing.osgi-mock/2.1.0/org.apache.sling.testing.osgi-mock-2.1.0.jar
(451 KB at 6168.1 KB/sec)
[INFO] Downloaded: https://repo.maven.apache.org/maven2/org/apache/sling/org.apache.sling.i18n/2.2.8/org.apache.sling.i18n-2.2.8.jar
(46 KB at 347.9 KB/sec)
[INFO] Downloaded: https://repo.maven.apache.org/maven2/org/apache/sling/org.apache.sling.testing.sling-mock/2.1.2/org.apache.sling.testing.sling-mock-2.1.2.jar
(82 KB at 580.7 KB/sec)
[INFO] Downloaded: https://repo.maven.apache.org/maven2/org/apache/sling/org.apache.sling.scripting.core/2.0.32/org.apache.sling.scripting.core-2.0.32.jar
(81 KB at 389.5 KB/sec)
[JENKINS] Archiving disabled
[JENKINS] Archiving disabled
[JENKINS] Archiving disabled
[JENKINS] Archiving disabled
[JENKINS] Archiving disabled
[JENKINS] Archiving disabled
[JENKINS] Archiving disabled
[JENKINS] Archiving disabled
[JENKINS] Archiving disabled
[INFO] ------------------------------------------------------------------------
[INFO] Reactor Summary:
[INFO] 
[INFO] org.apache.sling.scripting.examplebundle ........... SUCCESS [ 45.116 s]
[INFO] org.apache.sling.scripting.examplebundle.precompiled SUCCESS [ 28.674 s]
[INFO] org.apache.sling.scripting.examplebundle.classic ... SUCCESS [ 22.305 s]
[INFO] org.apache.sling.scripting.examplebundle.hi ........ SUCCESS [ 24.823 s]
[INFO] org.apache.sling.scripting.examplebundle.ohhi ...... SUCCESS [ 22.568 s]
[INFO] Apache Sling Scripting HTL Engine .................. FAILURE [  5.637 s]
[INFO] org.apache.sling.scripting.bundle.tracker.it ....... SKIPPED
[INFO] org.apache.sling.scripting.bundle.tracker.it.reactor SKIPPED
[INFO] ------------------------------------------------------------------------
[INFO] BUILD FAILURE
[INFO] ------------------------------------------------------------------------
[INFO] Total time: 03:00 min
[INFO] Finished at: 2018-12-10T18:19:34+00:00
[INFO] Final Memory: 81M/3925M
[INFO] ------------------------------------------------------------------------
[ERROR] Failed to execute goal on project org.apache.sling.scripting.sightly: Could not resolve
dependencies for project org.apache.sling:org.apache.sling.scripting.sightly:bundle:1.1.0-1.4.0-exp-SNAPSHOT:
The following artifacts could not be resolved: org.apache.sling:org.apache.sling.scripting.sightly.runtime:jar:1.0.0-1.4.0-SNAPSHOT,
org.apache.sling:org.apache.sling.scripting.sightly.compiler:jar:1.1.0-1.4.0-SNAPSHOT, org.apache.sling:org.apache.sling.scripting.sightly.compiler.java:jar:1.1.0-1.4.0-SNAPSHOT:
Could not find artifact org.apache.sling:org.apache.sling.scripting.sightly.runtime:jar:1.0.0-1.4.0-SNAPSHOT
in Nexus (http://repository.apache.org/snapshots) -> [Help 1]
[ERROR] 
[ERROR] To see the full stack trace of the errors, re-run Maven with the -e switch.
[ERROR] Re-run Maven using the -X switch to enable full debug logging.
[ERROR] 
[ERROR] For more information about the errors and possible solutions, please read the following
articles:
[ERROR] [Help 1] http://cwiki.apache.org/confluence/display/MAVEN/DependencyResolutionException
[ERROR] 
[ERROR] After correcting the problems, you can resume the build with the command
[ERROR]   mvn <goals> -rf :org.apache.sling.scripting.sightly
channel stopped
Recording test results
Not sending mail to unregistered user cotescu@adobe.com

Mime
View raw message