sling-commits mailing list archives

Site index · List index
Message view « Date » · « Thread »
Top « Date » · « Thread »
From Apache Jenkins Server <jenk...@builds.apache.org>
Subject Build failed in Jenkins: sling-org-apache-sling-feature-extension-content-1.8 #41
Date Mon, 03 Dec 2018 16:58:13 GMT
See <https://builds.apache.org/job/sling-org-apache-sling-feature-extension-content-1.8/41/display/redirect?page=changes>

Changes:

[bosschae] Use copies when merging extensions rather than the original object

------------------------------------------
Started by an SCM change
[EnvInject] - Loading node environment variables.
Building remotely on H41 (ubuntu xenial) in workspace <https://builds.apache.org/job/sling-org-apache-sling-feature-extension-content-1.8/ws/>
[WS-CLEANUP] Deleting project workspace...
[WS-CLEANUP] Done
Cloning the remote Git repository
Cloning repository https://github.com/apache/sling-org-apache-sling-feature-extension-content.git
 > git init <https://builds.apache.org/job/sling-org-apache-sling-feature-extension-content-1.8/ws/>
# timeout=10
Fetching upstream changes from https://github.com/apache/sling-org-apache-sling-feature-extension-content.git
 > git --version # timeout=10
 > git fetch --tags --progress https://github.com/apache/sling-org-apache-sling-feature-extension-content.git
+refs/heads/*:refs/remotes/origin/*
 > git config remote.origin.url https://github.com/apache/sling-org-apache-sling-feature-extension-content.git
# timeout=10
 > git config --add remote.origin.fetch +refs/heads/*:refs/remotes/origin/* # timeout=10
 > git config remote.origin.url https://github.com/apache/sling-org-apache-sling-feature-extension-content.git
# timeout=10
Fetching upstream changes from https://github.com/apache/sling-org-apache-sling-feature-extension-content.git
 > git fetch --tags --progress https://github.com/apache/sling-org-apache-sling-feature-extension-content.git
+refs/heads/*:refs/remotes/origin/*
 > git rev-parse origin/master^{commit} # timeout=10
Checking out Revision e77735417c23b27fca3d591bc7a99dc09bdbd3a7 (origin/master)
 > git config core.sparsecheckout # timeout=10
 > git checkout -f e77735417c23b27fca3d591bc7a99dc09bdbd3a7
Commit message: "Use copies when merging extensions rather than the original object"
 > git rev-list --no-walk 981d385215a948800c0dc1e57f60b3c8efa4dfbf # timeout=10
Parsing POMs
Modules changed, recalculating dependency graph
Established TCP socket on 38118
maven33-agent.jar already up to date
maven33-interceptor.jar already up to date
maven3-interceptor-commons.jar already up to date
[sling-org-apache-sling-feature-extension-content-1.8] $ /home/jenkins/tools/java/latest1.8/bin/java
-Xmx4g -Xms4g -cp /home/jenkins/jenkins-slave/maven33-agent.jar:/home/jenkins/tools/maven/apache-maven-3.3.9/boot/plexus-classworlds-2.5.2.jar:/home/jenkins/tools/maven/apache-maven-3.3.9/conf/logging
jenkins.maven3.agent.Maven33Main /home/jenkins/tools/maven/apache-maven-3.3.9 /home/jenkins/jenkins-slave/slave.jar
/home/jenkins/jenkins-slave/maven33-interceptor.jar /home/jenkins/jenkins-slave/maven3-interceptor-commons.jar
38118
<===[JENKINS REMOTING CAPACITY]===>   channel started
Executing Maven:  -B -f <https://builds.apache.org/job/sling-org-apache-sling-feature-extension-content-1.8/ws/pom.xml>
-Dmaven.repo.local=/home/jenkins/jenkins-slave/maven-repositories/0 -U clean deploy
[INFO] Scanning for projects...
[INFO]                                                                         
[INFO] ------------------------------------------------------------------------
[INFO] Building Sling Featuremodel - Content Deployment Exension 0.0.1-SNAPSHOT
[INFO] ------------------------------------------------------------------------
[INFO] Downloading: http://repository.apache.org/snapshots/org/apache/jackrabbit/vault/org.apache.jackrabbit.vault/3.2.5-SNAPSHOT/maven-metadata.xml
[INFO] Downloading: http://repository.apache.org/snapshots/org/apache/jackrabbit/vault/org.apache.jackrabbit.vault/3.2.5-SNAPSHOT/org.apache.jackrabbit.vault-3.2.5-SNAPSHOT.pom
[WARNING] The POM for org.apache.jackrabbit.vault:org.apache.jackrabbit.vault:jar:3.2.5-SNAPSHOT
is missing, no dependency information available
[INFO] Downloading: http://repository.apache.org/snapshots/org/apache/sling/org.apache.sling.feature/0.8.1-SNAPSHOT/maven-metadata.xml
[INFO] Downloaded: http://repository.apache.org/snapshots/org/apache/sling/org.apache.sling.feature/0.8.1-SNAPSHOT/maven-metadata.xml
(1004 B at 3.2 KB/sec)
[INFO] Downloading: http://repository.apache.org/snapshots/org/apache/sling/org.apache.sling.feature/0.8.1-SNAPSHOT/org.apache.sling.feature-0.8.1-20181203.164554-5.pom
[INFO] Downloaded: http://repository.apache.org/snapshots/org/apache/sling/org.apache.sling.feature/0.8.1-SNAPSHOT/org.apache.sling.feature-0.8.1-20181203.164554-5.pom
(5 KB at 14.8 KB/sec)
[INFO] Downloading: http://repository.apache.org/snapshots/org/apache/sling/org.apache.sling.feature.io/0.8.1-SNAPSHOT/maven-metadata.xml
[INFO] Downloaded: http://repository.apache.org/snapshots/org/apache/sling/org.apache.sling.feature.io/0.8.1-SNAPSHOT/maven-metadata.xml
(1007 B at 3.2 KB/sec)
[INFO] Downloading: http://repository.apache.org/snapshots/org/apache/sling/org.apache.sling.feature.io/0.8.1-SNAPSHOT/org.apache.sling.feature.io-0.8.1-20181203.164656-5.pom
[INFO] Downloaded: http://repository.apache.org/snapshots/org/apache/sling/org.apache.sling.feature.io/0.8.1-SNAPSHOT/org.apache.sling.feature.io-0.8.1-20181203.164656-5.pom
(6 KB at 18.2 KB/sec)
[INFO] Downloading: http://repository.apache.org/snapshots/org/apache/sling/org.apache.sling.feature.launcher/0.8.1-SNAPSHOT/maven-metadata.xml
[INFO] Downloaded: http://repository.apache.org/snapshots/org/apache/sling/org.apache.sling.feature.launcher/0.8.1-SNAPSHOT/maven-metadata.xml
(1013 B at 3.0 KB/sec)
[INFO] Downloading: http://repository.apache.org/snapshots/org/apache/sling/org.apache.sling.feature.launcher/0.8.1-SNAPSHOT/org.apache.sling.feature.launcher-0.8.1-20181130.142450-2.pom
[INFO] Downloaded: http://repository.apache.org/snapshots/org/apache/sling/org.apache.sling.feature.launcher/0.8.1-SNAPSHOT/org.apache.sling.feature.launcher-0.8.1-20181130.142450-2.pom
(7 KB at 20.1 KB/sec)
[INFO] Downloading: http://repository.apache.org/snapshots/org/apache/jackrabbit/vault/org.apache.jackrabbit.vault/3.2.5-SNAPSHOT/org.apache.jackrabbit.vault-3.2.5-SNAPSHOT.jar
[INFO] Downloading: http://repository.apache.org/snapshots/org/apache/sling/org.apache.sling.feature/0.8.1-SNAPSHOT/org.apache.sling.feature-0.8.1-20181203.164554-5.jar
[INFO] Downloading: http://repository.apache.org/snapshots/org/apache/sling/org.apache.sling.feature.io/0.8.1-SNAPSHOT/org.apache.sling.feature.io-0.8.1-20181203.164656-5.jar
[INFO] Downloading: http://repository.apache.org/snapshots/org/apache/sling/org.apache.sling.feature.launcher/0.8.1-SNAPSHOT/org.apache.sling.feature.launcher-0.8.1-20181130.142450-2.jar
[INFO] Downloaded: http://repository.apache.org/snapshots/org/apache/sling/org.apache.sling.feature/0.8.1-SNAPSHOT/org.apache.sling.feature-0.8.1-20181203.164554-5.jar
(112 KB at 219.8 KB/sec)
[INFO] Downloaded: http://repository.apache.org/snapshots/org/apache/sling/org.apache.sling.feature.io/0.8.1-SNAPSHOT/org.apache.sling.feature.io-0.8.1-20181203.164656-5.jar
(161 KB at 315.2 KB/sec)
[INFO] Downloaded: http://repository.apache.org/snapshots/org/apache/sling/org.apache.sling.feature.launcher/0.8.1-SNAPSHOT/org.apache.sling.feature.launcher-0.8.1-20181130.142450-2.jar
(1316 KB at 1789.2 KB/sec)
[WARNING] Attempt to (de-)serialize anonymous class hudson.maven.reporters.MavenArtifactArchiver$2;
see: https://jenkins.io/redirect/serialization-of-anonymous-classes/
[JENKINS] Archiving disabled
[WARNING] Attempt to (de-)serialize anonymous class hudson.maven.reporters.MavenFingerprinter$1;
see: https://jenkins.io/redirect/serialization-of-anonymous-classes/
[JENKINS] Archiving disabled
[INFO] ------------------------------------------------------------------------
[INFO] BUILD FAILURE
[INFO] ------------------------------------------------------------------------
[INFO] Total time: 13.262 s
[INFO] Finished at: 2018-12-03T16:58:11+00:00
[INFO] Final Memory: 55M/3925M
[INFO] ------------------------------------------------------------------------
Waiting for Jenkins to finish collecting data
[ERROR] Failed to execute goal on project org.apache.sling.feature.extension.content: Could
not resolve dependencies for project org.apache.sling:org.apache.sling.feature.extension.content:jar:0.0.1-SNAPSHOT:
Could not find artifact org.apache.jackrabbit.vault:org.apache.jackrabbit.vault:jar:3.2.5-SNAPSHOT
in Nexus (http://repository.apache.org/snapshots) -> [Help 1]
[ERROR] 
[ERROR] To see the full stack trace of the errors, re-run Maven with the -e switch.
[ERROR] Re-run Maven using the -X switch to enable full debug logging.
[ERROR] 
[ERROR] For more information about the errors and possible solutions, please read the following
articles:
[ERROR] [Help 1] http://cwiki.apache.org/confluence/display/MAVEN/DependencyResolutionException
channel stopped
Recording test results
Not sending mail to unregistered user bosschae@adobe.com
Not sending mail to unregistered user suess@adobe.com

Mime
View raw message