sling-commits mailing list archives

Site index · List index
Message view « Date » · « Thread »
Top « Date » · « Thread »
From Apache Jenkins Server <jenk...@builds.apache.org>
Subject Build failed in Jenkins: sling-org-apache-sling-commons-cache-portal-1.8 #76
Date Fri, 03 Aug 2018 16:04:21 GMT
See <https://builds.apache.org/job/sling-org-apache-sling-commons-cache-portal-1.8/76/display/redirect>

------------------------------------------
Started by timer
[EnvInject] - Loading node environment variables.
Building remotely on H33 (ubuntu xenial) in workspace <https://builds.apache.org/job/sling-org-apache-sling-commons-cache-portal-1.8/ws/>
 > git rev-parse --is-inside-work-tree # timeout=10
Fetching changes from the remote Git repository
 > git config remote.origin.url https://github.com/apache/sling-org-apache-sling-commons-cache-portal.git
# timeout=10
Fetching upstream changes from https://github.com/apache/sling-org-apache-sling-commons-cache-portal.git
 > git --version # timeout=10
 > git fetch --tags --progress https://github.com/apache/sling-org-apache-sling-commons-cache-portal.git
+refs/heads/*:refs/remotes/origin/*
 > git rev-parse origin/master^{commit} # timeout=10
Checking out Revision ff20233035fdb4a7eeb1dfb858042b79510de29e (origin/master)
 > git config core.sparsecheckout # timeout=10
 > git checkout -f ff20233035fdb4a7eeb1dfb858042b79510de29e
Commit message: "Updating badges for org-apache-sling-commons-cache-portal"
 > git rev-list --no-walk ff20233035fdb4a7eeb1dfb858042b79510de29e # timeout=10
Parsing POMs
Established TCP socket on 39211
maven33-agent.jar already up to date
maven33-interceptor.jar already up to date
maven3-interceptor-commons.jar already up to date
[sling-org-apache-sling-commons-cache-portal-1.8] $ /home/jenkins/tools/java/latest1.8/bin/java
-Xmx4g -Xms4g -cp /home/jenkins/jenkins-slave/maven33-agent.jar:/home/jenkins/tools/maven/apache-maven-3.3.9/boot/plexus-classworlds-2.5.2.jar:/home/jenkins/tools/maven/apache-maven-3.3.9/conf/logging
jenkins.maven3.agent.Maven33Main /home/jenkins/tools/maven/apache-maven-3.3.9 /home/jenkins/jenkins-slave/slave.jar
/home/jenkins/jenkins-slave/maven33-interceptor.jar /home/jenkins/jenkins-slave/maven3-interceptor-commons.jar
39211
<===[JENKINS REMOTING CAPACITY]===>   channel started
Executing Maven:  -B -f <https://builds.apache.org/job/sling-org-apache-sling-commons-cache-portal-1.8/ws/pom.xml>
-Dmaven.repo.local=/home/jenkins/jenkins-slave/maven-repositories/0 -U clean deploy
[INFO] Scanning for projects...
[INFO]                                                                         
[INFO] ------------------------------------------------------------------------
[INFO] Building Apache Sling Cache Portal Cache 0.1-SNAPSHOT
[INFO] ------------------------------------------------------------------------
[INFO] Downloading: http://repository.apache.org/snapshots/org/apache/sling/org.apache.sling.commons.cache.api/0.1-SNAPSHOT/maven-metadata.xml
[INFO] Downloaded: http://repository.apache.org/snapshots/org/apache/sling/org.apache.sling.commons.cache.api/0.1-SNAPSHOT/maven-metadata.xml
(1010 B at 2.1 KB/sec)
[INFO] Downloading: http://repository.apache.org/snapshots/org/apache/sling/org.apache.sling.commons.cache.api/0.1-SNAPSHOT/org.apache.sling.commons.cache.api-0.1-20180730.084435-43.pom
[INFO] Downloaded: http://repository.apache.org/snapshots/org/apache/sling/org.apache.sling.commons.cache.api/0.1-SNAPSHOT/org.apache.sling.commons.cache.api-0.1-20180730.084435-43.pom
(3 KB at 8.7 KB/sec)
[INFO] Downloading: http://repository.apache.org/snapshots/org/apache/sling/portal/org.apache.sling.portal.container/0.6.0-SNAPSHOT/maven-metadata.xml
[INFO] Downloading: http://repository.apache.org/snapshots/org/apache/sling/portal/org.apache.sling.portal.container/0.6.0-SNAPSHOT/org.apache.sling.portal.container-0.6.0-SNAPSHOT.pom
[WARNING] The POM for org.apache.sling.portal:org.apache.sling.portal.container:jar:0.6.0-SNAPSHOT
is missing, no dependency information available
[INFO] Downloading: http://repository.apache.org/snapshots/org/apache/sling/org.apache.sling.commons.cache.api/0.1-SNAPSHOT/org.apache.sling.commons.cache.api-0.1-20180730.084435-43.jar
[INFO] Downloading: http://repository.apache.org/snapshots/org/apache/sling/portal/org.apache.sling.portal.container/0.6.0-SNAPSHOT/org.apache.sling.portal.container-0.6.0-SNAPSHOT.jar
[INFO] Downloaded: http://repository.apache.org/snapshots/org/apache/sling/org.apache.sling.commons.cache.api/0.1-SNAPSHOT/org.apache.sling.commons.cache.api-0.1-20180730.084435-43.jar
(12 KB at 38.4 KB/sec)
[WARNING] Attempt to (de-)serialize anonymous class hudson.maven.reporters.MavenArtifactArchiver$2;
see: https://jenkins.io/redirect/serialization-of-anonymous-classes/
[JENKINS] Archiving disabled
[WARNING] Attempt to (de-)serialize anonymous class hudson.maven.reporters.MavenFingerprinter$1;
see: https://jenkins.io/redirect/serialization-of-anonymous-classes/
[JENKINS] Archiving disabled
[INFO] ------------------------------------------------------------------------
[INFO] BUILD FAILURE
[INFO] ------------------------------------------------------------------------
[INFO] Total time: 11.550 s
[INFO] Finished at: 2018-08-03T16:04:19+00:00
[INFO] Final Memory: 57M/3925M
[INFO] ------------------------------------------------------------------------
Waiting for Jenkins to finish collecting data
[ERROR] Failed to execute goal on project org.apache.sling.commons.cache.portal: Could not
resolve dependencies for project org.apache.sling:org.apache.sling.commons.cache.portal:bundle:0.1-SNAPSHOT:
Could not find artifact org.apache.sling.portal:org.apache.sling.portal.container:jar:0.6.0-SNAPSHOT
in Nexus (http://repository.apache.org/snapshots) -> [Help 1]
[ERROR] 
[ERROR] To see the full stack trace of the errors, re-run Maven with the -e switch.
[ERROR] Re-run Maven using the -X switch to enable full debug logging.
[ERROR] 
[ERROR] For more information about the errors and possible solutions, please read the following
articles:
[ERROR] [Help 1] http://cwiki.apache.org/confluence/display/MAVEN/DependencyResolutionException
channel stopped
Recording test results

Mime
View raw message