sling-commits mailing list archives

Site index · List index
Message view « Date » · « Thread »
Top « Date » · « Thread »
From Apache Jenkins Server <jenk...@builds.apache.org>
Subject Build failed in Jenkins: sling-org-apache-sling-commons-clam-1.8 #2
Date Tue, 03 Jul 2018 06:22:30 GMT
See <https://builds.apache.org/job/sling-org-apache-sling-commons-clam-1.8/2/display/redirect>

------------------------------------------
Started by timer
[EnvInject] - Loading node environment variables.
Building remotely on H27 (ubuntu xenial) in workspace <https://builds.apache.org/job/sling-org-apache-sling-commons-clam-1.8/ws/>
Cloning the remote Git repository
Cloning repository https://github.com/apache/sling-org-apache-sling-commons-clam.git
 > git init <https://builds.apache.org/job/sling-org-apache-sling-commons-clam-1.8/ws/>
# timeout=10
Fetching upstream changes from https://github.com/apache/sling-org-apache-sling-commons-clam.git
 > git --version # timeout=10
 > git fetch --tags --progress https://github.com/apache/sling-org-apache-sling-commons-clam.git
+refs/heads/*:refs/remotes/origin/*
 > git config remote.origin.url https://github.com/apache/sling-org-apache-sling-commons-clam.git
# timeout=10
 > git config --add remote.origin.fetch +refs/heads/*:refs/remotes/origin/* # timeout=10
 > git config remote.origin.url https://github.com/apache/sling-org-apache-sling-commons-clam.git
# timeout=10
Fetching upstream changes from https://github.com/apache/sling-org-apache-sling-commons-clam.git
 > git fetch --tags --progress https://github.com/apache/sling-org-apache-sling-commons-clam.git
+refs/heads/*:refs/remotes/origin/*
 > git rev-parse origin/master^{commit} # timeout=10
Checking out Revision 22b109008e965185b9a87ecd09fb36c0f82cc842 (origin/master)
 > git config core.sparsecheckout # timeout=10
 > git checkout -f 22b109008e965185b9a87ecd09fb36c0f82cc842
Commit message: "SLING-7702 Provide Commons Clam"
 > git rev-list --no-walk 22b109008e965185b9a87ecd09fb36c0f82cc842 # timeout=10
Parsing POMs
Downloaded artifact http://repository.apache.org/snapshots/org/apache/sling/sling/34-SNAPSHOT/maven-metadata.xml
Downloaded artifact http://repository.apache.org/snapshots/org/apache/sling/sling/34-SNAPSHOT/sling-34-20180630.102847-33.pom
Discovered a new module org.apache.sling:org.apache.sling.commons.clam Apache Sling Commons
Clam
Modules changed, recalculating dependency graph
Established TCP socket on 40053
maven33-agent.jar already up to date
maven33-interceptor.jar already up to date
maven3-interceptor-commons.jar already up to date
[sling-org-apache-sling-commons-clam-1.8] $ /home/jenkins/tools/java/latest1.8/bin/java -Xmx2g
-Xms256m -cp /home/jenkins/jenkins-slave/maven33-agent.jar:/home/jenkins/tools/maven/apache-maven-3.3.9/boot/plexus-classworlds-2.5.2.jar:/home/jenkins/tools/maven/apache-maven-3.3.9/conf/logging
jenkins.maven3.agent.Maven33Main /home/jenkins/tools/maven/apache-maven-3.3.9 /home/jenkins/jenkins-slave/slave.jar
/home/jenkins/jenkins-slave/maven33-interceptor.jar /home/jenkins/jenkins-slave/maven3-interceptor-commons.jar
40053
<===[JENKINS REMOTING CAPACITY]===>   channel started
Executing Maven:  -B -f <https://builds.apache.org/job/sling-org-apache-sling-commons-clam-1.8/ws/pom.xml>
-Dmaven.repo.local=/home/jenkins/jenkins-slave/maven-repositories/0 -U clean deploy
[INFO] Scanning for projects...
[INFO] Downloading: http://repository.apache.org/snapshots/org/apache/sling/sling/34-SNAPSHOT/maven-metadata.xml
[INFO] Downloaded: http://repository.apache.org/snapshots/org/apache/sling/sling/34-SNAPSHOT/maven-metadata.xml
(594 B at 1.6 KB/sec)
[INFO]                                                                         
[INFO] ------------------------------------------------------------------------
[INFO] Building Apache Sling Commons Clam 1.0.0-SNAPSHOT
[INFO] ------------------------------------------------------------------------
[INFO] Downloading: https://repo.maven.apache.org/maven2/org/apache/sling/org.apache.sling.testing.paxexam/2.0.0/org.apache.sling.testing.paxexam-2.0.0.pom
[INFO] Downloaded: https://repo.maven.apache.org/maven2/org/apache/sling/org.apache.sling.testing.paxexam/2.0.0/org.apache.sling.testing.paxexam-2.0.0.pom
(6 KB at 22.8 KB/sec)
[INFO] Downloading: https://repo.maven.apache.org/maven2/org/apache/sling/org.apache.sling.testing.paxexam/2.0.0/org.apache.sling.testing.paxexam-2.0.0.jar
[INFO] Downloaded: https://repo.maven.apache.org/maven2/org/apache/sling/org.apache.sling.testing.paxexam/2.0.0/org.apache.sling.testing.paxexam-2.0.0.jar
(32 KB at 175.3 KB/sec)
[INFO] 
[INFO] --- maven-clean-plugin:3.0.0:clean (default-clean) @ org.apache.sling.commons.clam
---
[INFO] 
[INFO] --- maven-enforcer-plugin:3.0.0-M1:enforce (enforce-property-values) @ org.apache.sling.commons.clam
---
[INFO] 
[INFO] --- maven-enforcer-plugin:3.0.0-M1:enforce (enforce-java) @ org.apache.sling.commons.clam
---
[INFO] 
[INFO] --- maven-enforcer-plugin:3.0.0-M1:enforce (ban-maven-scr-plugin) @ org.apache.sling.commons.clam
---
[INFO] 
[INFO] --- maven-remote-resources-plugin:1.5:process (process-resource-bundles) @ org.apache.sling.commons.clam
---
[INFO] 
[INFO] --- maven-remote-resources-plugin:1.5:process (default) @ org.apache.sling.commons.clam
---
[INFO] 
[INFO] --- depends-maven-plugin:1.4.0:generate-depends-file (default) @ org.apache.sling.commons.clam
---
[INFO] Created: <https://builds.apache.org/job/sling-org-apache-sling-commons-clam-1.8/ws/target/classes/META-INF/maven/dependencies.properties>
[INFO] 
[INFO] --- maven-resources-plugin:2.7:resources (default-resources) @ org.apache.sling.commons.clam
---
[INFO] Using 'UTF-8' encoding to copy filtered resources.
[INFO] skip non existing resourceDirectory <https://builds.apache.org/job/sling-org-apache-sling-commons-clam-1.8/ws/src/main/resources>
[INFO] Copying 3 resources
[INFO] Copying 3 resources
[INFO] 
[INFO] --- maven-compiler-plugin:3.7.0:compile (default-compile) @ org.apache.sling.commons.clam
---
[INFO] Changes detected - recompiling the module!
[INFO] Compiling 6 source files to <https://builds.apache.org/job/sling-org-apache-sling-commons-clam-1.8/ws/target/classes>
[INFO] 
[INFO] --- animal-sniffer-maven-plugin:1.16:check (default) @ org.apache.sling.commons.clam
---
[INFO] Checking unresolved references to org.codehaus.mojo.signature:java18:1.0
[INFO] 
[INFO] --- bnd-maven-plugin:4.0.0:bnd-process (default) @ org.apache.sling.commons.clam ---
[INFO] 
[INFO] --- maven-resources-plugin:2.7:testResources (default-testResources) @ org.apache.sling.commons.clam
---
[INFO] Using 'UTF-8' encoding to copy filtered resources.
[INFO] Copying 4 resources
[INFO] Copying 3 resources
[INFO] Copying 3 resources
[INFO] 
[INFO] --- maven-compiler-plugin:3.7.0:testCompile (default-testCompile) @ org.apache.sling.commons.clam
---
[INFO] Changes detected - recompiling the module!
[INFO] Compiling 2 source files to <https://builds.apache.org/job/sling-org-apache-sling-commons-clam-1.8/ws/target/test-classes>
[INFO] 
[INFO] --- maven-surefire-plugin:2.20.1:test (default-test) @ org.apache.sling.commons.clam
---
[JENKINS] Recording test results
[WARNING] Attempt to (de-)serialize anonymous class hudson.maven.reporters.BuildInfoRecorder$1;
see: https://jenkins.io/redirect/serialization-of-anonymous-classes/
[INFO] 
[INFO] --- maven-jar-plugin:3.0.2:jar (default-jar) @ org.apache.sling.commons.clam ---
[INFO] Building jar: <https://builds.apache.org/job/sling-org-apache-sling-commons-clam-1.8/ws/target/org.apache.sling.commons.clam-1.0.0-SNAPSHOT.jar>
[INFO] 
[INFO] >>> maven-source-plugin:3.0.1:jar (attach-sources) > generate-sources @
org.apache.sling.commons.clam >>>
[INFO] 
[INFO] --- maven-enforcer-plugin:3.0.0-M1:enforce (enforce-property-values) @ org.apache.sling.commons.clam
---
[INFO] 
[INFO] --- maven-enforcer-plugin:3.0.0-M1:enforce (enforce-java) @ org.apache.sling.commons.clam
---
[INFO] 
[INFO] --- maven-enforcer-plugin:3.0.0-M1:enforce (ban-maven-scr-plugin) @ org.apache.sling.commons.clam
---
[WARNING] Failed to getClass for org.apache.maven.plugins.source.SourceJarMojo
[INFO] 
[INFO] <<< maven-source-plugin:3.0.1:jar (attach-sources) < generate-sources @
org.apache.sling.commons.clam <<<
[INFO] 
[INFO] --- maven-source-plugin:3.0.1:jar (attach-sources) @ org.apache.sling.commons.clam
---
[INFO] Building jar: <https://builds.apache.org/job/sling-org-apache-sling-commons-clam-1.8/ws/target/org.apache.sling.commons.clam-1.0.0-SNAPSHOT-sources.jar>
[INFO] 
[INFO] --- maven-site-plugin:3.5.1:attach-descriptor (attach-descriptor) @ org.apache.sling.commons.clam
---
[INFO] 
[INFO] --- ianal-maven-plugin:1.0-alpha-1:verify-legal-files (default) @ org.apache.sling.commons.clam
---
[INFO] Checking legal files in: org.apache.sling.commons.clam-1.0.0-SNAPSHOT.jar
[INFO] Checking legal files in: org.apache.sling.commons.clam-1.0.0-SNAPSHOT-sources.jar
[INFO] 
[INFO] --- apache-rat-plugin:0.11:check (default) @ org.apache.sling.commons.clam ---
[INFO] 51 implicit excludes (use -debug for more details).
[INFO] Exclude: DEPENDENCIES
[INFO] Exclude: src/main/appended-resources/META-INF/*
[INFO] Exclude: velocity.log
[INFO] Exclude: target/*
[INFO] Exclude: README.md
[INFO] Exclude: maven-eclipse.xml
[INFO] Exclude: .*
[INFO] Exclude: .*/**
[INFO] Exclude: **/*.json
[INFO] Exclude: DEPENDENCIES
[INFO] Exclude: **/*.rej
[INFO] Exclude: hs_err_*.log
[INFO] Exclude: **/repository/index/*/index-details.txt
[INFO] Exclude: bnd.bnd
[INFO] 14 resources included (use -debug for more details)
[INFO] Rat check: Summary of files. Unapproved: 1 unknown: 1 generated: 0 approved: 11 licence.
[WARNING] Attempt to (de-)serialize anonymous class hudson.maven.reporters.MavenArtifactArchiver$2;
see: https://jenkins.io/redirect/serialization-of-anonymous-classes/
[JENKINS] Archiving disabled
[WARNING] Attempt to (de-)serialize anonymous class hudson.maven.reporters.MavenFingerprinter$1;
see: https://jenkins.io/redirect/serialization-of-anonymous-classes/
[JENKINS] Archiving disabled
[INFO] ------------------------------------------------------------------------
[INFO] BUILD FAILURE
[INFO] ------------------------------------------------------------------------
[INFO] Total time: 23.285 s
[INFO] Finished at: 2018-07-03T06:22:16+00:00
[INFO] Final Memory: 46M/513M
[INFO] ------------------------------------------------------------------------
Waiting for Jenkins to finish collecting data
[ERROR] Failed to execute goal org.apache.rat:apache-rat-plugin:0.11:check (default) on project
org.apache.sling.commons.clam: Too many files with unapproved license: 1 See RAT report in:
<https://builds.apache.org/job/sling-org-apache-sling-commons-clam-1.8/ws/target/rat.txt>
-> [Help 1]
[ERROR] 
[ERROR] To see the full stack trace of the errors, re-run Maven with the -e switch.
[ERROR] Re-run Maven using the -X switch to enable full debug logging.
[ERROR] 
[ERROR] For more information about the errors and possible solutions, please read the following
articles:
[ERROR] [Help 1] http://cwiki.apache.org/confluence/display/MAVEN/MojoFailureException
channel stopped
Recording test results

Mime
View raw message