sling-commits mailing list archives

Site index · List index
Message view « Date » · « Thread »
Top « Date » · « Thread »
From Apache Jenkins Server <jenk...@builds.apache.org>
Subject Build failed in Jenkins: sling-org-apache-sling-feature-karaf-1.8 #7
Date Mon, 02 Jul 2018 22:58:46 GMT
See <https://builds.apache.org/job/sling-org-apache-sling-feature-karaf-1.8/7/display/redirect>

------------------------------------------
Started by timer
[EnvInject] - Loading node environment variables.
Building remotely on H33 (ubuntu xenial) in workspace <https://builds.apache.org/job/sling-org-apache-sling-feature-karaf-1.8/ws/>
 > git rev-parse --is-inside-work-tree # timeout=10
Fetching changes from the remote Git repository
 > git config remote.origin.url https://github.com/apache/sling-org-apache-sling-feature-karaf.git
# timeout=10
Fetching upstream changes from https://github.com/apache/sling-org-apache-sling-feature-karaf.git
 > git --version # timeout=10
 > git fetch --tags --progress https://github.com/apache/sling-org-apache-sling-feature-karaf.git
+refs/heads/*:refs/remotes/origin/*
 > git rev-parse origin/master^{commit} # timeout=10
Checking out Revision 314a27f987931869068eb5b904355cdad7796961 (origin/master)
 > git config core.sparsecheckout # timeout=10
 > git checkout -f 314a27f987931869068eb5b904355cdad7796961
Commit message: "Adding header to readme"
 > git rev-list --no-walk 314a27f987931869068eb5b904355cdad7796961 # timeout=10
Parsing POMs
Established TCP socket on 40684
maven33-agent.jar already up to date
maven33-interceptor.jar already up to date
maven3-interceptor-commons.jar already up to date
[sling-org-apache-sling-feature-karaf-1.8] $ /home/jenkins/tools/java/latest1.8/bin/java -Xmx2g
-Xms256m -cp /home/jenkins/jenkins-slave/maven33-agent.jar:/home/jenkins/tools/maven/apache-maven-3.3.9/boot/plexus-classworlds-2.5.2.jar:/home/jenkins/tools/maven/apache-maven-3.3.9/conf/logging
jenkins.maven3.agent.Maven33Main /home/jenkins/tools/maven/apache-maven-3.3.9 /home/jenkins/jenkins-slave/slave.jar
/home/jenkins/jenkins-slave/maven33-interceptor.jar /home/jenkins/jenkins-slave/maven3-interceptor-commons.jar
40684
<===[JENKINS REMOTING CAPACITY]===>   channel started
Executing Maven:  -B -f <https://builds.apache.org/job/sling-org-apache-sling-feature-karaf-1.8/ws/pom.xml>
-Dmaven.repo.local=/home/jenkins/jenkins-slave/maven-repositories/0 -U clean deploy
[INFO] Scanning for projects...
[INFO]                                                                         
[INFO] ------------------------------------------------------------------------
[INFO] Building Apache Sling Feature Karaf 0.1.0-SNAPSHOT
[INFO] ------------------------------------------------------------------------
[INFO] Downloading: http://repository.apache.org/snapshots/org/apache/sling/org.apache.sling.feature/0.1.0-SNAPSHOT/maven-metadata.xml
[INFO] Downloading: http://repository.apache.org/snapshots/org/apache/sling/org.apache.sling.feature/0.1.0-SNAPSHOT/org.apache.sling.feature-0.1.0-SNAPSHOT.pom
[WARNING] The POM for org.apache.sling:org.apache.sling.feature:jar:0.1.0-SNAPSHOT is missing,
no dependency information available
[INFO] Downloading: http://repository.apache.org/snapshots/org/apache/sling/org.apache.sling.feature.io/0.1.0-SNAPSHOT/maven-metadata.xml
[INFO] Downloading: http://repository.apache.org/snapshots/org/apache/sling/org.apache.sling.feature.io/0.1.0-SNAPSHOT/org.apache.sling.feature.io-0.1.0-SNAPSHOT.pom
[WARNING] The POM for org.apache.sling:org.apache.sling.feature.io:jar:0.1.0-SNAPSHOT is missing,
no dependency information available
[INFO] Downloading: http://repository.apache.org/snapshots/org/apache/sling/org.apache.sling.feature/0.1.0-SNAPSHOT/org.apache.sling.feature-0.1.0-SNAPSHOT.jar
[INFO] Downloading: http://repository.apache.org/snapshots/org/apache/sling/org.apache.sling.feature.io/0.1.0-SNAPSHOT/org.apache.sling.feature.io-0.1.0-SNAPSHOT.jar
[WARNING] Attempt to (de-)serialize anonymous class hudson.maven.reporters.MavenArtifactArchiver$2;
see: https://jenkins.io/redirect/serialization-of-anonymous-classes/
[JENKINS] Archiving disabled
[WARNING] Attempt to (de-)serialize anonymous class hudson.maven.reporters.MavenFingerprinter$1;
see: https://jenkins.io/redirect/serialization-of-anonymous-classes/
[JENKINS] Archiving disabled
[INFO] ------------------------------------------------------------------------
[INFO] BUILD FAILURE
[INFO] ------------------------------------------------------------------------
[INFO] Total time: 11.753 s
[INFO] Finished at: 2018-07-02T22:58:43+00:00
[INFO] Final Memory: 18M/288M
[INFO] ------------------------------------------------------------------------
Waiting for Jenkins to finish collecting data
[ERROR] Failed to execute goal on project org.apache.sling.feature.karaf: Could not resolve
dependencies for project org.apache.sling:org.apache.sling.feature.karaf:bundle:0.1.0-SNAPSHOT:
The following artifacts could not be resolved: org.apache.sling:org.apache.sling.feature:jar:0.1.0-SNAPSHOT,
org.apache.sling:org.apache.sling.feature.io:jar:0.1.0-SNAPSHOT: Could not find artifact org.apache.sling:org.apache.sling.feature:jar:0.1.0-SNAPSHOT
in Nexus (http://repository.apache.org/snapshots) -> [Help 1]
[ERROR] 
[ERROR] To see the full stack trace of the errors, re-run Maven with the -e switch.
[ERROR] Re-run Maven using the -X switch to enable full debug logging.
[ERROR] 
[ERROR] For more information about the errors and possible solutions, please read the following
articles:
[ERROR] [Help 1] http://cwiki.apache.org/confluence/display/MAVEN/DependencyResolutionException
channel stopped
Recording test results

Mime
View raw message