sling-commits mailing list archives

Site index · List index
Message view « Date » · « Thread »
Top « Date » · « Thread »
From Apache Jenkins Server <jenk...@builds.apache.org>
Subject Build failed in Jenkins: sling-org-apache-sling-app-cms-1.8 #12
Date Thu, 19 Jul 2018 00:18:56 GMT
See <https://builds.apache.org/job/sling-org-apache-sling-app-cms-1.8/12/display/redirect>

------------------------------------------
Started by timer
[EnvInject] - Loading node environment variables.
Building remotely on H27 (ubuntu xenial) in workspace <https://builds.apache.org/job/sling-org-apache-sling-app-cms-1.8/ws/>
Cloning the remote Git repository
Cloning repository https://github.com/apache/sling-org-apache-sling-app-cms.git
 > git init <https://builds.apache.org/job/sling-org-apache-sling-app-cms-1.8/ws/>
# timeout=10
Fetching upstream changes from https://github.com/apache/sling-org-apache-sling-app-cms.git
 > git --version # timeout=10
 > git fetch --tags --progress https://github.com/apache/sling-org-apache-sling-app-cms.git
+refs/heads/*:refs/remotes/origin/*
 > git config remote.origin.url https://github.com/apache/sling-org-apache-sling-app-cms.git
# timeout=10
 > git config --add remote.origin.fetch +refs/heads/*:refs/remotes/origin/* # timeout=10
 > git config remote.origin.url https://github.com/apache/sling-org-apache-sling-app-cms.git
# timeout=10
Fetching upstream changes from https://github.com/apache/sling-org-apache-sling-app-cms.git
 > git fetch --tags --progress https://github.com/apache/sling-org-apache-sling-app-cms.git
+refs/heads/*:refs/remotes/origin/*
 > git rev-parse origin/master^{commit} # timeout=10
Checking out Revision 7158c9f80c71571b0e03a596558d46a30f0a3552 (origin/master)
 > git config core.sparsecheckout # timeout=10
 > git checkout -f 7158c9f80c71571b0e03a596558d46a30f0a3552
Commit message: "Merging latest changes"
 > git rev-list --no-walk 7158c9f80c71571b0e03a596558d46a30f0a3552 # timeout=10
Parsing POMs
Established TCP socket on 37115
maven33-agent.jar already up to date
maven33-interceptor.jar already up to date
maven3-interceptor-commons.jar already up to date
[sling-org-apache-sling-app-cms-1.8] $ /home/jenkins/tools/java/latest1.8/bin/java -Xmx4g
-Xms4g -cp /home/jenkins/jenkins-slave/maven33-agent.jar:/home/jenkins/tools/maven/apache-maven-3.3.9/boot/plexus-classworlds-2.5.2.jar:/home/jenkins/tools/maven/apache-maven-3.3.9/conf/logging
jenkins.maven3.agent.Maven33Main /home/jenkins/tools/maven/apache-maven-3.3.9 /home/jenkins/jenkins-slave/slave.jar
/home/jenkins/jenkins-slave/maven33-interceptor.jar /home/jenkins/jenkins-slave/maven3-interceptor-commons.jar
37115
<===[JENKINS REMOTING CAPACITY]===>   channel started
Executing Maven:  -B -f <https://builds.apache.org/job/sling-org-apache-sling-app-cms-1.8/ws/pom.xml>
-Dmaven.repo.local=/home/jenkins/jenkins-slave/maven-repositories/0 -U clean deploy
[INFO] Scanning for projects...
[INFO] Downloading: https://repo.maven.apache.org/maven2/org/apache/sling/slingstart-maven-plugin/1.7.0/slingstart-maven-plugin-1.7.0.pom
[INFO] Downloaded: https://repo.maven.apache.org/maven2/org/apache/sling/slingstart-maven-plugin/1.7.0/slingstart-maven-plugin-1.7.0.pom
(9 KB at 20.8 KB/sec)
[INFO] Downloading: https://repo.maven.apache.org/maven2/org/apache/sling/org.apache.sling.provisioning.model/1.8.0/org.apache.sling.provisioning.model-1.8.0.pom
[INFO] Downloaded: https://repo.maven.apache.org/maven2/org/apache/sling/org.apache.sling.provisioning.model/1.8.0/org.apache.sling.provisioning.model-1.8.0.pom
(3 KB at 148.1 KB/sec)
[INFO] Downloading: https://repo.maven.apache.org/maven2/org/apache/sling/slingstart-maven-plugin/1.7.0/slingstart-maven-plugin-1.7.0.jar
[INFO] Downloading: https://repo.maven.apache.org/maven2/org/apache/sling/org.apache.sling.provisioning.model/1.8.0/org.apache.sling.provisioning.model-1.8.0.jar
[INFO] Downloaded: https://repo.maven.apache.org/maven2/org/apache/sling/org.apache.sling.provisioning.model/1.8.0/org.apache.sling.provisioning.model-1.8.0.jar
(76 KB at 1091.6 KB/sec)
[INFO] Downloaded: https://repo.maven.apache.org/maven2/org/apache/sling/slingstart-maven-plugin/1.7.0/slingstart-maven-plugin-1.7.0.jar
(107 KB at 1365.3 KB/sec)
[INFO] ------------------------------------------------------------------------
[INFO] Reactor Build Order:
[INFO] 
[INFO] Apache Sling - CMS
[INFO] Apache Sling - CMS Core
[INFO] Apache Sling - CMS UI
[INFO] Apache Sling - CMS Reference Application
[INFO] Apache Sling - CMS Application Builder
[INFO]                                                                         
[INFO] ------------------------------------------------------------------------
[INFO] Building Apache Sling - CMS 0.9.0
[INFO] ------------------------------------------------------------------------
[INFO] 
[INFO] --- maven-clean-plugin:3.0.0:clean (default-clean) @ org.apache.sling.cms ---
[INFO] 
[INFO] --- maven-enforcer-plugin:3.0.0-M1:enforce (enforce-property-values) @ org.apache.sling.cms
---
[INFO] 
[INFO] --- maven-enforcer-plugin:3.0.0-M1:enforce (enforce-java) @ org.apache.sling.cms ---
[INFO] 
[INFO] --- maven-enforcer-plugin:3.0.0-M1:enforce (ban-maven-scr-plugin) @ org.apache.sling.cms
---
[INFO] 
[INFO] --- maven-remote-resources-plugin:1.5:process (process-resource-bundles) @ org.apache.sling.cms
---
[INFO] 
[INFO] --- maven-remote-resources-plugin:1.5:process (default) @ org.apache.sling.cms ---
[INFO] 
[INFO] --- animal-sniffer-maven-plugin:1.16:check (default) @ org.apache.sling.cms ---
[INFO] Checking unresolved references to org.codehaus.mojo.signature:java17:1.0
[INFO] 
[INFO] >>> maven-source-plugin:3.0.1:jar (attach-sources) > generate-sources @
org.apache.sling.cms >>>
[INFO] 
[INFO] --- maven-enforcer-plugin:3.0.0-M1:enforce (enforce-property-values) @ org.apache.sling.cms
---
[INFO] 
[INFO] --- maven-enforcer-plugin:3.0.0-M1:enforce (enforce-java) @ org.apache.sling.cms ---
[INFO] 
[INFO] --- maven-enforcer-plugin:3.0.0-M1:enforce (ban-maven-scr-plugin) @ org.apache.sling.cms
---
[WARNING] Failed to getClass for org.apache.maven.plugins.source.SourceJarMojo
[INFO] 
[INFO] <<< maven-source-plugin:3.0.1:jar (attach-sources) < generate-sources @
org.apache.sling.cms <<<
[INFO] 
[INFO] --- maven-source-plugin:3.0.1:jar (attach-sources) @ org.apache.sling.cms ---
[INFO] 
[INFO] --- maven-site-plugin:3.5.1:attach-descriptor (attach-descriptor) @ org.apache.sling.cms
---
[INFO] 
[INFO] --- ianal-maven-plugin:1.0-alpha-1:verify-legal-files (default) @ org.apache.sling.cms
---
[INFO] 
[INFO] --- apache-rat-plugin:0.11:check (default) @ org.apache.sling.cms ---
[INFO] 55 implicit excludes (use -debug for more details).
[INFO] Exclude: DEPENDENCIES
[INFO] Exclude: src/main/appended-resources/META-INF/*
[INFO] Exclude: velocity.log
[INFO] Exclude: target/*
[INFO] Exclude: README.md
[INFO] Exclude: maven-eclipse.xml
[INFO] Exclude: .*
[INFO] Exclude: .*/**
[INFO] Exclude: **/*.json
[INFO] Exclude: DEPENDENCIES
[INFO] Exclude: **/*.rej
[INFO] Exclude: hs_err_*.log
[INFO] Exclude: **/repository/index/*/index-details.txt
[INFO] Exclude: bnd.bnd
[INFO] 61 resources included (use -debug for more details)
[INFO] Rat check: Summary of files. Unapproved: 0 unknown: 0 generated: 0 approved: 30 licence.
[INFO] 
[INFO] --- maven-install-plugin:2.5.2:install (default-install) @ org.apache.sling.cms ---
[INFO] Installing <https://builds.apache.org/job/sling-org-apache-sling-app-cms-1.8/ws/pom.xml>
to /home/jenkins/jenkins-slave/maven-repositories/0/org/apache/sling/org.apache.sling.cms/0.9.0/org.apache.sling.cms-0.9.0.pom
[INFO] 
[INFO] --- maven-deploy-plugin:2.8.2:deploy (default-deploy) @ org.apache.sling.cms ---
[INFO] Uploading: https://repository.apache.org/service/local/staging/deploy/maven2/org/apache/sling/org.apache.sling.cms/0.9.0/org.apache.sling.cms-0.9.0.pom
[WARNING] Encountered issue during deployment: Failed to deploy artifacts: Could not transfer
artifact org.apache.sling:org.apache.sling.cms:pom:0.9.0 from/to apache.releases.https (https://repository.apache.org/service/local/staging/deploy/maven2):
Failed to transfer file: https://repository.apache.org/service/local/staging/deploy/maven2/org/apache/sling/org.apache.sling.cms/0.9.0/org.apache.sling.cms-0.9.0.pom.
Return code is: 401, ReasonPhrase: Unauthorized.
[INFO] Retrying deployment attempt 2 of 10
[INFO] Uploading: https://repository.apache.org/service/local/staging/deploy/maven2/org/apache/sling/org.apache.sling.cms/0.9.0/org.apache.sling.cms-0.9.0.pom
[WARNING] Encountered issue during deployment: Failed to deploy artifacts: Could not transfer
artifact org.apache.sling:org.apache.sling.cms:pom:0.9.0 from/to apache.releases.https (https://repository.apache.org/service/local/staging/deploy/maven2):
Failed to transfer file: https://repository.apache.org/service/local/staging/deploy/maven2/org/apache/sling/org.apache.sling.cms/0.9.0/org.apache.sling.cms-0.9.0.pom.
Return code is: 401, ReasonPhrase: Unauthorized.
[INFO] Retrying deployment attempt 3 of 10
[INFO] Uploading: https://repository.apache.org/service/local/staging/deploy/maven2/org/apache/sling/org.apache.sling.cms/0.9.0/org.apache.sling.cms-0.9.0.pom
[WARNING] Encountered issue during deployment: Failed to deploy artifacts: Could not transfer
artifact org.apache.sling:org.apache.sling.cms:pom:0.9.0 from/to apache.releases.https (https://repository.apache.org/service/local/staging/deploy/maven2):
Failed to transfer file: https://repository.apache.org/service/local/staging/deploy/maven2/org/apache/sling/org.apache.sling.cms/0.9.0/org.apache.sling.cms-0.9.0.pom.
Return code is: 401, ReasonPhrase: Unauthorized.
[INFO] Retrying deployment attempt 4 of 10
[INFO] Uploading: https://repository.apache.org/service/local/staging/deploy/maven2/org/apache/sling/org.apache.sling.cms/0.9.0/org.apache.sling.cms-0.9.0.pom
[WARNING] Encountered issue during deployment: Failed to deploy artifacts: Could not transfer
artifact org.apache.sling:org.apache.sling.cms:pom:0.9.0 from/to apache.releases.https (https://repository.apache.org/service/local/staging/deploy/maven2):
Failed to transfer file: https://repository.apache.org/service/local/staging/deploy/maven2/org/apache/sling/org.apache.sling.cms/0.9.0/org.apache.sling.cms-0.9.0.pom.
Return code is: 401, ReasonPhrase: Unauthorized.
[INFO] Retrying deployment attempt 5 of 10
[INFO] Uploading: https://repository.apache.org/service/local/staging/deploy/maven2/org/apache/sling/org.apache.sling.cms/0.9.0/org.apache.sling.cms-0.9.0.pom
[WARNING] Encountered issue during deployment: Failed to deploy artifacts: Could not transfer
artifact org.apache.sling:org.apache.sling.cms:pom:0.9.0 from/to apache.releases.https (https://repository.apache.org/service/local/staging/deploy/maven2):
Failed to transfer file: https://repository.apache.org/service/local/staging/deploy/maven2/org/apache/sling/org.apache.sling.cms/0.9.0/org.apache.sling.cms-0.9.0.pom.
Return code is: 401, ReasonPhrase: Unauthorized.
[INFO] Retrying deployment attempt 6 of 10
[INFO] Uploading: https://repository.apache.org/service/local/staging/deploy/maven2/org/apache/sling/org.apache.sling.cms/0.9.0/org.apache.sling.cms-0.9.0.pom
[WARNING] Encountered issue during deployment: Failed to deploy artifacts: Could not transfer
artifact org.apache.sling:org.apache.sling.cms:pom:0.9.0 from/to apache.releases.https (https://repository.apache.org/service/local/staging/deploy/maven2):
Failed to transfer file: https://repository.apache.org/service/local/staging/deploy/maven2/org/apache/sling/org.apache.sling.cms/0.9.0/org.apache.sling.cms-0.9.0.pom.
Return code is: 401, ReasonPhrase: Unauthorized.
[INFO] Retrying deployment attempt 7 of 10
[INFO] Uploading: https://repository.apache.org/service/local/staging/deploy/maven2/org/apache/sling/org.apache.sling.cms/0.9.0/org.apache.sling.cms-0.9.0.pom
[WARNING] Encountered issue during deployment: Failed to deploy artifacts: Could not transfer
artifact org.apache.sling:org.apache.sling.cms:pom:0.9.0 from/to apache.releases.https (https://repository.apache.org/service/local/staging/deploy/maven2):
Failed to transfer file: https://repository.apache.org/service/local/staging/deploy/maven2/org/apache/sling/org.apache.sling.cms/0.9.0/org.apache.sling.cms-0.9.0.pom.
Return code is: 401, ReasonPhrase: Unauthorized.
[INFO] Retrying deployment attempt 8 of 10
[INFO] Uploading: https://repository.apache.org/service/local/staging/deploy/maven2/org/apache/sling/org.apache.sling.cms/0.9.0/org.apache.sling.cms-0.9.0.pom
[WARNING] Encountered issue during deployment: Failed to deploy artifacts: Could not transfer
artifact org.apache.sling:org.apache.sling.cms:pom:0.9.0 from/to apache.releases.https (https://repository.apache.org/service/local/staging/deploy/maven2):
Failed to transfer file: https://repository.apache.org/service/local/staging/deploy/maven2/org/apache/sling/org.apache.sling.cms/0.9.0/org.apache.sling.cms-0.9.0.pom.
Return code is: 401, ReasonPhrase: Unauthorized.
[INFO] Retrying deployment attempt 9 of 10
[INFO] Uploading: https://repository.apache.org/service/local/staging/deploy/maven2/org/apache/sling/org.apache.sling.cms/0.9.0/org.apache.sling.cms-0.9.0.pom
[WARNING] Encountered issue during deployment: Failed to deploy artifacts: Could not transfer
artifact org.apache.sling:org.apache.sling.cms:pom:0.9.0 from/to apache.releases.https (https://repository.apache.org/service/local/staging/deploy/maven2):
Failed to transfer file: https://repository.apache.org/service/local/staging/deploy/maven2/org/apache/sling/org.apache.sling.cms/0.9.0/org.apache.sling.cms-0.9.0.pom.
Return code is: 401, ReasonPhrase: Unauthorized.
[INFO] Retrying deployment attempt 10 of 10
[INFO] Uploading: https://repository.apache.org/service/local/staging/deploy/maven2/org/apache/sling/org.apache.sling.cms/0.9.0/org.apache.sling.cms-0.9.0.pom
[WARNING] Attempt to (de-)serialize anonymous class hudson.maven.reporters.MavenArtifactArchiver$2;
see: https://jenkins.io/redirect/serialization-of-anonymous-classes/
[JENKINS] Archiving disabled
[WARNING] Attempt to (de-)serialize anonymous class hudson.maven.reporters.MavenFingerprinter$1;
see: https://jenkins.io/redirect/serialization-of-anonymous-classes/
[JENKINS] Archiving disabled
[JENKINS] Archiving disabled
[JENKINS] Archiving disabled
[JENKINS] Archiving disabled
[JENKINS] Archiving disabled
[INFO] ------------------------------------------------------------------------
[INFO] Reactor Summary:
[INFO] 
[INFO] Apache Sling - CMS ................................. FAILURE [ 19.772 s]
[INFO] Apache Sling - CMS Core ............................ SKIPPED
[INFO] Apache Sling - CMS UI .............................. SKIPPED
[INFO] Apache Sling - CMS Reference Application ........... SKIPPED
[INFO] Apache Sling - CMS Application Builder ............. SKIPPED
[INFO] ------------------------------------------------------------------------
[INFO] BUILD FAILURE
[INFO] ------------------------------------------------------------------------
[INFO] Total time: 34.447 s
[INFO] Finished at: 2018-07-19T00:18:03+00:00
[INFO] Final Memory: 66M/3925M
[INFO] ------------------------------------------------------------------------
Waiting for Jenkins to finish collecting data
[ERROR] Failed to execute goal org.apache.maven.plugins:maven-deploy-plugin:2.8.2:deploy (default-deploy)
on project org.apache.sling.cms: Failed to deploy artifacts: Could not transfer artifact org.apache.sling:org.apache.sling.cms:pom:0.9.0
from/to apache.releases.https (https://repository.apache.org/service/local/staging/deploy/maven2):
Failed to transfer file: https://repository.apache.org/service/local/staging/deploy/maven2/org/apache/sling/org.apache.sling.cms/0.9.0/org.apache.sling.cms-0.9.0.pom.
Return code is: 401, ReasonPhrase: Unauthorized. -> [Help 1]
[ERROR] 
[ERROR] To see the full stack trace of the errors, re-run Maven with the -e switch.
[ERROR] Re-run Maven using the -X switch to enable full debug logging.
[ERROR] 
[ERROR] For more information about the errors and possible solutions, please read the following
articles:
[ERROR] [Help 1] http://cwiki.apache.org/confluence/display/MAVEN/MojoExecutionException
channel stopped
Recording test results

Mime
View raw message